Uploaded image for project: 'Kafka'
  1. Kafka
  2. KAFKA-2054

Fix Kafka transient unit test failures

    XMLWordPrintableJSON

    Details

    • Type: Bug
    • Status: Open
    • Priority: Major
    • Resolution: Unresolved
    • Affects Version/s: None
    • Fix Version/s: None
    • Component/s: None

      Description

      This is a cover story for various transient unit tests failures reporting and resolving.

        Attachments

        1.
        ConsumerBounceTest.testSeekAndCommitWithBrokerFailures transient failure Sub-task Resolved Fangmin Lv
        2.
        PartitionAssignorTest.testRangePartitionAssignor transient failure Sub-task Resolved Fangmin Lv
        3.
        DelayedOperationTest.testRequestExpiry transient failure Sub-task Resolved Rajini Sivaram
        4.
        ProducerTest.testSendWithDeadBroker transient failure Sub-task Resolved jin xing
        5.
        ZookeeperConsumerConnectorTest.testBasic transient failure Sub-task Resolved Unassigned
        6.
        Keep track of the transient test failure for Kafka-343 on Apache Jenkins Sub-task Resolved Yang Ye
        7.
        Transient test failures on LogTest.testCorruptLog Sub-task Resolved Parag Shah
        8.
        testUncleanLeaderElectionEnabledByTopicOverride transient failure Sub-task Resolved Parag Shah
        9.
        testRoundRobinPartitionAssignor transient failure Sub-task Closed Unassigned
        10.
        MetadataTest transient failure Sub-task Resolved Rajini Sivaram
        11.
        kafka.producer.AsyncProducerTest failure. Sub-task Resolved Ewen Cheslack-Postava
        12.
        transient unit test failure in KafkaConfigConfigDefTest.testFromPropsToProps Sub-task Resolved Jason Gustafson
        13.
        KafkaConsumer rebalance with in-flight fetch can cause invalid position Sub-task Resolved Jason Gustafson
        14.
        ProducerSendTest.testCloseWithZeroTimeoutFromCallerThread Transient Failure Sub-task Resolved Armin Braun
        15.
        Transient test failure: testGenerationIdIncrementsOnRebalance Sub-task Resolved Jason Gustafson
        16.
        Transient test failure for SocketServerTest - Socket closed. Sub-task Resolved Ewen Cheslack-Postava
        17.
        Fix transient failure of ProducerSendTest.testCloseWithZeroTimeoutFromSenderThread() Sub-task Resolved Jiangjie Qin
        18.
        Transient failure in LogRecoveryTest.testHWCheckpointWithFailuresMultipleLogSegments Sub-task Resolved Jiangjie Qin
        19.
        ServerShutdownTest is failing intermittently Sub-task Resolved Flavio Paiva Junqueira
        20.
        Transient test failure: `SimpleAclAuthorizerTest` Sub-task Resolved Parth Brahmbhatt
        21.
        Consider capping `maxParallelForks` for Jenkins builds Sub-task Resolved Ewen Cheslack-Postava
        22.
        Test Failure: kafka.consumer.MetricsTest > testMetricsLeak Sub-task Resolved jin xing
        23.
        Copycat KafkaBasedLogTest.testSendAndReadToEnd transient failure Sub-task Resolved Ewen Cheslack-Postava
        24.
        FAILING TEST: kafka.api.ProducerBounceTest > testBrokerFailure Sub-task Resolved jin xing
        25.
        FAILING TEST: SaslSslTopicMetadataTest Sub-task Resolved Bill Bejeck
        26.
        FAILING TEST: LogCleaner Sub-task Resolved jin xing
        27.
        Kafka connect log test failing Sub-task Resolved jin xing
        28.
        Reuse of temporary server data.dir could lead to transient failures. Sub-task Resolved Unassigned
        29.
        Reuse of temporary directories leading to transient unit test failures Sub-task Resolved Rajini Sivaram
        30.
        o.a.k.connect.util.KafkaBasedLogTest failure in 0.9 RC4 Sub-task Resolved Unassigned
        31.
        Failure in kafka.api.SslEndToEndAuthorizationTest.testNoGroupAcl Sub-task Resolved Rajini Sivaram
        32.
        Failure in kafka.api.PlaintextConsumerTest.testMultiConsumerDefaultAssignment Sub-task Reopened Jason Gustafson
        33.
        Transient Failure in kafka.producer.SyncProducerTest.testReachableServer Sub-task Resolved Unassigned
        34.
        Transient Failure in kafka.log.LogCleanerIntegrationTest.cleanerTest Sub-task Resolved jin xing
        35.
        Transient Failure due to BindException: Address already in use Sub-task Resolved Unassigned
        36.
        Transient Failure in kafka.api.SaslPlaintextConsumerTest Sub-task Resolved Unassigned
        37.
        kafka.api.PlaintextConsumerTest > testSeek FAILED Sub-task Open Unassigned
        38.
        Transient: kafka.api.PlaintextConsumerTest > testAutoOffsetReset FAILED Sub-task Open Liquan Pei
        39.
        LogRecoveryTest exits with -1 occasionally Sub-task Resolved Ismael Juma
        40.
        Transient Failure in kafka.integration.PlaintextTopicMetadataTest.testIsrAfterBrokerShutDownAndJoinsBack Sub-task Reopened Denise Fernandez
        41.
        Transient Failure in kafka.api.PlaintextProducerSendTest.testFlush Sub-task Resolved Armin Braun
        42.
        Failure in kafka.integration.PrimitiveApiTest.testPipelinedProduceRequests Sub-task Open Parag Shah
        43.
        Failure in kafka.network.SocketServerTest.testSocketsCloseOnShutdown Sub-task Resolved Armin Braun
        44.
        Failure in kafka.server.ClientQuotaManagerTest.testQuotaViolation Sub-task Open Unassigned
        45.
        SslProducerSendTest transient failure. Sub-task Resolved Unassigned
        46.
        Transient Failure in kafka.producer.SyncProducerTest.testProduceCorrectlyReceivesResponse Sub-task Reopened Unassigned
        47.
        WorkerSourceTask testCommit transient failure Sub-task Resolved Ewen Cheslack-Postava
        48.
        Transient failure in OffsetCommitTest.testNonExistingTopicOffsetCommit Sub-task Open Unassigned
        49.
        Transient failure in SslConsumerTest.testListTopics Sub-task Resolved Unassigned
        50.
        Transient failure in kafka.api.SslConsumerTest.testSimpleConsumption Sub-task Resolved Unassigned
        51.
        Transient failure in kafka.security.auth.SimpleAclAuthorizerTest.testHighConcurrencyModificationOfResourceAcls Sub-task Resolved Unassigned
        52.
        Transient kafka.api.PlaintextConsumerTest.testAsyncCommit failures Sub-task Resolved Jason Gustafson
        53.
        Build is killed during kafka streams tests due to `pure virtual method called` error Sub-task Resolved Unassigned
        54.
        Fail test at: PlaintextConsumerTest. testAutoCommitOnRebalance Sub-task Resolved Jason Gustafson
        55.
        QuotasTest should not fail when cpu is busy Sub-task Resolved Aditya Auradkar
        56.
        Transient failure in testGetAllTopicMetadata Sub-task Open Liquan Pei
        57.
        Failure in kafka.network.SocketServerTest.tooBigRequestIsRejecte Sub-task Resolved Rajini Sivaram
        58.
        Fix stream integration test timeouts Sub-task Resolved Eno Thereska
        59.
        Transient failures in org.apache.kafka.connect.runtime.WorkerSourceTaskTest.testSlowTaskStart Sub-task Resolved Jason Gustafson
        60.
        Transient test failure: SslConsumerTest.testSimpleConsumption Sub-task Open Unassigned
        61.
        OOM while running Kafka Streams integration tests Sub-task Resolved Eno Thereska
        62.
        Gradle Test Executor non-zero exit code when running streams tests Sub-task Resolved Damian Guy
        63.
        Transient test failure: org.apache.kafka.streams.integration.JoinIntegrationTest.shouldCountClicksPerRegion Sub-task Resolved Damian Guy
        64.
        Transient test failure: kafka.api.SslProducerSendTest.testSendNonCompressedMessageWithCreateTime Sub-task Resolved Jun Rao
        65.
        Transient test failure: kafka.api.PlaintextConsumerTest.testExpandingTopicSubscriptions Sub-task Open Unassigned
        66.
        Gradle compiler daemon exits with non-zero exit code while running LogOffsetTest Sub-task Open Unassigned
        67.
        KGroupedStreamIntegrationTest.shouldAggregate seems to be hanging Sub-task Resolved Guozhang Wang
        68.
        Integration failures on low-end machines Sub-task Resolved Guozhang Wang
        69.
        Transient failures in org.apache.kafka.streams.integration.RegexSourceIntegrationTest Sub-task Resolved Bill Bejeck
        70.
        kafka.api.PlaintextConsumerTest.testPatternUnsubscription transient failure Sub-task Resolved Vahid Hashemian
        71.
        Transient failure in DeleteTopicsRequestTest.testErrorDeleteTopicRequests Sub-task Resolved Grant Henke
        72.
        Transient failure in RegexSourceIntegrationTest.testRegexMatchesTopicsAWhenDeleted Sub-task Resolved Guozhang Wang
        73.
        Failure in org.apache.kafka.streams.integration.ResetIntegrationTest.testReprocessingFromScratchAfterReset Sub-task Resolved Matthias J. Sax
        74.
        Failure in SaslSslTopicMetadataTest.testIsrAfterBrokerShutDownAndJoinsBack Sub-task Resolved Unassigned
        75.
        Transient failure in kafka.server.SaslSslReplicaFetchTest.testReplicaFetcherThread Sub-task Open Unassigned
        76.
        Transient failure in ConsumerCoordinatorTest.testAutoCommitDynamicAssignment Sub-task Resolved Jason Gustafson
        77.
        Transient failure in KStreamAggregationIntegrationTest Sub-task Resolved Matthias J. Sax
        78.
        Transient test failure: DeleteConsumerGroupTest.testConsumptionOnRecreatedTopicAfterTopicWideDeleteInZK Sub-task Resolved Unassigned
        79.
        Transient test failure: ConsumerBounceTest.testConsumptionWithBrokerFailures Sub-task Resolved Armin Braun
        80.
        kafka.api.UserQuotaTest.testThrottledProducerConsumer transient unit test failure Sub-task Resolved Unassigned
        81.
        Failure in org.apache.kafka.streams.integration.ResetIntegrationTest.testReprocessingFromScratchAfterReset Sub-task Resolved Matthias J. Sax
        82.
        Failure in kafka.producer.ProducerTest.testAsyncSendCanCorrectlyFailWithTimeout Sub-task Resolved Ismael Juma
        83.
        current trunk unstable Sub-task Resolved Unassigned
        84.
        Transient failure in org.apache.kafka.clients.consumer.KafkaConsumerTest.testWakeupWithFetchDataAvailable Sub-task Resolved Umesh Chaudhary
        85.
        KafkaConsumerTest.testGracefulClose transient failure Sub-task Reopened Rajini Sivaram
        86.
        Unstable test KStreamRepartitionJoinTest.shouldCorrectlyRepartitionOnJoinOperations Sub-task Resolved Guozhang Wang
        87.
        Flaky Test QueryableStateIntegrationTest.queryOnRebalance Sub-task Reopened Unassigned
        88.
        QueryableStateIntegrationTest.shouldNotMakeStoreAvailableUntilAllStoresAvailable is occasionally failing on jenkins Sub-task Resolved Damian Guy
        89.
        Transient test failures for kafka.admin.DeleteTopicTest.testPartitionReassignmentDuringDeleteTopic Bug Resolved Harsha
        90.
        Transient test failure in org.apache.kafka.streams.integration.KStreamAggregationDedupIntegrationTest Sub-task Resolved Unassigned
        91.
        Transient test failure: ConsumerCoordinatorTest.testHeartbeatThreadClose Sub-task Resolved Rajini Sivaram
        92.
        Transient test failure (part 2): ConsumerBounceTest.testConsumptionWithBrokerFailures Sub-task In Progress Unassigned
        93.
        Transient unit test failure in AbstractCoordinatorTest Sub-task Resolved Unassigned
        94.
        Transient test failure: org.apache.kafka.streams.integration.JoinIntegrationTest.shouldCountClicksPerRegion (again) Sub-task Resolved Armin Braun
        95.
        Failure in kafka.admin.DescribeConsumerGroupTest.testDescribeExistingGroupWithNoMembersWithNewConsumer Sub-task Resolved Rajini Sivaram
        96.
        Transient failure of AdminClientTest.testDeleteRecordsWithException Sub-task Resolved Dong Lin
        97.
        shouldInnerLeftJoin unit test fails Sub-task Resolved Armin Braun
        98.
        Transient failure: ControllerIntegrationTest.testPreferredReplicaLeaderElection Sub-task Resolved Onur Karaman
        99.
        Transient failure: ControllerIntegrationTest.testControllerMoveIncrementsControllerEpoch Sub-task Resolved Onur Karaman
        100.
        Transient failure: RequestQuotaTest.testResponseThrottleTime Sub-task Resolved Rajini Sivaram
        101.
        Transient failure: ReassignPartitionsClusterTest.shouldChangeThrottleOnRerunAndRemoveOnVerify Sub-task Open Unassigned
        102.
        Transient failure: MultipleListenersWithAdditionalJaasContextTest.testProduceConsume Sub-task Resolved Balint Molnar
        103.
        Transient failure: kafka.api.SaslScramSslEndToEndAuthorizationTest.testNoConsumeWithDescribeAclViaSubscribe Sub-task Resolved Unassigned
        104.
        Transient failure: kafka.server.MetadataRequestTest.testControllerId Sub-task Open Umesh Chaudhary
        105.
        SaslScramSslEndToEndAuthorizationTest.testNoConsumeWithoutDescribeAclViaSubscribe Sub-task Resolved Rajini Sivaram
        106.
        kafka.api.SslProducerSendTest.testSendToPartition transient failure Sub-task Open Unassigned
        107.
        LogRecoveryTest.testHWCheckpointWithFailuresSingleLogSegment transient failure Sub-task Open Unassigned
        108.
        Transient failure: AuthorizerIntegrationTest.testTransactionalProducerTopicAuthorizationExceptionInCommit Sub-task Open Unassigned
        109.
        Transient failure in kafka.api.SaslScramSslEndToEndAuthorizationTest.testTwoConsumersWithDifferentSaslCredentials Sub-task Resolved Jason Gustafson
        110.
        [deleted] ConsumerBounceTest.testClose transient failure Sub-task Closed Unassigned

          Activity

            People

            • Assignee:
              Unassigned
              Reporter:
              guozhang Guozhang Wang
            • Votes:
              0 Vote for this issue
              Watchers:
              4 Start watching this issue

              Dates

              • Created:
                Updated: