Uploaded image for project: 'Kafka'
  1. Kafka
  2. KAFKA-2054 Fix Kafka transient unit test failures
  3. KAFKA-5208

Transient failure: kafka.api.SaslScramSslEndToEndAuthorizationTest.testNoConsumeWithDescribeAclViaSubscribe

    XMLWordPrintableJSON

    Details

    • Type: Sub-task
    • Status: Resolved
    • Priority: Major
    • Resolution: Duplicate
    • Affects Version/s: None
    • Fix Version/s: None
    • Component/s: None
    • Labels:
      None

      Description

      See this a couple of times since this week:

      Stacktrace
      
      java.lang.SecurityException: zookeeper.set.acl is true, but the verification of the JAAS login file failed.
      	at kafka.server.KafkaServer.initZk(KafkaServer.scala:322)
      	at kafka.server.KafkaServer.startup(KafkaServer.scala:190)
      	at kafka.utils.TestUtils$.createServer(TestUtils.scala:126)
      	at kafka.integration.KafkaServerTestHarness$$anonfun$setUp$1.apply(KafkaServerTestHarness.scala:91)
      	at kafka.integration.KafkaServerTestHarness$$anonfun$setUp$1.apply(KafkaServerTestHarness.scala:91)
      	at scala.collection.TraversableLike$$anonfun$map$1.apply(TraversableLike.scala:244)
      	at scala.collection.TraversableLike$$anonfun$map$1.apply(TraversableLike.scala:244)
      	at scala.collection.Iterator$class.foreach(Iterator.scala:727)
      	at scala.collection.AbstractIterator.foreach(Iterator.scala:1157)
      	at scala.collection.IterableLike$class.foreach(IterableLike.scala:72)
      	at scala.collection.AbstractIterable.foreach(Iterable.scala:54)
      	at scala.collection.TraversableLike$class.map(TraversableLike.scala:244)
      	at scala.collection.AbstractTraversable.map(Traversable.scala:105)
      	at kafka.integration.KafkaServerTestHarness.setUp(KafkaServerTestHarness.scala:91)
      	at kafka.api.IntegrationTestHarness.setUp(IntegrationTestHarness.scala:65)
      	at kafka.api.EndToEndAuthorizationTest.setUp(EndToEndAuthorizationTest.scala:158)
      	at kafka.api.SaslEndToEndAuthorizationTest.setUp(SaslEndToEndAuthorizationTest.scala:41)
      	at kafka.api.SaslScramSslEndToEndAuthorizationTest.setUp(SaslScramSslEndToEndAuthorizationTest.scala:43)
      	at sun.reflect.NativeMethodAccessorImpl.invoke0(Native Method)
      	at sun.reflect.NativeMethodAccessorImpl.invoke(NativeMethodAccessorImpl.java:57)
      	at sun.reflect.DelegatingMethodAccessorImpl.invoke(DelegatingMethodAccessorImpl.java:43)
      	at java.lang.reflect.Method.invoke(Method.java:606)
      	at org.junit.runners.model.FrameworkMethod$1.runReflectiveCall(FrameworkMethod.java:50)
      	at org.junit.internal.runners.model.ReflectiveCallable.run(ReflectiveCallable.java:12)
      	at org.junit.runners.model.FrameworkMethod.invokeExplosively(FrameworkMethod.java:47)
      	at org.junit.internal.runners.statements.RunBefores.evaluate(RunBefores.java:24)
      	at org.junit.internal.runners.statements.RunAfters.evaluate(RunAfters.java:27)
      	at org.junit.runners.ParentRunner.runLeaf(ParentRunner.java:325)
      	at org.junit.runners.BlockJUnit4ClassRunner.runChild(BlockJUnit4ClassRunner.java:78)
      	at org.junit.runners.BlockJUnit4ClassRunner.runChild(BlockJUnit4ClassRunner.java:57)
      	at org.junit.runners.ParentRunner$3.run(ParentRunner.java:290)
      	at org.junit.runners.ParentRunner$1.schedule(ParentRunner.java:71)
      	at org.junit.runners.ParentRunner.runChildren(ParentRunner.java:288)
      	at org.junit.runners.ParentRunner.access$000(ParentRunner.java:58)
      	at org.junit.runners.ParentRunner$2.evaluate(ParentRunner.java:268)
      	at org.junit.runners.ParentRunner.run(ParentRunner.java:363)
      	at org.gradle.api.internal.tasks.testing.junit.JUnitTestClassExecuter.runTestClass(JUnitTestClassExecuter.java:114)
      	at org.gradle.api.internal.tasks.testing.junit.JUnitTestClassExecuter.execute(JUnitTestClassExecuter.java:57)
      	at org.gradle.api.internal.tasks.testing.junit.JUnitTestClassProcessor.processTestClass(JUnitTestClassProcessor.java:66)
      	at org.gradle.api.internal.tasks.testing.SuiteTestClassProcessor.processTestClass(SuiteTestClassProcessor.java:51)
      	at sun.reflect.GeneratedMethodAccessor44.invoke(Unknown Source)
      	at sun.reflect.DelegatingMethodAccessorImpl.invoke(DelegatingMethodAccessorImpl.java:43)
      	at java.lang.reflect.Method.invoke(Method.java:606)
      	at org.gradle.internal.dispatch.ReflectionDispatch.dispatch(ReflectionDispatch.java:35)
      	at org.gradle.internal.dispatch.ReflectionDispatch.dispatch(ReflectionDispatch.java:24)
      	at org.gradle.internal.dispatch.ContextClassLoaderDispatch.dispatch(ContextClassLoaderDispatch.java:32)
      	at org.gradle.internal.dispatch.ProxyDispatchAdapter$DispatchingInvocationHandler.invoke(ProxyDispatchAdapter.java:93)
      	at com.sun.proxy.$Proxy2.processTestClass(Unknown Source)
      	at org.gradle.api.internal.tasks.testing.worker.TestWorker.processTestClass(TestWorker.java:109)
      	at sun.reflect.GeneratedMethodAccessor43.invoke(Unknown Source)
      	at sun.reflect.DelegatingMethodAccessorImpl.invoke(DelegatingMethodAccessorImpl.java:43)
      	at java.lang.reflect.Method.invoke(Method.java:606)
      	at org.gradle.internal.dispatch.ReflectionDispatch.dispatch(ReflectionDispatch.java:35)
      	at org.gradle.internal.dispatch.ReflectionDispatch.dispatch(ReflectionDispatch.java:24)
      	at org.gradle.internal.remote.internal.hub.MessageHubBackedObjectConnection$DispatchWrapper.dispatch(MessageHubBackedObjectConnection.java:147)
      	at org.gradle.internal.remote.internal.hub.MessageHubBackedObjectConnection$DispatchWrapper.dispatch(MessageHubBackedObjectConnection.java:129)
      	at org.gradle.internal.remote.internal.hub.MessageHub$Handler.run(MessageHub.java:404)
      	at org.gradle.internal.concurrent.ExecutorPolicy$CatchAndRecordFailures.onExecute(ExecutorPolicy.java:63)
      	at org.gradle.internal.concurrent.StoppableExecutorImpl$1.run(StoppableExecutorImpl.java:46)
      	at java.util.concurrent.ThreadPoolExecutor.runWorker(ThreadPoolExecutor.java:1145)
      	at java.util.concurrent.ThreadPoolExecutor$Worker.run(ThreadPoolExecutor.java:615)
      	at java.lang.Thread.run(Thread.java:745)
      Standard Output
      
      [2017-05-09 17:36:31,197] WARN Session 0x15bee1ebdb30001 for server null, unexpected error, closing socket connection and attempting reconnect (org.apache.zookeeper.ClientCnxn:1162)
      java.net.ConnectException: Connection refused
      	at sun.nio.ch.SocketChannelImpl.checkConnect(Native Method)
      	at sun.nio.ch.SocketChannelImpl.finishConnect(SocketChannelImpl.java:744)
      	at org.apache.zookeeper.ClientCnxnSocketNIO.doTransport(ClientCnxnSocketNIO.java:361)
      	at org.apache.zookeeper.ClientCnxn$SendThread.run(ClientCnxn.java:1141)
      [2017-05-09 17:36:31,206] ERROR ZKShutdownHandler is not registered, so ZooKeeper server won't take any action on ERROR or SHUTDOWN server state changes (org.apache.zookeeper.server.ZooKeeperServer:472)
      [2017-05-09 17:36:31,493] WARN Session 0x15bee2b45e70002 for server null, unexpected error, closing socket connection and attempting reconnect (org.apache.zookeeper.ClientCnxn:1162)
      java.net.ConnectException: Connection refused
      	at sun.nio.ch.SocketChannelImpl.checkConnect(Native Method)
      	at sun.nio.ch.SocketChannelImpl.finishConnect(SocketChannelImpl.java:744)
      	at org.apache.zookeeper.ClientCnxnSocketNIO.doTransport(ClientCnxnSocketNIO.java:361)
      	at org.apache.zookeeper.ClientCnxn$SendThread.run(ClientCnxn.java:1141)
      [2017-05-09 17:36:31,774] WARN Session 0x15bee1efcad0001 for server null, unexpected error, closing socket connection and attempting reconnect (org.apache.zookeeper.ClientCnxn:1162)
      java.net.ConnectException: Connection refused
      	at sun.nio.ch.SocketChannelImpl.checkConnect(Native Method)
      	at sun.nio.ch.SocketChannelImpl.finishConnect(SocketChannelImpl.java:744)
      	at org.apache.zookeeper.ClientCnxnSocketNIO.doTransport(ClientCnxnSocketNIO.java:361)
      	at org.apache.zookeeper.ClientCnxn$SendThread.run(ClientCnxn.java:1141)
      Adding ACLs for resource `Cluster:kafka-cluster`: 
       	User:scram-admin has Allow permission for operations: ClusterAction from hosts: * 
      
      Current ACLs for resource `Cluster:kafka-cluster`: 
       	User:scram-admin has Allow permission for operations: ClusterAction from hosts: * 
      
      [2017-05-09 17:36:31,934] WARN Session 0x15bee1efcad0002 for server null, unexpected error, closing socket connection and attempting reconnect (org.apache.zookeeper.ClientCnxn:1162)
      java.net.ConnectException: Connection refused
      	at sun.nio.ch.SocketChannelImpl.checkConnect(Native Method)
      	at sun.nio.ch.SocketChannelImpl.finishConnect(SocketChannelImpl.java:744)
      	at org.apache.zookeeper.ClientCnxnSocketNIO.doTransport(ClientCnxnSocketNIO.java:361)
      	at org.apache.zookeeper.ClientCnxn$SendThread.run(ClientCnxn.java:1141)
      Completed Updating config for entity: user-principal 'scram-admin'.
      [2017-05-09 17:36:32,038] WARN Session 0x15bee1ebdb30002 for server null, unexpected error, closing socket connection and attempting reconnect (org.apache.zookeeper.ClientCnxn:1162)
      java.net.ConnectException: Connection refused
      	at sun.nio.ch.SocketChannelImpl.checkConnect(Native Method)
      	at sun.nio.ch.SocketChannelImpl.finishConnect(SocketChannelImpl.java:744)
      	at org.apache.zookeeper.ClientCnxnSocketNIO.doTransport(ClientCnxnSocketNIO.java:361)
      	at org.apache.zookeeper.ClientCnxn$SendThread.run(ClientCnxn.java:1141)
      [2017-05-09 17:36:32,771] WARN Session 0x15bee2b45e70002 for server null, unexpected error, closing socket connection and attempting reconnect (org.apache.zookeeper.ClientCnxn:1162)
      java.net.ConnectException: Connection refused
      	at sun.nio.ch.SocketChannelImpl.checkConnect(Native Method)
      	at sun.nio.ch.SocketChannelImpl.finishConnect(SocketChannelImpl.java:744)
      	at org.apache.zookeeper.ClientCnxnSocketNIO.doTransport(ClientCnxnSocketNIO.java:361)
      	at org.apache.zookeeper.ClientCnxn$SendThread.run(ClientCnxn.java:1141)
      [2017-05-09 17:36:33,157] WARN Session 0x15bee1ebdb30001 for server null, unexpected error, closing socket connection and attempting reconnect (org.apache.zookeeper.ClientCnxn:1162)
      java.net.ConnectException: Connection refused
      	at sun.nio.ch.SocketChannelImpl.checkConnect(Native Method)
      	at sun.nio.ch.SocketChannelImpl.finishConnect(SocketChannelImpl.java:744)
      	at org.apache.zookeeper.ClientCnxnSocketNIO.doTransport(ClientCnxnSocketNIO.java:361)
      	at org.apache.zookeeper.ClientCnxn$SendThread.run(ClientCnxn.java:1141)
      [2017-05-09 17:36:33,328] WARN Session 0x15bee1efcad0001 for server null, unexpected error, closing socket connection and attempting reconnect (org.apache.zookeeper.ClientCnxn:1162)
      java.net.ConnectException: Connection refused
      	at sun.nio.ch.SocketChannelImpl.checkConnect(Native Method)
      	at sun.nio.ch.SocketChannelImpl.finishConnect(SocketChannelImpl.java:744)
      	at org.apache.zookeeper.ClientCnxnSocketNIO.doTransport(ClientCnxnSocketNIO.java:361)
      	at org.apache.zookeeper.ClientCnxn$SendThread.run(ClientCnxn.java:1141)
      [2017-05-09 17:36:33,421] WARN Session 0x15bee1efcad0002 for server null, unexpected error, closing socket connection and attempting reconnect (org.apache.zookeeper.ClientCnxn:1162)
      java.net.ConnectException: Connection refused
      	at sun.nio.ch.SocketChannelImpl.checkConnect(Native Method)
      	at sun.nio.ch.SocketChannelImpl.finishConnect(SocketChannelImpl.java:744)
      	at org.apache.zookeeper.ClientCnxnSocketNIO.doTransport(ClientCnxnSocketNIO.java:361)
      	at org.apache.zookeeper.ClientCnxn$SendThread.run(ClientCnxn.java:1141)
      [2017-05-09 17:36:33,552] ERROR [ReplicaFetcherThread-0-2]: Error for partition [__consumer_offsets,0] to broker 2:org.apache.kafka.common.errors.UnknownTopicOrPartitionException: This server does not host this topic-partition. (kafka.server.ReplicaFetcherThread:99)
      [2017-05-09 17:36:33,561] ERROR [ReplicaFetcherThread-0-2]: Error for partition [__consumer_offsets,0] to broker 2:org.apache.kafka.common.errors.UnknownTopicOrPartitionException: This server does not host this topic-partition. (kafka.server.ReplicaFetcherThread:99)
      Adding ACLs for resource `Topic:*`: 
       	User:scram-admin has Allow permission for operations: Read from hosts: * 
      
      Current ACLs for resource `Topic:*`: 
       	User:scram-admin has Allow permission for operations: Read from hosts: * 
      

        Attachments

          Activity

            People

            • Assignee:
              Unassigned
              Reporter:
              guozhang Guozhang Wang
            • Votes:
              0 Vote for this issue
              Watchers:
              2 Start watching this issue

              Dates

              • Created:
                Updated:
                Resolved: