Uploaded image for project: 'Kafka'
  1. Kafka
  2. KAFKA-2054 Fix Kafka transient unit test failures
  3. KAFKA-3877

Gradle compiler daemon exits with non-zero exit code while running LogOffsetTest

    XMLWordPrintableJSON

    Details

      Description

      This happened in a recent build:

      kafka.server.LogOffsetTest > testGetOffsetsBeforeNow STARTED
      :kafka-trunk-jdk8:core:test FAILED
      :test_core_2_11 FAILED
      
      FAILURE: Build failed with an exception.
      
      * What went wrong:
      Execution failed for task ':test_core_2_11'.
      > Process 'Gradle Compiler Daemon 1' finished with non-zero exit value 137
      

      https://builds.apache.org/job/kafka-trunk-jdk8/702

        Attachments

          Activity

            People

            • Assignee:
              Unassigned
              Reporter:
              ijuma Ismael Juma
            • Votes:
              0 Vote for this issue
              Watchers:
              5 Start watching this issue

              Dates

              • Created:
                Updated: