Uploaded image for project: 'Kafka'
  1. Kafka
  2. KAFKA-2054 Fix Kafka transient unit test failures
  3. KAFKA-4583

KafkaConsumerTest.testGracefulClose transient failure

    XMLWordPrintableJSON

    Details

      Description

      Looks like a thread-safety issue.

      java.util.concurrent.ExecutionException: org.apache.kafka.common.KafkaException: Failed to close kafka consumer
      	at java.util.concurrent.FutureTask.report(FutureTask.java:122)
      	at java.util.concurrent.FutureTask.get(FutureTask.java:202)
      	at org.apache.kafka.clients.consumer.KafkaConsumerTest.consumerCloseTest(KafkaConsumerTest.java:1190)
      	at org.apache.kafka.clients.consumer.KafkaConsumerTest.testGracefulClose(KafkaConsumerTest.java:1126)
      	at sun.reflect.NativeMethodAccessorImpl.invoke0(Native Method)
      	at sun.reflect.NativeMethodAccessorImpl.invoke(NativeMethodAccessorImpl.java:57)
      	at sun.reflect.DelegatingMethodAccessorImpl.invoke(DelegatingMethodAccessorImpl.java:43)
      	at java.lang.reflect.Method.invoke(Method.java:606)
      	at org.junit.runners.model.FrameworkMethod$1.runReflectiveCall(FrameworkMethod.java:50)
      	at org.junit.internal.runners.model.ReflectiveCallable.run(ReflectiveCallable.java:12)
      	at org.junit.runners.model.FrameworkMethod.invokeExplosively(FrameworkMethod.java:47)
      	at org.junit.internal.runners.statements.InvokeMethod.evaluate(InvokeMethod.java:17)
      	at org.junit.rules.ExpectedException$ExpectedExceptionStatement.evaluate(ExpectedException.java:239)
      	at org.junit.rules.RunRules.evaluate(RunRules.java:20)
      	at org.junit.runners.ParentRunner.runLeaf(ParentRunner.java:325)
      	at org.junit.runners.BlockJUnit4ClassRunner.runChild(BlockJUnit4ClassRunner.java:78)
      	at org.junit.runners.BlockJUnit4ClassRunner.runChild(BlockJUnit4ClassRunner.java:57)
      	at org.junit.runners.ParentRunner$3.run(ParentRunner.java:290)
      	at org.junit.runners.ParentRunner$1.schedule(ParentRunner.java:71)
      	at org.junit.runners.ParentRunner.runChildren(ParentRunner.java:288)
      	at org.junit.runners.ParentRunner.access$000(ParentRunner.java:58)
      	at org.junit.runners.ParentRunner$2.evaluate(ParentRunner.java:268)
      	at org.junit.runners.ParentRunner.run(ParentRunner.java:363)
      	at org.gradle.api.internal.tasks.testing.junit.JUnitTestClassExecuter.runTestClass(JUnitTestClassExecuter.java:114)
      	at org.gradle.api.internal.tasks.testing.junit.JUnitTestClassExecuter.execute(JUnitTestClassExecuter.java:57)
      	at org.gradle.api.internal.tasks.testing.junit.JUnitTestClassProcessor.processTestClass(JUnitTestClassProcessor.java:66)
      	at org.gradle.api.internal.tasks.testing.SuiteTestClassProcessor.processTestClass(SuiteTestClassProcessor.java:51)
      	at sun.reflect.NativeMethodAccessorImpl.invoke0(Native Method)
      	at sun.reflect.NativeMethodAccessorImpl.invoke(NativeMethodAccessorImpl.java:57)
      	at sun.reflect.DelegatingMethodAccessorImpl.invoke(DelegatingMethodAccessorImpl.java:43)
      	at java.lang.reflect.Method.invoke(Method.java:606)
      	at org.gradle.internal.dispatch.ReflectionDispatch.dispatch(ReflectionDispatch.java:35)
      	at org.gradle.internal.dispatch.ReflectionDispatch.dispatch(ReflectionDispatch.java:24)
      	at org.gradle.internal.dispatch.ContextClassLoaderDispatch.dispatch(ContextClassLoaderDispatch.java:32)
      	at org.gradle.internal.dispatch.ProxyDispatchAdapter$DispatchingInvocationHandler.invoke(ProxyDispatchAdapter.java:93)
      	at com.sun.proxy.$Proxy2.processTestClass(Unknown Source)
      	at org.gradle.api.internal.tasks.testing.worker.TestWorker.processTestClass(TestWorker.java:109)
      	at sun.reflect.NativeMethodAccessorImpl.invoke0(Native Method)
      	at sun.reflect.NativeMethodAccessorImpl.invoke(NativeMethodAccessorImpl.java:57)
      	at sun.reflect.DelegatingMethodAccessorImpl.invoke(DelegatingMethodAccessorImpl.java:43)
      	at java.lang.reflect.Method.invoke(Method.java:606)
      	at org.gradle.internal.dispatch.ReflectionDispatch.dispatch(ReflectionDispatch.java:35)
      	at org.gradle.internal.dispatch.ReflectionDispatch.dispatch(ReflectionDispatch.java:24)
      	at org.gradle.internal.remote.internal.hub.MessageHub$Handler.run(MessageHub.java:377)
      	at org.gradle.internal.concurrent.ExecutorPolicy$CatchAndRecordFailures.onExecute(ExecutorPolicy.java:54)
      	at org.gradle.internal.concurrent.StoppableExecutorImpl$1.run(StoppableExecutorImpl.java:40)
      	at java.util.concurrent.ThreadPoolExecutor.runWorker(ThreadPoolExecutor.java:1145)
      	at java.util.concurrent.ThreadPoolExecutor$Worker.run(ThreadPoolExecutor.java:615)
      	at java.lang.Thread.run(Thread.java:745)
      Caused by: org.apache.kafka.common.KafkaException: Failed to close kafka consumer
      	at org.apache.kafka.clients.consumer.KafkaConsumer.close(KafkaConsumer.java:1553)
      	at org.apache.kafka.clients.consumer.KafkaConsumer.close(KafkaConsumer.java:1510)
      	at org.apache.kafka.clients.consumer.KafkaConsumerTest$1.run(KafkaConsumerTest.java:1170)
      	at java.util.concurrent.Executors$RunnableAdapter.call(Executors.java:471)
      	at java.util.concurrent.FutureTask.run(FutureTask.java:262)
      	... 3 more
      Caused by: java.lang.ArrayIndexOutOfBoundsException
      	at java.lang.System.arraycopy(Native Method)
      	at java.util.ArrayDeque.copyElements(ArrayDeque.java:172)
      	at java.util.ArrayDeque.toArray(ArrayDeque.java:756)
      	at java.util.ArrayList.<init>(ArrayList.java:164)
      	at org.apache.kafka.clients.MockClient.poll(MockClient.java:161)
      	at org.apache.kafka.clients.consumer.internals.ConsumerNetworkClient.poll(ConsumerNetworkClient.java:235)
      	at org.apache.kafka.clients.consumer.internals.ConsumerNetworkClient.poll(ConsumerNetworkClient.java:212)
      	at org.apache.kafka.clients.consumer.internals.ConsumerCoordinator.close(ConsumerCoordinator.java:417)
      	at org.apache.kafka.clients.ClientUtils.closeQuietly(ClientUtils.java:72)
      	at org.apache.kafka.clients.consumer.KafkaConsumer.close(KafkaConsumer.java:1540)
      	... 7 more
      

        Attachments

          Activity

            People

            • Assignee:
              rsivaram Rajini Sivaram
              Reporter:
              ijuma Ismael Juma
            • Votes:
              0 Vote for this issue
              Watchers:
              3 Start watching this issue

              Dates

              • Created:
                Updated: