Uploaded image for project: 'Kafka'
  1. Kafka
  2. KAFKA-2054 Fix Kafka transient unit test failures
  3. KAFKA-3873

Gradle Test Executor non-zero exit code when running streams tests

    XMLWordPrintableJSON

    Details

      Description

      This happened in a couple of builds:

      org.apache.kafka.streams.integration.KStreamRepartitionJoinTest > shouldFlatMapJoin PASSED
      :streams:test FAILED
      
      FAILURE: Build failed with an exception.
      
      * What went wrong:
      Execution failed for task ':streams:test'.
      > Process 'Gradle Test Executor 4' finished with non-zero exit value 1
      

      https://builds.apache.org/job/kafka-trunk-jdk7/1369/console

      org.apache.kafka.streams.integration.KGroupedStreamIntegrationTest > shouldAggregateWindowed PASSED
      :streams:test FAILED
      
      FAILURE: Build failed with an exception.
      
      * What went wrong:
      Execution failed for task ':streams:test'.
      > Process 'Gradle Test Executor 4' finished with non-zero exit value 1
      

      https://builds.apache.org/job/kafka-trunk-jdk7/1374/console

        Attachments

          Activity

            People

            • Assignee:
              damianguy Damian Guy
              Reporter:
              ijuma Ismael Juma
            • Votes:
              0 Vote for this issue
              Watchers:
              2 Start watching this issue

              Dates

              • Created:
                Updated:
                Resolved: