Uploaded image for project: 'Hadoop YARN'
  1. Hadoop YARN
  2. YARN-5667 Move HBase backend code in ATS v2 into its separate module
  3. YARN-5928

Move ATSv2 HBase backend code into a new module that is only dependent at runtime by yarn servers

    Details

    1. YARN-5928.01.patch
      1.04 MB
      Haibo Chen
    2. YARN-5928.02.patch
      1.04 MB
      Haibo Chen
    3. YARN-5928.06.patch
      79 kB
      Haibo Chen
    4. YARN-5928-YARN-5355.02.patch
      1.07 MB
      Haibo Chen
    5. YARN-5928-YARN-5355.03.patch
      1.07 MB
      Haibo Chen
    6. YARN-5928-YARN-5355.04.patch
      1.07 MB
      Haibo Chen
    7. YARN-5928-YARN-5355.04.patch
      1.07 MB
      Haibo Chen
    8. YARN-5928-YARN-5355.05.patch
      1.04 MB
      Haibo Chen
    9. YARN-5928-YARN-5355.06.patch
      84 kB
      Haibo Chen
    10. YARN-5928-YARN-5355.07.patch
      84 kB
      Haibo Chen

      Issue Links

        Activity

        Hide
        haibochen Haibo Chen added a comment - - edited

        Attaching a patch for trunk only that incorporates previous reviews done in YARN-5667. I'll upload another patch for branch YARN-5355 later since it is a little more work to rebase.

        Show
        haibochen Haibo Chen added a comment - - edited Attaching a patch for trunk only that incorporates previous reviews done in YARN-5667 . I'll upload another patch for branch YARN-5355 later since it is a little more work to rebase.
        Hide
        haibochen Haibo Chen added a comment -

        jersey-core should not be removed (javax.ws.rs package)

        Sangjin Lee, I checked the jersey-core jar file, it does not contain any javax.ws.rs.* class. Instead, all javax.ws.rs.* classes are contained in jsr311-api, which is not declared as a dependency of hadoop. Is there any reason why we do not add jsr311-api?

        Show
        haibochen Haibo Chen added a comment - jersey-core should not be removed (javax.ws.rs package) Sangjin Lee , I checked the jersey-core jar file, it does not contain any javax.ws.rs.* class. Instead, all javax.ws.rs.* classes are contained in jsr311-api, which is not declared as a dependency of hadoop. Is there any reason why we do not add jsr311-api?
        Hide
        sjlee0 Sangjin Lee added a comment -

        Thanks for the info. I might have looked at a wrong version of jersey core. Between mvn dependency:analyze and the actual compilation and running tests, we should be able to figure out the correct pom. I don't know off the top of my head why jsr311-api should not be added if it is directly used. Thanks!

        Show
        sjlee0 Sangjin Lee added a comment - Thanks for the info. I might have looked at a wrong version of jersey core. Between mvn dependency:analyze and the actual compilation and running tests, we should be able to figure out the correct pom. I don't know off the top of my head why jsr311-api should not be added if it is directly used. Thanks!
        Hide
        haibochen Haibo Chen added a comment -

        Thanks for your comments, Sangjin. I took your suggestion to look at both dependency:analyze result and actual compilation to figure out correct direct dependency. Hopefully, there won't be many problems this time. To test the patch, I have run all ats-related unit tests, deployed it in a pseudo-distributed cluster, tested the REST API after running a few example jobs. I will update the patch to add jsr311-api.

        Show
        haibochen Haibo Chen added a comment - Thanks for your comments, Sangjin. I took your suggestion to look at both dependency:analyze result and actual compilation to figure out correct direct dependency. Hopefully, there won't be many problems this time. To test the patch, I have run all ats-related unit tests, deployed it in a pseudo-distributed cluster, tested the REST API after running a few example jobs. I will update the patch to add jsr311-api.
        Hide
        haibochen Haibo Chen added a comment -

        Attaching a new patch that adds jsr311-api as a dependency and fixes a RM unit test failure caused by previous patch. Will soon upload another patch for branch YARN-5355

        Show
        haibochen Haibo Chen added a comment - Attaching a new patch that adds jsr311-api as a dependency and fixes a RM unit test failure caused by previous patch. Will soon upload another patch for branch YARN-5355
        Hide
        hadoopqa Hadoop QA added a comment -
        -1 overall



        Vote Subsystem Runtime Comment
        0 reexec 0m 25s Docker mode activated.
        +1 @author 0m 0s The patch does not contain any @author tags.
        +1 test4tests 0m 0s The patch appears to include 7 new or modified test files.
        0 mvndep 1m 50s Maven dependency ordering for branch
        +1 mvninstall 7m 29s YARN-5355 passed
        +1 compile 7m 26s YARN-5355 passed
        +1 checkstyle 1m 35s YARN-5355 passed
        +1 mvnsite 7m 17s YARN-5355 passed
        +1 mvneclipse 2m 19s YARN-5355 passed
        0 findbugs 0m 0s Skipped patched modules with no Java source: hadoop-project hadoop-yarn-project/hadoop-yarn/hadoop-yarn-server hadoop-yarn-project/hadoop-yarn/hadoop-yarn-site hadoop-yarn-project
        +1 findbugs 2m 10s YARN-5355 passed
        +1 javadoc 3m 45s YARN-5355 passed
        0 mvndep 0m 14s Maven dependency ordering for patch
        +1 mvninstall 5m 43s the patch passed
        +1 compile 6m 52s the patch passed
        +1 javac 6m 52s the patch passed
        -0 checkstyle 1m 31s root: The patch generated 6 new + 94 unchanged - 0 fixed = 100 total (was 94)
        +1 mvnsite 7m 15s the patch passed
        +1 mvneclipse 2m 40s the patch passed
        +1 whitespace 0m 0s The patch has no whitespace issues.
        +1 xml 0m 7s The patch has no ill-formed XML file.
        0 findbugs 0m 0s Skipped patched modules with no Java source: hadoop-project hadoop-yarn-project/hadoop-yarn/hadoop-yarn-server hadoop-yarn-project hadoop-yarn-project/hadoop-yarn/hadoop-yarn-site
        -1 findbugs 0m 19s hadoop-yarn-server-timelineservice-hbase in the patch failed.
        +1 javadoc 4m 16s the patch passed
        +1 unit 0m 15s hadoop-project in the patch passed.
        -1 unit 67m 34s hadoop-yarn-server in the patch failed.
        +1 unit 0m 50s hadoop-yarn-server-timelineservice in the patch passed.
        -1 unit 38m 53s hadoop-yarn-server-resourcemanager in the patch failed.
        -1 unit 1m 4s hadoop-yarn-server-timelineservice-hbase in the patch failed.
        -1 unit 69m 25s hadoop-yarn-project in the patch failed.
        -1 unit 0m 25s hadoop-yarn-server-timelineservice-hbase-tests in the patch failed.
        +1 unit 0m 14s hadoop-yarn-site in the patch passed.
        -1 asflicense 0m 28s The patch generated 1 ASF License warnings.
        268m 43s



        Reason Tests
        Failed junit tests hadoop.yarn.server.resourcemanager.TestResourceTrackerService
          hadoop.yarn.server.resourcemanager.recovery.TestFSRMStateStore
          hadoop.yarn.server.resourcemanager.TestRMHATimelineCollectors
          hadoop.yarn.server.resourcemanager.TestTokenClientRMService
          hadoop.yarn.server.resourcemanager.TestResourceTrackerService
          hadoop.yarn.server.resourcemanager.recovery.TestFSRMStateStore
          hadoop.yarn.server.resourcemanager.TestRMHATimelineCollectors
          hadoop.yarn.server.resourcemanager.TestTokenClientRMService
          hadoop.yarn.server.resourcemanager.TestResourceTrackerService
          hadoop.yarn.server.resourcemanager.recovery.TestFSRMStateStore
          hadoop.yarn.server.resourcemanager.TestRMHATimelineCollectors
          hadoop.yarn.server.resourcemanager.TestTokenClientRMService



        Subsystem Report/Notes
        Docker Image:yetus/hadoop:9560f25
        JIRA Issue YARN-5928
        JIRA Patch URL https://issues.apache.org/jira/secure/attachment/12843085/YARN-5928-YARN-5355.02.patch
        Optional Tests asflicense compile javac javadoc mvninstall mvnsite unit xml findbugs checkstyle
        uname Linux eaa55632eb81 3.13.0-95-generic #142-Ubuntu SMP Fri Aug 12 17:00:09 UTC 2016 x86_64 x86_64 x86_64 GNU/Linux
        Build tool maven
        Personality /testptch/hadoop/patchprocess/precommit/personality/provided.sh
        git revision YARN-5355 / 8288030
        Default Java 1.8.0_111
        findbugs v3.0.0
        checkstyle https://builds.apache.org/job/PreCommit-YARN-Build/14279/artifact/patchprocess/diff-checkstyle-root.txt
        findbugs https://builds.apache.org/job/PreCommit-YARN-Build/14279/artifact/patchprocess/patch-findbugs-hadoop-yarn-project_hadoop-yarn_hadoop-yarn-server_hadoop-yarn-server-timelineservice-hbase.txt
        unit https://builds.apache.org/job/PreCommit-YARN-Build/14279/artifact/patchprocess/patch-unit-hadoop-yarn-project_hadoop-yarn_hadoop-yarn-server.txt
        unit https://builds.apache.org/job/PreCommit-YARN-Build/14279/artifact/patchprocess/patch-unit-hadoop-yarn-project_hadoop-yarn_hadoop-yarn-server_hadoop-yarn-server-resourcemanager.txt
        unit https://builds.apache.org/job/PreCommit-YARN-Build/14279/artifact/patchprocess/patch-unit-hadoop-yarn-project_hadoop-yarn_hadoop-yarn-server_hadoop-yarn-server-timelineservice-hbase.txt
        unit https://builds.apache.org/job/PreCommit-YARN-Build/14279/artifact/patchprocess/patch-unit-hadoop-yarn-project.txt
        unit https://builds.apache.org/job/PreCommit-YARN-Build/14279/artifact/patchprocess/patch-unit-hadoop-yarn-project_hadoop-yarn_hadoop-yarn-server_hadoop-yarn-server-timelineservice-hbase-tests.txt
        Test Results https://builds.apache.org/job/PreCommit-YARN-Build/14279/testReport/
        asflicense https://builds.apache.org/job/PreCommit-YARN-Build/14279/artifact/patchprocess/patch-asflicense-problems.txt
        modules C: hadoop-project hadoop-yarn-project/hadoop-yarn/hadoop-yarn-server hadoop-yarn-project/hadoop-yarn/hadoop-yarn-server/hadoop-yarn-server-timelineservice hadoop-yarn-project/hadoop-yarn/hadoop-yarn-server/hadoop-yarn-server-resourcemanager hadoop-yarn-project/hadoop-yarn/hadoop-yarn-server/hadoop-yarn-server-timelineservice-hbase hadoop-yarn-project hadoop-yarn-project/hadoop-yarn/hadoop-yarn-server/hadoop-yarn-server-timelineservice-hbase-tests hadoop-yarn-project/hadoop-yarn/hadoop-yarn-site U: .
        Console output https://builds.apache.org/job/PreCommit-YARN-Build/14279/console
        Powered by Apache Yetus 0.5.0-SNAPSHOT http://yetus.apache.org

        This message was automatically generated.

        Show
        hadoopqa Hadoop QA added a comment - -1 overall Vote Subsystem Runtime Comment 0 reexec 0m 25s Docker mode activated. +1 @author 0m 0s The patch does not contain any @author tags. +1 test4tests 0m 0s The patch appears to include 7 new or modified test files. 0 mvndep 1m 50s Maven dependency ordering for branch +1 mvninstall 7m 29s YARN-5355 passed +1 compile 7m 26s YARN-5355 passed +1 checkstyle 1m 35s YARN-5355 passed +1 mvnsite 7m 17s YARN-5355 passed +1 mvneclipse 2m 19s YARN-5355 passed 0 findbugs 0m 0s Skipped patched modules with no Java source: hadoop-project hadoop-yarn-project/hadoop-yarn/hadoop-yarn-server hadoop-yarn-project/hadoop-yarn/hadoop-yarn-site hadoop-yarn-project +1 findbugs 2m 10s YARN-5355 passed +1 javadoc 3m 45s YARN-5355 passed 0 mvndep 0m 14s Maven dependency ordering for patch +1 mvninstall 5m 43s the patch passed +1 compile 6m 52s the patch passed +1 javac 6m 52s the patch passed -0 checkstyle 1m 31s root: The patch generated 6 new + 94 unchanged - 0 fixed = 100 total (was 94) +1 mvnsite 7m 15s the patch passed +1 mvneclipse 2m 40s the patch passed +1 whitespace 0m 0s The patch has no whitespace issues. +1 xml 0m 7s The patch has no ill-formed XML file. 0 findbugs 0m 0s Skipped patched modules with no Java source: hadoop-project hadoop-yarn-project/hadoop-yarn/hadoop-yarn-server hadoop-yarn-project hadoop-yarn-project/hadoop-yarn/hadoop-yarn-site -1 findbugs 0m 19s hadoop-yarn-server-timelineservice-hbase in the patch failed. +1 javadoc 4m 16s the patch passed +1 unit 0m 15s hadoop-project in the patch passed. -1 unit 67m 34s hadoop-yarn-server in the patch failed. +1 unit 0m 50s hadoop-yarn-server-timelineservice in the patch passed. -1 unit 38m 53s hadoop-yarn-server-resourcemanager in the patch failed. -1 unit 1m 4s hadoop-yarn-server-timelineservice-hbase in the patch failed. -1 unit 69m 25s hadoop-yarn-project in the patch failed. -1 unit 0m 25s hadoop-yarn-server-timelineservice-hbase-tests in the patch failed. +1 unit 0m 14s hadoop-yarn-site in the patch passed. -1 asflicense 0m 28s The patch generated 1 ASF License warnings. 268m 43s Reason Tests Failed junit tests hadoop.yarn.server.resourcemanager.TestResourceTrackerService   hadoop.yarn.server.resourcemanager.recovery.TestFSRMStateStore   hadoop.yarn.server.resourcemanager.TestRMHATimelineCollectors   hadoop.yarn.server.resourcemanager.TestTokenClientRMService   hadoop.yarn.server.resourcemanager.TestResourceTrackerService   hadoop.yarn.server.resourcemanager.recovery.TestFSRMStateStore   hadoop.yarn.server.resourcemanager.TestRMHATimelineCollectors   hadoop.yarn.server.resourcemanager.TestTokenClientRMService   hadoop.yarn.server.resourcemanager.TestResourceTrackerService   hadoop.yarn.server.resourcemanager.recovery.TestFSRMStateStore   hadoop.yarn.server.resourcemanager.TestRMHATimelineCollectors   hadoop.yarn.server.resourcemanager.TestTokenClientRMService Subsystem Report/Notes Docker Image:yetus/hadoop:9560f25 JIRA Issue YARN-5928 JIRA Patch URL https://issues.apache.org/jira/secure/attachment/12843085/YARN-5928-YARN-5355.02.patch Optional Tests asflicense compile javac javadoc mvninstall mvnsite unit xml findbugs checkstyle uname Linux eaa55632eb81 3.13.0-95-generic #142-Ubuntu SMP Fri Aug 12 17:00:09 UTC 2016 x86_64 x86_64 x86_64 GNU/Linux Build tool maven Personality /testptch/hadoop/patchprocess/precommit/personality/provided.sh git revision YARN-5355 / 8288030 Default Java 1.8.0_111 findbugs v3.0.0 checkstyle https://builds.apache.org/job/PreCommit-YARN-Build/14279/artifact/patchprocess/diff-checkstyle-root.txt findbugs https://builds.apache.org/job/PreCommit-YARN-Build/14279/artifact/patchprocess/patch-findbugs-hadoop-yarn-project_hadoop-yarn_hadoop-yarn-server_hadoop-yarn-server-timelineservice-hbase.txt unit https://builds.apache.org/job/PreCommit-YARN-Build/14279/artifact/patchprocess/patch-unit-hadoop-yarn-project_hadoop-yarn_hadoop-yarn-server.txt unit https://builds.apache.org/job/PreCommit-YARN-Build/14279/artifact/patchprocess/patch-unit-hadoop-yarn-project_hadoop-yarn_hadoop-yarn-server_hadoop-yarn-server-resourcemanager.txt unit https://builds.apache.org/job/PreCommit-YARN-Build/14279/artifact/patchprocess/patch-unit-hadoop-yarn-project_hadoop-yarn_hadoop-yarn-server_hadoop-yarn-server-timelineservice-hbase.txt unit https://builds.apache.org/job/PreCommit-YARN-Build/14279/artifact/patchprocess/patch-unit-hadoop-yarn-project.txt unit https://builds.apache.org/job/PreCommit-YARN-Build/14279/artifact/patchprocess/patch-unit-hadoop-yarn-project_hadoop-yarn_hadoop-yarn-server_hadoop-yarn-server-timelineservice-hbase-tests.txt Test Results https://builds.apache.org/job/PreCommit-YARN-Build/14279/testReport/ asflicense https://builds.apache.org/job/PreCommit-YARN-Build/14279/artifact/patchprocess/patch-asflicense-problems.txt modules C: hadoop-project hadoop-yarn-project/hadoop-yarn/hadoop-yarn-server hadoop-yarn-project/hadoop-yarn/hadoop-yarn-server/hadoop-yarn-server-timelineservice hadoop-yarn-project/hadoop-yarn/hadoop-yarn-server/hadoop-yarn-server-resourcemanager hadoop-yarn-project/hadoop-yarn/hadoop-yarn-server/hadoop-yarn-server-timelineservice-hbase hadoop-yarn-project hadoop-yarn-project/hadoop-yarn/hadoop-yarn-server/hadoop-yarn-server-timelineservice-hbase-tests hadoop-yarn-project/hadoop-yarn/hadoop-yarn-site U: . Console output https://builds.apache.org/job/PreCommit-YARN-Build/14279/console Powered by Apache Yetus 0.5.0-SNAPSHOT http://yetus.apache.org This message was automatically generated.
        Hide
        haibochen Haibo Chen added a comment -

        TestTokenClientRMService.testTokenRenewalWrongUser failure is YARN-5875 (committed to trunk, not in YARN-5355), and I cannot reproduce TestFSRMStateStore locally. Not sure why there were some compilation errors as I can compile locally with my patch. Will address the rest of issues in a new patch and see if there will be compilation errors again.

        Show
        haibochen Haibo Chen added a comment - TestTokenClientRMService.testTokenRenewalWrongUser failure is YARN-5875 (committed to trunk, not in YARN-5355 ), and I cannot reproduce TestFSRMStateStore locally. Not sure why there were some compilation errors as I can compile locally with my patch. Will address the rest of issues in a new patch and see if there will be compilation errors again.
        Hide
        hadoopqa Hadoop QA added a comment -
        -1 overall



        Vote Subsystem Runtime Comment
        0 reexec 0m 17s Docker mode activated.
        +1 @author 0m 0s The patch does not contain any @author tags.
        +1 test4tests 0m 0s The patch appears to include 9 new or modified test files.
        0 mvndep 1m 1s Maven dependency ordering for branch
        +1 mvninstall 6m 49s YARN-5355 passed
        +1 compile 6m 59s YARN-5355 passed
        +1 checkstyle 1m 29s YARN-5355 passed
        +1 mvnsite 6m 50s YARN-5355 passed
        +1 mvneclipse 2m 11s YARN-5355 passed
        0 findbugs 0m 0s Skipped patched modules with no Java source: hadoop-project hadoop-yarn-project/hadoop-yarn/hadoop-yarn-server hadoop-yarn-project/hadoop-yarn/hadoop-yarn-site hadoop-yarn-project
        +1 findbugs 2m 2s YARN-5355 passed
        +1 javadoc 3m 39s YARN-5355 passed
        0 mvndep 0m 15s Maven dependency ordering for patch
        +1 mvninstall 5m 47s the patch passed
        +1 compile 6m 55s the patch passed
        +1 javac 6m 55s the patch passed
        +1 checkstyle 1m 32s the patch passed
        +1 mvnsite 7m 20s the patch passed
        +1 mvneclipse 2m 43s the patch passed
        +1 whitespace 0m 0s The patch has no whitespace issues.
        +1 xml 0m 7s The patch has no ill-formed XML file.
        0 findbugs 0m 0s Skipped patched modules with no Java source: hadoop-project hadoop-yarn-project/hadoop-yarn/hadoop-yarn-server hadoop-yarn-project/hadoop-yarn/hadoop-yarn-site hadoop-yarn-project
        -1 findbugs 0m 19s hadoop-yarn-server-timelineservice-hbase in the patch failed.
        +1 javadoc 4m 20s the patch passed
        +1 unit 0m 15s hadoop-project in the patch passed.
        -1 unit 30m 59s hadoop-yarn-server in the patch failed.
        -1 unit 0m 15s hadoop-yarn-server-timelineservice in the patch failed.
        -1 unit 0m 5s hadoop-yarn-server-resourcemanager in the patch failed.
        -1 unit 0m 6s hadoop-yarn-server-timelineservice-hbase in the patch failed.
        -1 unit 0m 16s hadoop-yarn-server-timelineservice-hbase-tests in the patch failed.
        +1 unit 0m 7s hadoop-yarn-site in the patch passed.
        -1 unit 0m 27s hadoop-yarn-project in the patch failed.
        -1 asflicense 0m 19s The patch generated 2 ASF License warnings.
        118m 24s



        Reason Tests
        Failed junit tests hadoop.yarn.server.resourcemanager.webapp.TestRMWebServicesReservation
          hadoop.yarn.server.resourcemanager.webapp.TestRMWebServicesReservation
          hadoop.yarn.server.resourcemanager.webapp.TestRMWebServicesReservation



        Subsystem Report/Notes
        Docker Image:yetus/hadoop:9560f25
        JIRA Issue YARN-5928
        JIRA Patch URL https://issues.apache.org/jira/secure/attachment/12843288/YARN-5928-YARN-5355.03.patch
        Optional Tests asflicense compile javac javadoc mvninstall mvnsite unit xml findbugs checkstyle
        uname Linux a34950a3bf55 3.13.0-95-generic #142-Ubuntu SMP Fri Aug 12 17:00:09 UTC 2016 x86_64 x86_64 x86_64 GNU/Linux
        Build tool maven
        Personality /testptch/hadoop/patchprocess/precommit/personality/provided.sh
        git revision YARN-5355 / 8288030
        Default Java 1.8.0_111
        findbugs v3.0.0
        findbugs https://builds.apache.org/job/PreCommit-YARN-Build/14304/artifact/patchprocess/patch-findbugs-hadoop-yarn-project_hadoop-yarn_hadoop-yarn-server_hadoop-yarn-server-timelineservice-hbase.txt
        unit https://builds.apache.org/job/PreCommit-YARN-Build/14304/artifact/patchprocess/patch-unit-hadoop-yarn-project_hadoop-yarn_hadoop-yarn-server.txt
        unit https://builds.apache.org/job/PreCommit-YARN-Build/14304/artifact/patchprocess/patch-unit-hadoop-yarn-project_hadoop-yarn_hadoop-yarn-server_hadoop-yarn-server-timelineservice.txt
        unit https://builds.apache.org/job/PreCommit-YARN-Build/14304/artifact/patchprocess/patch-unit-hadoop-yarn-project_hadoop-yarn_hadoop-yarn-server_hadoop-yarn-server-resourcemanager.txt
        unit https://builds.apache.org/job/PreCommit-YARN-Build/14304/artifact/patchprocess/patch-unit-hadoop-yarn-project_hadoop-yarn_hadoop-yarn-server_hadoop-yarn-server-timelineservice-hbase.txt
        unit https://builds.apache.org/job/PreCommit-YARN-Build/14304/artifact/patchprocess/patch-unit-hadoop-yarn-project_hadoop-yarn_hadoop-yarn-server_hadoop-yarn-server-timelineservice-hbase-tests.txt
        unit https://builds.apache.org/job/PreCommit-YARN-Build/14304/artifact/patchprocess/patch-unit-hadoop-yarn-project.txt
        Test Results https://builds.apache.org/job/PreCommit-YARN-Build/14304/testReport/
        asflicense https://builds.apache.org/job/PreCommit-YARN-Build/14304/artifact/patchprocess/patch-asflicense-problems.txt
        modules C: hadoop-project hadoop-yarn-project/hadoop-yarn/hadoop-yarn-server hadoop-yarn-project/hadoop-yarn/hadoop-yarn-server/hadoop-yarn-server-timelineservice hadoop-yarn-project/hadoop-yarn/hadoop-yarn-server/hadoop-yarn-server-resourcemanager hadoop-yarn-project/hadoop-yarn/hadoop-yarn-server/hadoop-yarn-server-timelineservice-hbase hadoop-yarn-project/hadoop-yarn/hadoop-yarn-server/hadoop-yarn-server-timelineservice-hbase-tests hadoop-yarn-project/hadoop-yarn/hadoop-yarn-site hadoop-yarn-project U: .
        Console output https://builds.apache.org/job/PreCommit-YARN-Build/14304/console
        Powered by Apache Yetus 0.5.0-SNAPSHOT http://yetus.apache.org

        This message was automatically generated.

        Show
        hadoopqa Hadoop QA added a comment - -1 overall Vote Subsystem Runtime Comment 0 reexec 0m 17s Docker mode activated. +1 @author 0m 0s The patch does not contain any @author tags. +1 test4tests 0m 0s The patch appears to include 9 new or modified test files. 0 mvndep 1m 1s Maven dependency ordering for branch +1 mvninstall 6m 49s YARN-5355 passed +1 compile 6m 59s YARN-5355 passed +1 checkstyle 1m 29s YARN-5355 passed +1 mvnsite 6m 50s YARN-5355 passed +1 mvneclipse 2m 11s YARN-5355 passed 0 findbugs 0m 0s Skipped patched modules with no Java source: hadoop-project hadoop-yarn-project/hadoop-yarn/hadoop-yarn-server hadoop-yarn-project/hadoop-yarn/hadoop-yarn-site hadoop-yarn-project +1 findbugs 2m 2s YARN-5355 passed +1 javadoc 3m 39s YARN-5355 passed 0 mvndep 0m 15s Maven dependency ordering for patch +1 mvninstall 5m 47s the patch passed +1 compile 6m 55s the patch passed +1 javac 6m 55s the patch passed +1 checkstyle 1m 32s the patch passed +1 mvnsite 7m 20s the patch passed +1 mvneclipse 2m 43s the patch passed +1 whitespace 0m 0s The patch has no whitespace issues. +1 xml 0m 7s The patch has no ill-formed XML file. 0 findbugs 0m 0s Skipped patched modules with no Java source: hadoop-project hadoop-yarn-project/hadoop-yarn/hadoop-yarn-server hadoop-yarn-project/hadoop-yarn/hadoop-yarn-site hadoop-yarn-project -1 findbugs 0m 19s hadoop-yarn-server-timelineservice-hbase in the patch failed. +1 javadoc 4m 20s the patch passed +1 unit 0m 15s hadoop-project in the patch passed. -1 unit 30m 59s hadoop-yarn-server in the patch failed. -1 unit 0m 15s hadoop-yarn-server-timelineservice in the patch failed. -1 unit 0m 5s hadoop-yarn-server-resourcemanager in the patch failed. -1 unit 0m 6s hadoop-yarn-server-timelineservice-hbase in the patch failed. -1 unit 0m 16s hadoop-yarn-server-timelineservice-hbase-tests in the patch failed. +1 unit 0m 7s hadoop-yarn-site in the patch passed. -1 unit 0m 27s hadoop-yarn-project in the patch failed. -1 asflicense 0m 19s The patch generated 2 ASF License warnings. 118m 24s Reason Tests Failed junit tests hadoop.yarn.server.resourcemanager.webapp.TestRMWebServicesReservation   hadoop.yarn.server.resourcemanager.webapp.TestRMWebServicesReservation   hadoop.yarn.server.resourcemanager.webapp.TestRMWebServicesReservation Subsystem Report/Notes Docker Image:yetus/hadoop:9560f25 JIRA Issue YARN-5928 JIRA Patch URL https://issues.apache.org/jira/secure/attachment/12843288/YARN-5928-YARN-5355.03.patch Optional Tests asflicense compile javac javadoc mvninstall mvnsite unit xml findbugs checkstyle uname Linux a34950a3bf55 3.13.0-95-generic #142-Ubuntu SMP Fri Aug 12 17:00:09 UTC 2016 x86_64 x86_64 x86_64 GNU/Linux Build tool maven Personality /testptch/hadoop/patchprocess/precommit/personality/provided.sh git revision YARN-5355 / 8288030 Default Java 1.8.0_111 findbugs v3.0.0 findbugs https://builds.apache.org/job/PreCommit-YARN-Build/14304/artifact/patchprocess/patch-findbugs-hadoop-yarn-project_hadoop-yarn_hadoop-yarn-server_hadoop-yarn-server-timelineservice-hbase.txt unit https://builds.apache.org/job/PreCommit-YARN-Build/14304/artifact/patchprocess/patch-unit-hadoop-yarn-project_hadoop-yarn_hadoop-yarn-server.txt unit https://builds.apache.org/job/PreCommit-YARN-Build/14304/artifact/patchprocess/patch-unit-hadoop-yarn-project_hadoop-yarn_hadoop-yarn-server_hadoop-yarn-server-timelineservice.txt unit https://builds.apache.org/job/PreCommit-YARN-Build/14304/artifact/patchprocess/patch-unit-hadoop-yarn-project_hadoop-yarn_hadoop-yarn-server_hadoop-yarn-server-resourcemanager.txt unit https://builds.apache.org/job/PreCommit-YARN-Build/14304/artifact/patchprocess/patch-unit-hadoop-yarn-project_hadoop-yarn_hadoop-yarn-server_hadoop-yarn-server-timelineservice-hbase.txt unit https://builds.apache.org/job/PreCommit-YARN-Build/14304/artifact/patchprocess/patch-unit-hadoop-yarn-project_hadoop-yarn_hadoop-yarn-server_hadoop-yarn-server-timelineservice-hbase-tests.txt unit https://builds.apache.org/job/PreCommit-YARN-Build/14304/artifact/patchprocess/patch-unit-hadoop-yarn-project.txt Test Results https://builds.apache.org/job/PreCommit-YARN-Build/14304/testReport/ asflicense https://builds.apache.org/job/PreCommit-YARN-Build/14304/artifact/patchprocess/patch-asflicense-problems.txt modules C: hadoop-project hadoop-yarn-project/hadoop-yarn/hadoop-yarn-server hadoop-yarn-project/hadoop-yarn/hadoop-yarn-server/hadoop-yarn-server-timelineservice hadoop-yarn-project/hadoop-yarn/hadoop-yarn-server/hadoop-yarn-server-resourcemanager hadoop-yarn-project/hadoop-yarn/hadoop-yarn-server/hadoop-yarn-server-timelineservice-hbase hadoop-yarn-project/hadoop-yarn/hadoop-yarn-server/hadoop-yarn-server-timelineservice-hbase-tests hadoop-yarn-project/hadoop-yarn/hadoop-yarn-site hadoop-yarn-project U: . Console output https://builds.apache.org/job/PreCommit-YARN-Build/14304/console Powered by Apache Yetus 0.5.0-SNAPSHOT http://yetus.apache.org This message was automatically generated.
        Hide
        haibochen Haibo Chen added a comment -

        TestQueuingContainerManager.testKillMultipleOpportunisticContainers is at YARN-5377

        Show
        haibochen Haibo Chen added a comment - TestQueuingContainerManager.testKillMultipleOpportunisticContainers is at YARN-5377
        Hide
        haibochen Haibo Chen added a comment -

        From the console output, it seems like Jenkins had run into an issue. Sangjin Lee Can you please trigger the Jenkins job again? Thanks!

        Show
        haibochen Haibo Chen added a comment - From the console output, it seems like Jenkins had run into an issue. Sangjin Lee Can you please trigger the Jenkins job again? Thanks!
        Hide
        sjlee0 Sangjin Lee added a comment -

        Started one...

        Show
        sjlee0 Sangjin Lee added a comment - Started one...
        Hide
        sjlee0 Sangjin Lee added a comment -

        Note that there is now YARN-5976 in flight (upgrading hbase and removing phoenix). You might want to monitor the progress of that JIRA as there may be impact.

        Show
        sjlee0 Sangjin Lee added a comment - Note that there is now YARN-5976 in flight (upgrading hbase and removing phoenix). You might want to monitor the progress of that JIRA as there may be impact.
        Hide
        hadoopqa Hadoop QA added a comment -
        -1 overall



        Vote Subsystem Runtime Comment
        0 reexec 0m 17s Docker mode activated.
        +1 @author 0m 0s The patch does not contain any @author tags.
        +1 test4tests 0m 0s The patch appears to include 9 new or modified test files.
        0 mvndep 1m 33s Maven dependency ordering for branch
        +1 mvninstall 7m 8s YARN-5355 passed
        +1 compile 7m 35s YARN-5355 passed
        +1 checkstyle 1m 34s YARN-5355 passed
        +1 mvnsite 7m 9s YARN-5355 passed
        +1 mvneclipse 2m 20s YARN-5355 passed
        0 findbugs 0m 0s Skipped patched modules with no Java source: hadoop-project hadoop-yarn-project/hadoop-yarn/hadoop-yarn-server hadoop-yarn-project/hadoop-yarn/hadoop-yarn-site hadoop-yarn-project
        +1 findbugs 2m 10s YARN-5355 passed
        +1 javadoc 3m 55s YARN-5355 passed
        0 mvndep 0m 18s Maven dependency ordering for patch
        +1 mvninstall 6m 4s the patch passed
        +1 compile 7m 27s the patch passed
        +1 javac 7m 27s the patch passed
        +1 checkstyle 1m 37s the patch passed
        +1 mvnsite 7m 43s the patch passed
        +1 mvneclipse 2m 50s the patch passed
        +1 whitespace 0m 0s The patch has no whitespace issues.
        +1 xml 0m 7s The patch has no ill-formed XML file.
        0 findbugs 0m 0s Skipped patched modules with no Java source: hadoop-project hadoop-yarn-project/hadoop-yarn/hadoop-yarn-server hadoop-yarn-project/hadoop-yarn/hadoop-yarn-site hadoop-yarn-project
        -1 findbugs 0m 22s hadoop-yarn-server-timelineservice-hbase in the patch failed.
        +1 javadoc 4m 21s the patch passed
        +1 unit 0m 14s hadoop-project in the patch passed.
        -1 unit 64m 52s hadoop-yarn-server in the patch failed.
        +1 unit 0m 48s hadoop-yarn-server-timelineservice in the patch passed.
        -1 unit 38m 6s hadoop-yarn-server-resourcemanager in the patch passed.
        +1 unit 0m 25s hadoop-yarn-server-timelineservice-hbase in the patch passed.
        +1 unit 6m 50s hadoop-yarn-server-timelineservice-hbase-tests in the patch passed.
        +1 unit 0m 15s hadoop-yarn-site in the patch passed.
        -1 unit 66m 25s hadoop-yarn-project in the patch failed.
        +1 asflicense 0m 28s The patch does not generate ASF License warnings.
        269m 29s



        Reason Tests
        Failed junit tests hadoop.yarn.server.resourcemanager.TestResourceTrackerService
          hadoop.yarn.server.resourcemanager.TestResourceTrackerService
          hadoop.yarn.server.resourcemanager.TestResourceTrackerService



        Subsystem Report/Notes
        Docker Image:yetus/hadoop:9560f25
        JIRA Issue YARN-5928
        JIRA Patch URL https://issues.apache.org/jira/secure/attachment/12843288/YARN-5928-YARN-5355.03.patch
        Optional Tests asflicense compile javac javadoc mvninstall mvnsite unit xml findbugs checkstyle
        uname Linux 234b1338b7c9 3.13.0-95-generic #142-Ubuntu SMP Fri Aug 12 17:00:09 UTC 2016 x86_64 x86_64 x86_64 GNU/Linux
        Build tool maven
        Personality /testptch/hadoop/patchprocess/precommit/personality/provided.sh
        git revision YARN-5355 / 8288030
        Default Java 1.8.0_111
        findbugs v3.0.0
        findbugs https://builds.apache.org/job/PreCommit-YARN-Build/14316/artifact/patchprocess/patch-findbugs-hadoop-yarn-project_hadoop-yarn_hadoop-yarn-server_hadoop-yarn-server-timelineservice-hbase.txt
        unit https://builds.apache.org/job/PreCommit-YARN-Build/14316/artifact/patchprocess/patch-unit-hadoop-yarn-project_hadoop-yarn_hadoop-yarn-server.txt
        unit https://builds.apache.org/job/PreCommit-YARN-Build/14316/artifact/patchprocess/patch-unit-hadoop-yarn-project_hadoop-yarn_hadoop-yarn-server_hadoop-yarn-server-resourcemanager.txt
        unit https://builds.apache.org/job/PreCommit-YARN-Build/14316/artifact/patchprocess/patch-unit-hadoop-yarn-project.txt
        Test Results https://builds.apache.org/job/PreCommit-YARN-Build/14316/testReport/
        modules C: hadoop-project hadoop-yarn-project/hadoop-yarn/hadoop-yarn-server hadoop-yarn-project/hadoop-yarn/hadoop-yarn-server/hadoop-yarn-server-timelineservice hadoop-yarn-project/hadoop-yarn/hadoop-yarn-server/hadoop-yarn-server-resourcemanager hadoop-yarn-project/hadoop-yarn/hadoop-yarn-server/hadoop-yarn-server-timelineservice-hbase hadoop-yarn-project/hadoop-yarn/hadoop-yarn-server/hadoop-yarn-server-timelineservice-hbase-tests hadoop-yarn-project/hadoop-yarn/hadoop-yarn-site hadoop-yarn-project U: .
        Console output https://builds.apache.org/job/PreCommit-YARN-Build/14316/console
        Powered by Apache Yetus 0.5.0-SNAPSHOT http://yetus.apache.org

        This message was automatically generated.

        Show
        hadoopqa Hadoop QA added a comment - -1 overall Vote Subsystem Runtime Comment 0 reexec 0m 17s Docker mode activated. +1 @author 0m 0s The patch does not contain any @author tags. +1 test4tests 0m 0s The patch appears to include 9 new or modified test files. 0 mvndep 1m 33s Maven dependency ordering for branch +1 mvninstall 7m 8s YARN-5355 passed +1 compile 7m 35s YARN-5355 passed +1 checkstyle 1m 34s YARN-5355 passed +1 mvnsite 7m 9s YARN-5355 passed +1 mvneclipse 2m 20s YARN-5355 passed 0 findbugs 0m 0s Skipped patched modules with no Java source: hadoop-project hadoop-yarn-project/hadoop-yarn/hadoop-yarn-server hadoop-yarn-project/hadoop-yarn/hadoop-yarn-site hadoop-yarn-project +1 findbugs 2m 10s YARN-5355 passed +1 javadoc 3m 55s YARN-5355 passed 0 mvndep 0m 18s Maven dependency ordering for patch +1 mvninstall 6m 4s the patch passed +1 compile 7m 27s the patch passed +1 javac 7m 27s the patch passed +1 checkstyle 1m 37s the patch passed +1 mvnsite 7m 43s the patch passed +1 mvneclipse 2m 50s the patch passed +1 whitespace 0m 0s The patch has no whitespace issues. +1 xml 0m 7s The patch has no ill-formed XML file. 0 findbugs 0m 0s Skipped patched modules with no Java source: hadoop-project hadoop-yarn-project/hadoop-yarn/hadoop-yarn-server hadoop-yarn-project/hadoop-yarn/hadoop-yarn-site hadoop-yarn-project -1 findbugs 0m 22s hadoop-yarn-server-timelineservice-hbase in the patch failed. +1 javadoc 4m 21s the patch passed +1 unit 0m 14s hadoop-project in the patch passed. -1 unit 64m 52s hadoop-yarn-server in the patch failed. +1 unit 0m 48s hadoop-yarn-server-timelineservice in the patch passed. -1 unit 38m 6s hadoop-yarn-server-resourcemanager in the patch passed. +1 unit 0m 25s hadoop-yarn-server-timelineservice-hbase in the patch passed. +1 unit 6m 50s hadoop-yarn-server-timelineservice-hbase-tests in the patch passed. +1 unit 0m 15s hadoop-yarn-site in the patch passed. -1 unit 66m 25s hadoop-yarn-project in the patch failed. +1 asflicense 0m 28s The patch does not generate ASF License warnings. 269m 29s Reason Tests Failed junit tests hadoop.yarn.server.resourcemanager.TestResourceTrackerService   hadoop.yarn.server.resourcemanager.TestResourceTrackerService   hadoop.yarn.server.resourcemanager.TestResourceTrackerService Subsystem Report/Notes Docker Image:yetus/hadoop:9560f25 JIRA Issue YARN-5928 JIRA Patch URL https://issues.apache.org/jira/secure/attachment/12843288/YARN-5928-YARN-5355.03.patch Optional Tests asflicense compile javac javadoc mvninstall mvnsite unit xml findbugs checkstyle uname Linux 234b1338b7c9 3.13.0-95-generic #142-Ubuntu SMP Fri Aug 12 17:00:09 UTC 2016 x86_64 x86_64 x86_64 GNU/Linux Build tool maven Personality /testptch/hadoop/patchprocess/precommit/personality/provided.sh git revision YARN-5355 / 8288030 Default Java 1.8.0_111 findbugs v3.0.0 findbugs https://builds.apache.org/job/PreCommit-YARN-Build/14316/artifact/patchprocess/patch-findbugs-hadoop-yarn-project_hadoop-yarn_hadoop-yarn-server_hadoop-yarn-server-timelineservice-hbase.txt unit https://builds.apache.org/job/PreCommit-YARN-Build/14316/artifact/patchprocess/patch-unit-hadoop-yarn-project_hadoop-yarn_hadoop-yarn-server.txt unit https://builds.apache.org/job/PreCommit-YARN-Build/14316/artifact/patchprocess/patch-unit-hadoop-yarn-project_hadoop-yarn_hadoop-yarn-server_hadoop-yarn-server-resourcemanager.txt unit https://builds.apache.org/job/PreCommit-YARN-Build/14316/artifact/patchprocess/patch-unit-hadoop-yarn-project.txt Test Results https://builds.apache.org/job/PreCommit-YARN-Build/14316/testReport/ modules C: hadoop-project hadoop-yarn-project/hadoop-yarn/hadoop-yarn-server hadoop-yarn-project/hadoop-yarn/hadoop-yarn-server/hadoop-yarn-server-timelineservice hadoop-yarn-project/hadoop-yarn/hadoop-yarn-server/hadoop-yarn-server-resourcemanager hadoop-yarn-project/hadoop-yarn/hadoop-yarn-server/hadoop-yarn-server-timelineservice-hbase hadoop-yarn-project/hadoop-yarn/hadoop-yarn-server/hadoop-yarn-server-timelineservice-hbase-tests hadoop-yarn-project/hadoop-yarn/hadoop-yarn-site hadoop-yarn-project U: . Console output https://builds.apache.org/job/PreCommit-YARN-Build/14316/console Powered by Apache Yetus 0.5.0-SNAPSHOT http://yetus.apache.org This message was automatically generated.
        Hide
        haibochen Haibo Chen added a comment -

        Thanks for your reminder. I'll keep an eye on that and rebase my patch as soon as it is committed.

        Show
        haibochen Haibo Chen added a comment - Thanks for your reminder. I'll keep an eye on that and rebase my patch as soon as it is committed.
        Hide
        haibochen Haibo Chen added a comment -

        Only the findbug issue is related. Will address it in a following new patch.

        Show
        haibochen Haibo Chen added a comment - Only the findbug issue is related. Will address it in a following new patch.
        Hide
        sjlee0 Sangjin Lee added a comment -

        FYI, YARN-5976 has been merged, and it made some improvements to the pom. You might want to look at that.

        Also, I suspect some hbase entries in hadoop-project/pom.xml can now be removed as some are no longer used.

        Show
        sjlee0 Sangjin Lee added a comment - FYI, YARN-5976 has been merged, and it made some improvements to the pom. You might want to look at that. Also, I suspect some hbase entries in hadoop-project/pom.xml can now be removed as some are no longer used.
        Hide
        haibochen Haibo Chen added a comment - - edited

        A newly rebased patch for branch YARN-5355 only.

        Show
        haibochen Haibo Chen added a comment - - edited A newly rebased patch for branch YARN-5355 only.
        Hide
        sjlee0 Sangjin Lee added a comment -

        Thanks for updating the patch Haibo Chen! I'm going to go through the patch in some detail.

        One high level question regarding the coprocessor (FlowRunCoprocessor). Have you ensured that the new hadoop-yarn-timelineservice-hbase.jar file is a self-contained jar that can be installed as a coprocessor? Note that it is critical that we have a single self-contained jar for the coprocessor. A cursory glance at imported classes seems to indicate that is the case, but I wanted to check with you.

        Show
        sjlee0 Sangjin Lee added a comment - Thanks for updating the patch Haibo Chen ! I'm going to go through the patch in some detail. One high level question regarding the coprocessor ( FlowRunCoprocessor ). Have you ensured that the new hadoop-yarn-timelineservice-hbase.jar file is a self-contained jar that can be installed as a coprocessor? Note that it is critical that we have a single self-contained jar for the coprocessor. A cursory glance at imported classes seems to indicate that is the case, but I wanted to check with you.
        Hide
        haibochen Haibo Chen added a comment -

        Yes, I believe so. I have tried the standalone timelineservice-hbase jar in a hbase cluster and running a mr pi job with the hbase cluster as the backend. Things worked for me.

        Show
        haibochen Haibo Chen added a comment - Yes, I believe so. I have tried the standalone timelineservice-hbase jar in a hbase cluster and running a mr pi job with the hbase cluster as the backend. Things worked for me.
        Hide
        sjlee0 Sangjin Lee added a comment -

        Awesome. Thanks.

        Show
        sjlee0 Sangjin Lee added a comment - Awesome. Thanks.
        Hide
        sjlee0 Sangjin Lee added a comment -

        Can I ask you a small favor? Could you kindly regenerate the patches with a lower similarity index with git so that renames are detected? Currently the patch size is huge but it is mostly due to renames. You can add all files to index, and then pass -M90% for your git diff to arrive at smaller patches.

        Show
        sjlee0 Sangjin Lee added a comment - Can I ask you a small favor? Could you kindly regenerate the patches with a lower similarity index with git so that renames are detected? Currently the patch size is huge but it is mostly due to renames. You can add all files to index, and then pass -M90% for your git diff to arrive at smaller patches.
        Hide
        hadoopqa Hadoop QA added a comment -
        -1 overall



        Vote Subsystem Runtime Comment
        0 reexec 0m 22s Docker mode activated.
        +1 @author 0m 0s The patch does not contain any @author tags.
        +1 test4tests 0m 0s The patch appears to include 9 new or modified test files.
        0 mvndep 1m 38s Maven dependency ordering for branch
        +1 mvninstall 7m 44s YARN-5355 passed
        +1 compile 8m 46s YARN-5355 passed
        +1 checkstyle 1m 47s YARN-5355 passed
        +1 mvnsite 7m 31s YARN-5355 passed
        +1 mvneclipse 2m 21s YARN-5355 passed
        0 findbugs 0m 0s Skipped patched modules with no Java source: hadoop-project hadoop-yarn-project/hadoop-yarn/hadoop-yarn-server hadoop-yarn-project/hadoop-yarn/hadoop-yarn-server/hadoop-yarn-server-timelineservice-hbase-tests hadoop-yarn-project/hadoop-yarn/hadoop-yarn-site hadoop-yarn-project
        +1 findbugs 1m 51s YARN-5355 passed
        +1 javadoc 4m 26s YARN-5355 passed
        0 mvndep 0m 17s Maven dependency ordering for patch
        +1 mvninstall 7m 38s the patch passed
        +1 compile 9m 52s the patch passed
        +1 javac 9m 52s the patch passed
        +1 checkstyle 1m 55s the patch passed
        +1 mvnsite 8m 59s the patch passed
        +1 mvneclipse 3m 3s the patch passed
        -1 whitespace 0m 0s The patch 3 line(s) with tabs.
        +1 xml 0m 10s The patch has no ill-formed XML file.
        0 findbugs 0m 0s Skipped patched modules with no Java source: hadoop-project hadoop-yarn-project/hadoop-yarn/hadoop-yarn-server hadoop-yarn-project hadoop-yarn-project/hadoop-yarn/hadoop-yarn-server/hadoop-yarn-server-timelineservice-hbase-tests hadoop-yarn-project/hadoop-yarn/hadoop-yarn-site
        +1 findbugs 2m 54s the patch passed
        +1 javadoc 5m 10s the patch passed
        +1 unit 0m 15s hadoop-project in the patch passed.
        -1 unit 66m 19s hadoop-yarn-server in the patch failed.
        +1 unit 0m 58s hadoop-yarn-server-timelineservice in the patch passed.
        -1 unit 36m 54s hadoop-yarn-server-resourcemanager in the patch failed.
        +1 unit 0m 30s hadoop-yarn-server-timelineservice-hbase in the patch passed.
        -1 unit 64m 13s hadoop-yarn-project in the patch failed.
        +1 unit 5m 6s hadoop-yarn-server-timelineservice-hbase-tests in the patch passed.
        +1 unit 0m 16s hadoop-yarn-site in the patch passed.
        -1 asflicense 0m 31s The patch generated 1 ASF License warnings.
        275m 12s



        Reason Tests
        Failed junit tests hadoop.yarn.server.TestMiniYarnClusterNodeUtilization
          hadoop.yarn.server.TestContainerManagerSecurity
          hadoop.yarn.server.resourcemanager.applicationsmanager.TestAMRestart
          hadoop.yarn.server.resourcemanager.applicationsmanager.TestAMRestart
          hadoop.yarn.server.TestMiniYarnClusterNodeUtilization
          hadoop.yarn.server.TestContainerManagerSecurity
          hadoop.yarn.server.resourcemanager.applicationsmanager.TestAMRestart



        Subsystem Report/Notes
        Docker Image:yetus/hadoop:9560f25
        JIRA Issue YARN-5928
        JIRA Patch URL https://issues.apache.org/jira/secure/attachment/12847944/YARN-5928-YARN-5355.05.patch
        Optional Tests asflicense compile javac javadoc mvninstall mvnsite unit xml findbugs checkstyle
        uname Linux bf302a7b51ea 3.13.0-105-generic #152-Ubuntu SMP Fri Dec 2 15:37:11 UTC 2016 x86_64 x86_64 x86_64 GNU/Linux
        Build tool maven
        Personality /testptch/hadoop/patchprocess/precommit/personality/provided.sh
        git revision YARN-5355 / 6baea68
        Default Java 1.8.0_111
        findbugs v3.0.0
        whitespace https://builds.apache.org/job/PreCommit-YARN-Build/14683/artifact/patchprocess/whitespace-tabs.txt
        unit https://builds.apache.org/job/PreCommit-YARN-Build/14683/artifact/patchprocess/patch-unit-hadoop-yarn-project_hadoop-yarn_hadoop-yarn-server.txt
        unit https://builds.apache.org/job/PreCommit-YARN-Build/14683/artifact/patchprocess/patch-unit-hadoop-yarn-project_hadoop-yarn_hadoop-yarn-server_hadoop-yarn-server-resourcemanager.txt
        unit https://builds.apache.org/job/PreCommit-YARN-Build/14683/artifact/patchprocess/patch-unit-hadoop-yarn-project.txt
        Test Results https://builds.apache.org/job/PreCommit-YARN-Build/14683/testReport/
        asflicense https://builds.apache.org/job/PreCommit-YARN-Build/14683/artifact/patchprocess/patch-asflicense-problems.txt
        modules C: hadoop-project hadoop-yarn-project/hadoop-yarn/hadoop-yarn-server hadoop-yarn-project/hadoop-yarn/hadoop-yarn-server/hadoop-yarn-server-timelineservice hadoop-yarn-project/hadoop-yarn/hadoop-yarn-server/hadoop-yarn-server-resourcemanager hadoop-yarn-project/hadoop-yarn/hadoop-yarn-server/hadoop-yarn-server-timelineservice-hbase hadoop-yarn-project hadoop-yarn-project/hadoop-yarn/hadoop-yarn-server/hadoop-yarn-server-timelineservice-hbase-tests hadoop-yarn-project/hadoop-yarn/hadoop-yarn-site U: .
        Console output https://builds.apache.org/job/PreCommit-YARN-Build/14683/console
        Powered by Apache Yetus 0.5.0-SNAPSHOT http://yetus.apache.org

        This message was automatically generated.

        Show
        hadoopqa Hadoop QA added a comment - -1 overall Vote Subsystem Runtime Comment 0 reexec 0m 22s Docker mode activated. +1 @author 0m 0s The patch does not contain any @author tags. +1 test4tests 0m 0s The patch appears to include 9 new or modified test files. 0 mvndep 1m 38s Maven dependency ordering for branch +1 mvninstall 7m 44s YARN-5355 passed +1 compile 8m 46s YARN-5355 passed +1 checkstyle 1m 47s YARN-5355 passed +1 mvnsite 7m 31s YARN-5355 passed +1 mvneclipse 2m 21s YARN-5355 passed 0 findbugs 0m 0s Skipped patched modules with no Java source: hadoop-project hadoop-yarn-project/hadoop-yarn/hadoop-yarn-server hadoop-yarn-project/hadoop-yarn/hadoop-yarn-server/hadoop-yarn-server-timelineservice-hbase-tests hadoop-yarn-project/hadoop-yarn/hadoop-yarn-site hadoop-yarn-project +1 findbugs 1m 51s YARN-5355 passed +1 javadoc 4m 26s YARN-5355 passed 0 mvndep 0m 17s Maven dependency ordering for patch +1 mvninstall 7m 38s the patch passed +1 compile 9m 52s the patch passed +1 javac 9m 52s the patch passed +1 checkstyle 1m 55s the patch passed +1 mvnsite 8m 59s the patch passed +1 mvneclipse 3m 3s the patch passed -1 whitespace 0m 0s The patch 3 line(s) with tabs. +1 xml 0m 10s The patch has no ill-formed XML file. 0 findbugs 0m 0s Skipped patched modules with no Java source: hadoop-project hadoop-yarn-project/hadoop-yarn/hadoop-yarn-server hadoop-yarn-project hadoop-yarn-project/hadoop-yarn/hadoop-yarn-server/hadoop-yarn-server-timelineservice-hbase-tests hadoop-yarn-project/hadoop-yarn/hadoop-yarn-site +1 findbugs 2m 54s the patch passed +1 javadoc 5m 10s the patch passed +1 unit 0m 15s hadoop-project in the patch passed. -1 unit 66m 19s hadoop-yarn-server in the patch failed. +1 unit 0m 58s hadoop-yarn-server-timelineservice in the patch passed. -1 unit 36m 54s hadoop-yarn-server-resourcemanager in the patch failed. +1 unit 0m 30s hadoop-yarn-server-timelineservice-hbase in the patch passed. -1 unit 64m 13s hadoop-yarn-project in the patch failed. +1 unit 5m 6s hadoop-yarn-server-timelineservice-hbase-tests in the patch passed. +1 unit 0m 16s hadoop-yarn-site in the patch passed. -1 asflicense 0m 31s The patch generated 1 ASF License warnings. 275m 12s Reason Tests Failed junit tests hadoop.yarn.server.TestMiniYarnClusterNodeUtilization   hadoop.yarn.server.TestContainerManagerSecurity   hadoop.yarn.server.resourcemanager.applicationsmanager.TestAMRestart   hadoop.yarn.server.resourcemanager.applicationsmanager.TestAMRestart   hadoop.yarn.server.TestMiniYarnClusterNodeUtilization   hadoop.yarn.server.TestContainerManagerSecurity   hadoop.yarn.server.resourcemanager.applicationsmanager.TestAMRestart Subsystem Report/Notes Docker Image:yetus/hadoop:9560f25 JIRA Issue YARN-5928 JIRA Patch URL https://issues.apache.org/jira/secure/attachment/12847944/YARN-5928-YARN-5355.05.patch Optional Tests asflicense compile javac javadoc mvninstall mvnsite unit xml findbugs checkstyle uname Linux bf302a7b51ea 3.13.0-105-generic #152-Ubuntu SMP Fri Dec 2 15:37:11 UTC 2016 x86_64 x86_64 x86_64 GNU/Linux Build tool maven Personality /testptch/hadoop/patchprocess/precommit/personality/provided.sh git revision YARN-5355 / 6baea68 Default Java 1.8.0_111 findbugs v3.0.0 whitespace https://builds.apache.org/job/PreCommit-YARN-Build/14683/artifact/patchprocess/whitespace-tabs.txt unit https://builds.apache.org/job/PreCommit-YARN-Build/14683/artifact/patchprocess/patch-unit-hadoop-yarn-project_hadoop-yarn_hadoop-yarn-server.txt unit https://builds.apache.org/job/PreCommit-YARN-Build/14683/artifact/patchprocess/patch-unit-hadoop-yarn-project_hadoop-yarn_hadoop-yarn-server_hadoop-yarn-server-resourcemanager.txt unit https://builds.apache.org/job/PreCommit-YARN-Build/14683/artifact/patchprocess/patch-unit-hadoop-yarn-project.txt Test Results https://builds.apache.org/job/PreCommit-YARN-Build/14683/testReport/ asflicense https://builds.apache.org/job/PreCommit-YARN-Build/14683/artifact/patchprocess/patch-asflicense-problems.txt modules C: hadoop-project hadoop-yarn-project/hadoop-yarn/hadoop-yarn-server hadoop-yarn-project/hadoop-yarn/hadoop-yarn-server/hadoop-yarn-server-timelineservice hadoop-yarn-project/hadoop-yarn/hadoop-yarn-server/hadoop-yarn-server-resourcemanager hadoop-yarn-project/hadoop-yarn/hadoop-yarn-server/hadoop-yarn-server-timelineservice-hbase hadoop-yarn-project hadoop-yarn-project/hadoop-yarn/hadoop-yarn-server/hadoop-yarn-server-timelineservice-hbase-tests hadoop-yarn-project/hadoop-yarn/hadoop-yarn-site U: . Console output https://builds.apache.org/job/PreCommit-YARN-Build/14683/console Powered by Apache Yetus 0.5.0-SNAPSHOT http://yetus.apache.org This message was automatically generated.
        Hide
        sjlee0 Sangjin Lee added a comment -

        Could you please fix the tab issue? Also, could you please check to see if the unit test failures are related?

        For my review:
        (hadoop-project/pom.xml)

        • hbase-it is no longer referenced anywhere, and can be removed

        (timelineservice/pom.xml)

        • Why would we mark these as "'mvn dependency:analyze' fails to detect this direct dependency"? They seem to be detected just fine. If they were truly used but mvn failed to detect them, they would show up under "unused declared dependencies" in mvn dependency:analyze but they don't.

        (timelineservice-hbase/pom.xml)

        • Why would we mark these as "'mvn dependency:analyze' fails to detect this direct dependency" (except for hadoop-common:test-jar)? They seem to be detected just fine. If they were truly used but mvn failed to detect them, they would show up under "unused declared dependencies" in mvn dependency:analyze but they don't.
        Show
        sjlee0 Sangjin Lee added a comment - Could you please fix the tab issue? Also, could you please check to see if the unit test failures are related? For my review: (hadoop-project/pom.xml) hbase-it is no longer referenced anywhere, and can be removed (timelineservice/pom.xml) Why would we mark these as "'mvn dependency:analyze' fails to detect this direct dependency"? They seem to be detected just fine. If they were truly used but mvn failed to detect them, they would show up under "unused declared dependencies" in mvn dependency:analyze but they don't. (timelineservice-hbase/pom.xml) Why would we mark these as "'mvn dependency:analyze' fails to detect this direct dependency" (except for hadoop-common:test-jar)? They seem to be detected just fine. If they were truly used but mvn failed to detect them, they would show up under "unused declared dependencies" in mvn dependency:analyze but they don't.
        Hide
        sjlee0 Sangjin Lee added a comment -

        Also, you may want to keep an eye on YARN-6094. It changes the coprocessor from static loading to dynamic loading, and there are some files where changes overlap. Depending on the order of these two issues being committed, we'd need to rebase.

        cc Vrushali C

        Show
        sjlee0 Sangjin Lee added a comment - Also, you may want to keep an eye on YARN-6094 . It changes the coprocessor from static loading to dynamic loading, and there are some files where changes overlap. Depending on the order of these two issues being committed, we'd need to rebase. cc Vrushali C
        Hide
        haibochen Haibo Chen added a comment -

        Thanks a lot for your reviews, Sangjin Lee! I do see those hadoop* dependencies listed under "unused declared dependencies" section when I ran mvn dependency:analyze on my machine. I am using maven 3.3.9, not sure what the cause is. In any case, I will remove those "mvn fails to detect" comments. The three failed unit tests are all unrelated. TestMiniYarnClusterNodeUtilization.testUpdateNodeUtilization is YARN-5728, TestAMRestart.testRMAppAttemptFailuresValidityInterval seems to be YARN-5043, and TestContainerManagerSecurity fails even without the patch. Will address the rest of your comments along with the license warnings in a new patch.

        Show
        haibochen Haibo Chen added a comment - Thanks a lot for your reviews, Sangjin Lee ! I do see those hadoop* dependencies listed under "unused declared dependencies" section when I ran mvn dependency:analyze on my machine. I am using maven 3.3.9, not sure what the cause is. In any case, I will remove those "mvn fails to detect" comments. The three failed unit tests are all unrelated. TestMiniYarnClusterNodeUtilization.testUpdateNodeUtilization is YARN-5728 , TestAMRestart.testRMAppAttemptFailuresValidityInterval seems to be YARN-5043 , and TestContainerManagerSecurity fails even without the patch. Will address the rest of your comments along with the license warnings in a new patch.
        Hide
        haibochen Haibo Chen added a comment -

        A new patch with comments addressed and a lower similarity

        Show
        haibochen Haibo Chen added a comment - A new patch with comments addressed and a lower similarity
        Hide
        sjlee0 Sangjin Lee added a comment -

        Thanks Haibo. I would greatly appreciate it if you could update the trunk patch as well. I'll run the dependency analysis for the trunk as well as the YARN-5355 branch to see if they are any different.

        Show
        sjlee0 Sangjin Lee added a comment - Thanks Haibo. I would greatly appreciate it if you could update the trunk patch as well. I'll run the dependency analysis for the trunk as well as the YARN-5355 branch to see if they are any different.
        Hide
        haibochen Haibo Chen added a comment -

        I will upload a patch for trunk shortly.

        Show
        haibochen Haibo Chen added a comment - I will upload a patch for trunk shortly.
        Hide
        haibochen Haibo Chen added a comment -

        Uploading a patch for branch trunk.

        Show
        haibochen Haibo Chen added a comment - Uploading a patch for branch trunk.
        Hide
        hadoopqa Hadoop QA added a comment -
        -1 overall



        Vote Subsystem Runtime Comment
        0 reexec 0m 20s Docker mode activated.
        +1 @author 0m 0s The patch does not contain any @author tags.
        +1 test4tests 0m 0s The patch appears to include 9 new or modified test files.
        0 mvndep 2m 38s Maven dependency ordering for branch
        -1 mvninstall 4m 43s root in YARN-5355 failed.
        -1 compile 3m 28s root in YARN-5355 failed.
        +1 checkstyle 2m 36s YARN-5355 passed
        -1 mvnsite 1m 37s hadoop-yarn-project in YARN-5355 failed.
        -1 mvnsite 0m 58s hadoop-yarn-server in YARN-5355 failed.
        -1 mvnsite 0m 16s hadoop-yarn-server-timelineservice in YARN-5355 failed.
        -1 mvnsite 0m 20s hadoop-yarn-server-timelineservice-hbase-tests in YARN-5355 failed.
        +1 mvneclipse 2m 0s YARN-5355 passed
        0 findbugs 0m 0s Skipped patched modules with no Java source: hadoop-project hadoop-yarn-project hadoop-yarn-project/hadoop-yarn/hadoop-yarn-server hadoop-yarn-project/hadoop-yarn/hadoop-yarn-server/hadoop-yarn-server-timelineservice-hbase-tests hadoop-yarn-project/hadoop-yarn/hadoop-yarn-site
        -1 findbugs 0m 19s hadoop-yarn-server-timelineservice in YARN-5355 failed.
        +1 javadoc 3m 23s YARN-5355 passed
        0 mvndep 0m 13s Maven dependency ordering for patch
        -1 mvninstall 1m 26s hadoop-yarn-server in the patch failed.
        -1 mvninstall 0m 15s hadoop-yarn-server-timelineservice-hbase in the patch failed.
        -1 mvninstall 2m 53s hadoop-yarn-project in the patch failed.
        -1 mvninstall 0m 9s hadoop-yarn-server-timelineservice-hbase-tests in the patch failed.
        -1 compile 5m 13s root in the patch failed.
        -1 javac 5m 13s root in the patch failed.
        +1 checkstyle 1m 13s the patch passed
        -1 mvnsite 2m 5s hadoop-yarn-server in the patch failed.
        -1 mvnsite 0m 18s hadoop-yarn-server-timelineservice-hbase in the patch failed.
        -1 mvnsite 2m 57s hadoop-yarn-project in the patch failed.
        -1 mvnsite 0m 9s hadoop-yarn-server-timelineservice-hbase-tests in the patch failed.
        -1 mvneclipse 0m 25s hadoop-yarn-server in the patch failed.
        -1 mvneclipse 0m 27s hadoop-yarn-project in the patch failed.
        -1 mvneclipse 0m 11s hadoop-yarn-server-timelineservice-hbase-tests in the patch failed.
        +1 whitespace 0m 0s The patch has no whitespace issues.
        +1 xml 0m 7s The patch has no ill-formed XML file.
        0 findbugs 0m 0s Skipped patched modules with no Java source: hadoop-project hadoop-yarn-project/hadoop-yarn/hadoop-yarn-server hadoop-yarn-project hadoop-yarn-project/hadoop-yarn/hadoop-yarn-server/hadoop-yarn-server-timelineservice-hbase-tests hadoop-yarn-project/hadoop-yarn/hadoop-yarn-site
        -1 findbugs 0m 16s hadoop-yarn-server-timelineservice-hbase in the patch failed.
        -1 javadoc 0m 54s hadoop-yarn-server in the patch failed.
        -1 javadoc 1m 22s hadoop-yarn-project in the patch failed.
        -1 javadoc 0m 14s hadoop-yarn-server-timelineservice-hbase-tests in the patch failed.
        +1 unit 0m 13s hadoop-project in the patch passed.
        -1 unit 55m 22s hadoop-yarn-server in the patch failed.
        +1 unit 0m 46s hadoop-yarn-server-timelineservice in the patch passed.
        +1 unit 34m 59s hadoop-yarn-server-resourcemanager in the patch passed.
        -1 unit 0m 20s hadoop-yarn-server-timelineservice-hbase in the patch failed.
        -1 unit 60m 14s hadoop-yarn-project in the patch failed.
        -1 unit 0m 12s hadoop-yarn-server-timelineservice-hbase-tests in the patch failed.
        +1 unit 0m 12s hadoop-yarn-site in the patch passed.
        +1 asflicense 0m 25s The patch does not generate ASF License warnings.
        227m 33s



        Reason Tests
        Failed junit tests hadoop.yarn.server.TestMiniYarnClusterNodeUtilization
          hadoop.yarn.server.TestContainerManagerSecurity
          hadoop.yarn.server.TestMiniYarnClusterNodeUtilization
          hadoop.yarn.server.TestContainerManagerSecurity



        Subsystem Report/Notes
        Docker Image:yetus/hadoop:9560f25
        JIRA Issue YARN-5928
        JIRA Patch URL https://issues.apache.org/jira/secure/attachment/12848124/YARN-5928-YARN-5355.06.patch
        Optional Tests asflicense compile javac javadoc mvninstall mvnsite unit xml findbugs checkstyle
        uname Linux f24d4f7a292a 3.13.0-107-generic #154-Ubuntu SMP Tue Dec 20 09:57:27 UTC 2016 x86_64 x86_64 x86_64 GNU/Linux
        Build tool maven
        Personality /testptch/hadoop/patchprocess/precommit/personality/provided.sh
        git revision YARN-5355 / 4b1ba4e
        Default Java 1.8.0_111
        mvninstall https://builds.apache.org/job/PreCommit-YARN-Build/14689/artifact/patchprocess/branch-mvninstall-root.txt
        compile https://builds.apache.org/job/PreCommit-YARN-Build/14689/artifact/patchprocess/branch-compile-root.txt
        mvnsite https://builds.apache.org/job/PreCommit-YARN-Build/14689/artifact/patchprocess/branch-mvnsite-hadoop-yarn-project.txt
        mvnsite https://builds.apache.org/job/PreCommit-YARN-Build/14689/artifact/patchprocess/branch-mvnsite-hadoop-yarn-project_hadoop-yarn_hadoop-yarn-server.txt
        mvnsite https://builds.apache.org/job/PreCommit-YARN-Build/14689/artifact/patchprocess/branch-mvnsite-hadoop-yarn-project_hadoop-yarn_hadoop-yarn-server_hadoop-yarn-server-timelineservice.txt
        mvnsite https://builds.apache.org/job/PreCommit-YARN-Build/14689/artifact/patchprocess/branch-mvnsite-hadoop-yarn-project_hadoop-yarn_hadoop-yarn-server_hadoop-yarn-server-timelineservice-hbase-tests.txt
        findbugs v3.0.0
        findbugs https://builds.apache.org/job/PreCommit-YARN-Build/14689/artifact/patchprocess/branch-findbugs-hadoop-yarn-project_hadoop-yarn_hadoop-yarn-server_hadoop-yarn-server-timelineservice.txt
        mvninstall https://builds.apache.org/job/PreCommit-YARN-Build/14689/artifact/patchprocess/patch-mvninstall-hadoop-yarn-project_hadoop-yarn_hadoop-yarn-server.txt
        mvninstall https://builds.apache.org/job/PreCommit-YARN-Build/14689/artifact/patchprocess/patch-mvninstall-hadoop-yarn-project_hadoop-yarn_hadoop-yarn-server_hadoop-yarn-server-timelineservice-hbase.txt
        mvninstall https://builds.apache.org/job/PreCommit-YARN-Build/14689/artifact/patchprocess/patch-mvninstall-hadoop-yarn-project.txt
        mvninstall https://builds.apache.org/job/PreCommit-YARN-Build/14689/artifact/patchprocess/patch-mvninstall-hadoop-yarn-project_hadoop-yarn_hadoop-yarn-server_hadoop-yarn-server-timelineservice-hbase-tests.txt
        compile https://builds.apache.org/job/PreCommit-YARN-Build/14689/artifact/patchprocess/patch-compile-root.txt
        javac https://builds.apache.org/job/PreCommit-YARN-Build/14689/artifact/patchprocess/patch-compile-root.txt
        mvnsite https://builds.apache.org/job/PreCommit-YARN-Build/14689/artifact/patchprocess/patch-mvnsite-hadoop-yarn-project_hadoop-yarn_hadoop-yarn-server.txt
        mvnsite https://builds.apache.org/job/PreCommit-YARN-Build/14689/artifact/patchprocess/patch-mvnsite-hadoop-yarn-project_hadoop-yarn_hadoop-yarn-server_hadoop-yarn-server-timelineservice-hbase.txt
        mvnsite https://builds.apache.org/job/PreCommit-YARN-Build/14689/artifact/patchprocess/patch-mvnsite-hadoop-yarn-project.txt
        mvnsite https://builds.apache.org/job/PreCommit-YARN-Build/14689/artifact/patchprocess/patch-mvnsite-hadoop-yarn-project_hadoop-yarn_hadoop-yarn-server_hadoop-yarn-server-timelineservice-hbase-tests.txt
        mvneclipse https://builds.apache.org/job/PreCommit-YARN-Build/14689/artifact/patchprocess/patch-mvneclipse-hadoop-yarn-project_hadoop-yarn_hadoop-yarn-server.txt
        mvneclipse https://builds.apache.org/job/PreCommit-YARN-Build/14689/artifact/patchprocess/patch-mvneclipse-hadoop-yarn-project.txt
        mvneclipse https://builds.apache.org/job/PreCommit-YARN-Build/14689/artifact/patchprocess/patch-mvneclipse-hadoop-yarn-project_hadoop-yarn_hadoop-yarn-server_hadoop-yarn-server-timelineservice-hbase-tests.txt
        findbugs https://builds.apache.org/job/PreCommit-YARN-Build/14689/artifact/patchprocess/patch-findbugs-hadoop-yarn-project_hadoop-yarn_hadoop-yarn-server_hadoop-yarn-server-timelineservice-hbase.txt
        javadoc https://builds.apache.org/job/PreCommit-YARN-Build/14689/artifact/patchprocess/patch-javadoc-hadoop-yarn-project_hadoop-yarn_hadoop-yarn-server.txt
        javadoc https://builds.apache.org/job/PreCommit-YARN-Build/14689/artifact/patchprocess/patch-javadoc-hadoop-yarn-project.txt
        javadoc https://builds.apache.org/job/PreCommit-YARN-Build/14689/artifact/patchprocess/patch-javadoc-hadoop-yarn-project_hadoop-yarn_hadoop-yarn-server_hadoop-yarn-server-timelineservice-hbase-tests.txt
        unit https://builds.apache.org/job/PreCommit-YARN-Build/14689/artifact/patchprocess/patch-unit-hadoop-yarn-project_hadoop-yarn_hadoop-yarn-server.txt
        unit https://builds.apache.org/job/PreCommit-YARN-Build/14689/artifact/patchprocess/patch-unit-hadoop-yarn-project_hadoop-yarn_hadoop-yarn-server_hadoop-yarn-server-timelineservice-hbase.txt
        unit https://builds.apache.org/job/PreCommit-YARN-Build/14689/artifact/patchprocess/patch-unit-hadoop-yarn-project.txt
        unit https://builds.apache.org/job/PreCommit-YARN-Build/14689/artifact/patchprocess/patch-unit-hadoop-yarn-project_hadoop-yarn_hadoop-yarn-server_hadoop-yarn-server-timelineservice-hbase-tests.txt
        Test Results https://builds.apache.org/job/PreCommit-YARN-Build/14689/testReport/
        modules C: hadoop-project hadoop-yarn-project/hadoop-yarn/hadoop-yarn-server hadoop-yarn-project/hadoop-yarn/hadoop-yarn-server/hadoop-yarn-server-timelineservice hadoop-yarn-project/hadoop-yarn/hadoop-yarn-server/hadoop-yarn-server-resourcemanager hadoop-yarn-project/hadoop-yarn/hadoop-yarn-server/hadoop-yarn-server-timelineservice-hbase hadoop-yarn-project hadoop-yarn-project/hadoop-yarn/hadoop-yarn-server/hadoop-yarn-server-timelineservice-hbase-tests hadoop-yarn-project/hadoop-yarn/hadoop-yarn-site U: .
        Console output https://builds.apache.org/job/PreCommit-YARN-Build/14689/console
        Powered by Apache Yetus 0.5.0-SNAPSHOT http://yetus.apache.org

        This message was automatically generated.

        Show
        hadoopqa Hadoop QA added a comment - -1 overall Vote Subsystem Runtime Comment 0 reexec 0m 20s Docker mode activated. +1 @author 0m 0s The patch does not contain any @author tags. +1 test4tests 0m 0s The patch appears to include 9 new or modified test files. 0 mvndep 2m 38s Maven dependency ordering for branch -1 mvninstall 4m 43s root in YARN-5355 failed. -1 compile 3m 28s root in YARN-5355 failed. +1 checkstyle 2m 36s YARN-5355 passed -1 mvnsite 1m 37s hadoop-yarn-project in YARN-5355 failed. -1 mvnsite 0m 58s hadoop-yarn-server in YARN-5355 failed. -1 mvnsite 0m 16s hadoop-yarn-server-timelineservice in YARN-5355 failed. -1 mvnsite 0m 20s hadoop-yarn-server-timelineservice-hbase-tests in YARN-5355 failed. +1 mvneclipse 2m 0s YARN-5355 passed 0 findbugs 0m 0s Skipped patched modules with no Java source: hadoop-project hadoop-yarn-project hadoop-yarn-project/hadoop-yarn/hadoop-yarn-server hadoop-yarn-project/hadoop-yarn/hadoop-yarn-server/hadoop-yarn-server-timelineservice-hbase-tests hadoop-yarn-project/hadoop-yarn/hadoop-yarn-site -1 findbugs 0m 19s hadoop-yarn-server-timelineservice in YARN-5355 failed. +1 javadoc 3m 23s YARN-5355 passed 0 mvndep 0m 13s Maven dependency ordering for patch -1 mvninstall 1m 26s hadoop-yarn-server in the patch failed. -1 mvninstall 0m 15s hadoop-yarn-server-timelineservice-hbase in the patch failed. -1 mvninstall 2m 53s hadoop-yarn-project in the patch failed. -1 mvninstall 0m 9s hadoop-yarn-server-timelineservice-hbase-tests in the patch failed. -1 compile 5m 13s root in the patch failed. -1 javac 5m 13s root in the patch failed. +1 checkstyle 1m 13s the patch passed -1 mvnsite 2m 5s hadoop-yarn-server in the patch failed. -1 mvnsite 0m 18s hadoop-yarn-server-timelineservice-hbase in the patch failed. -1 mvnsite 2m 57s hadoop-yarn-project in the patch failed. -1 mvnsite 0m 9s hadoop-yarn-server-timelineservice-hbase-tests in the patch failed. -1 mvneclipse 0m 25s hadoop-yarn-server in the patch failed. -1 mvneclipse 0m 27s hadoop-yarn-project in the patch failed. -1 mvneclipse 0m 11s hadoop-yarn-server-timelineservice-hbase-tests in the patch failed. +1 whitespace 0m 0s The patch has no whitespace issues. +1 xml 0m 7s The patch has no ill-formed XML file. 0 findbugs 0m 0s Skipped patched modules with no Java source: hadoop-project hadoop-yarn-project/hadoop-yarn/hadoop-yarn-server hadoop-yarn-project hadoop-yarn-project/hadoop-yarn/hadoop-yarn-server/hadoop-yarn-server-timelineservice-hbase-tests hadoop-yarn-project/hadoop-yarn/hadoop-yarn-site -1 findbugs 0m 16s hadoop-yarn-server-timelineservice-hbase in the patch failed. -1 javadoc 0m 54s hadoop-yarn-server in the patch failed. -1 javadoc 1m 22s hadoop-yarn-project in the patch failed. -1 javadoc 0m 14s hadoop-yarn-server-timelineservice-hbase-tests in the patch failed. +1 unit 0m 13s hadoop-project in the patch passed. -1 unit 55m 22s hadoop-yarn-server in the patch failed. +1 unit 0m 46s hadoop-yarn-server-timelineservice in the patch passed. +1 unit 34m 59s hadoop-yarn-server-resourcemanager in the patch passed. -1 unit 0m 20s hadoop-yarn-server-timelineservice-hbase in the patch failed. -1 unit 60m 14s hadoop-yarn-project in the patch failed. -1 unit 0m 12s hadoop-yarn-server-timelineservice-hbase-tests in the patch failed. +1 unit 0m 12s hadoop-yarn-site in the patch passed. +1 asflicense 0m 25s The patch does not generate ASF License warnings. 227m 33s Reason Tests Failed junit tests hadoop.yarn.server.TestMiniYarnClusterNodeUtilization   hadoop.yarn.server.TestContainerManagerSecurity   hadoop.yarn.server.TestMiniYarnClusterNodeUtilization   hadoop.yarn.server.TestContainerManagerSecurity Subsystem Report/Notes Docker Image:yetus/hadoop:9560f25 JIRA Issue YARN-5928 JIRA Patch URL https://issues.apache.org/jira/secure/attachment/12848124/YARN-5928-YARN-5355.06.patch Optional Tests asflicense compile javac javadoc mvninstall mvnsite unit xml findbugs checkstyle uname Linux f24d4f7a292a 3.13.0-107-generic #154-Ubuntu SMP Tue Dec 20 09:57:27 UTC 2016 x86_64 x86_64 x86_64 GNU/Linux Build tool maven Personality /testptch/hadoop/patchprocess/precommit/personality/provided.sh git revision YARN-5355 / 4b1ba4e Default Java 1.8.0_111 mvninstall https://builds.apache.org/job/PreCommit-YARN-Build/14689/artifact/patchprocess/branch-mvninstall-root.txt compile https://builds.apache.org/job/PreCommit-YARN-Build/14689/artifact/patchprocess/branch-compile-root.txt mvnsite https://builds.apache.org/job/PreCommit-YARN-Build/14689/artifact/patchprocess/branch-mvnsite-hadoop-yarn-project.txt mvnsite https://builds.apache.org/job/PreCommit-YARN-Build/14689/artifact/patchprocess/branch-mvnsite-hadoop-yarn-project_hadoop-yarn_hadoop-yarn-server.txt mvnsite https://builds.apache.org/job/PreCommit-YARN-Build/14689/artifact/patchprocess/branch-mvnsite-hadoop-yarn-project_hadoop-yarn_hadoop-yarn-server_hadoop-yarn-server-timelineservice.txt mvnsite https://builds.apache.org/job/PreCommit-YARN-Build/14689/artifact/patchprocess/branch-mvnsite-hadoop-yarn-project_hadoop-yarn_hadoop-yarn-server_hadoop-yarn-server-timelineservice-hbase-tests.txt findbugs v3.0.0 findbugs https://builds.apache.org/job/PreCommit-YARN-Build/14689/artifact/patchprocess/branch-findbugs-hadoop-yarn-project_hadoop-yarn_hadoop-yarn-server_hadoop-yarn-server-timelineservice.txt mvninstall https://builds.apache.org/job/PreCommit-YARN-Build/14689/artifact/patchprocess/patch-mvninstall-hadoop-yarn-project_hadoop-yarn_hadoop-yarn-server.txt mvninstall https://builds.apache.org/job/PreCommit-YARN-Build/14689/artifact/patchprocess/patch-mvninstall-hadoop-yarn-project_hadoop-yarn_hadoop-yarn-server_hadoop-yarn-server-timelineservice-hbase.txt mvninstall https://builds.apache.org/job/PreCommit-YARN-Build/14689/artifact/patchprocess/patch-mvninstall-hadoop-yarn-project.txt mvninstall https://builds.apache.org/job/PreCommit-YARN-Build/14689/artifact/patchprocess/patch-mvninstall-hadoop-yarn-project_hadoop-yarn_hadoop-yarn-server_hadoop-yarn-server-timelineservice-hbase-tests.txt compile https://builds.apache.org/job/PreCommit-YARN-Build/14689/artifact/patchprocess/patch-compile-root.txt javac https://builds.apache.org/job/PreCommit-YARN-Build/14689/artifact/patchprocess/patch-compile-root.txt mvnsite https://builds.apache.org/job/PreCommit-YARN-Build/14689/artifact/patchprocess/patch-mvnsite-hadoop-yarn-project_hadoop-yarn_hadoop-yarn-server.txt mvnsite https://builds.apache.org/job/PreCommit-YARN-Build/14689/artifact/patchprocess/patch-mvnsite-hadoop-yarn-project_hadoop-yarn_hadoop-yarn-server_hadoop-yarn-server-timelineservice-hbase.txt mvnsite https://builds.apache.org/job/PreCommit-YARN-Build/14689/artifact/patchprocess/patch-mvnsite-hadoop-yarn-project.txt mvnsite https://builds.apache.org/job/PreCommit-YARN-Build/14689/artifact/patchprocess/patch-mvnsite-hadoop-yarn-project_hadoop-yarn_hadoop-yarn-server_hadoop-yarn-server-timelineservice-hbase-tests.txt mvneclipse https://builds.apache.org/job/PreCommit-YARN-Build/14689/artifact/patchprocess/patch-mvneclipse-hadoop-yarn-project_hadoop-yarn_hadoop-yarn-server.txt mvneclipse https://builds.apache.org/job/PreCommit-YARN-Build/14689/artifact/patchprocess/patch-mvneclipse-hadoop-yarn-project.txt mvneclipse https://builds.apache.org/job/PreCommit-YARN-Build/14689/artifact/patchprocess/patch-mvneclipse-hadoop-yarn-project_hadoop-yarn_hadoop-yarn-server_hadoop-yarn-server-timelineservice-hbase-tests.txt findbugs https://builds.apache.org/job/PreCommit-YARN-Build/14689/artifact/patchprocess/patch-findbugs-hadoop-yarn-project_hadoop-yarn_hadoop-yarn-server_hadoop-yarn-server-timelineservice-hbase.txt javadoc https://builds.apache.org/job/PreCommit-YARN-Build/14689/artifact/patchprocess/patch-javadoc-hadoop-yarn-project_hadoop-yarn_hadoop-yarn-server.txt javadoc https://builds.apache.org/job/PreCommit-YARN-Build/14689/artifact/patchprocess/patch-javadoc-hadoop-yarn-project.txt javadoc https://builds.apache.org/job/PreCommit-YARN-Build/14689/artifact/patchprocess/patch-javadoc-hadoop-yarn-project_hadoop-yarn_hadoop-yarn-server_hadoop-yarn-server-timelineservice-hbase-tests.txt unit https://builds.apache.org/job/PreCommit-YARN-Build/14689/artifact/patchprocess/patch-unit-hadoop-yarn-project_hadoop-yarn_hadoop-yarn-server.txt unit https://builds.apache.org/job/PreCommit-YARN-Build/14689/artifact/patchprocess/patch-unit-hadoop-yarn-project_hadoop-yarn_hadoop-yarn-server_hadoop-yarn-server-timelineservice-hbase.txt unit https://builds.apache.org/job/PreCommit-YARN-Build/14689/artifact/patchprocess/patch-unit-hadoop-yarn-project.txt unit https://builds.apache.org/job/PreCommit-YARN-Build/14689/artifact/patchprocess/patch-unit-hadoop-yarn-project_hadoop-yarn_hadoop-yarn-server_hadoop-yarn-server-timelineservice-hbase-tests.txt Test Results https://builds.apache.org/job/PreCommit-YARN-Build/14689/testReport/ modules C: hadoop-project hadoop-yarn-project/hadoop-yarn/hadoop-yarn-server hadoop-yarn-project/hadoop-yarn/hadoop-yarn-server/hadoop-yarn-server-timelineservice hadoop-yarn-project/hadoop-yarn/hadoop-yarn-server/hadoop-yarn-server-resourcemanager hadoop-yarn-project/hadoop-yarn/hadoop-yarn-server/hadoop-yarn-server-timelineservice-hbase hadoop-yarn-project hadoop-yarn-project/hadoop-yarn/hadoop-yarn-server/hadoop-yarn-server-timelineservice-hbase-tests hadoop-yarn-project/hadoop-yarn/hadoop-yarn-site U: . Console output https://builds.apache.org/job/PreCommit-YARN-Build/14689/console Powered by Apache Yetus 0.5.0-SNAPSHOT http://yetus.apache.org This message was automatically generated.
        Hide
        haibochen Haibo Chen added a comment -

        Not sure what is causing all the mvn red flags. Unit test failures are the same as stated in previous comment.

        Show
        haibochen Haibo Chen added a comment - Not sure what is causing all the mvn red flags. Unit test failures are the same as stated in previous comment.
        Hide
        sjlee0 Sangjin Lee added a comment -

        I just kicked off another build by hand.

        Show
        sjlee0 Sangjin Lee added a comment - I just kicked off another build by hand.
        Hide
        sjlee0 Sangjin Lee added a comment -

        That is failing too. This is the compilation error:

        [INFO] -------------------------------------------------------------
        [ERROR] COMPILATION ERROR : 
        [INFO] -------------------------------------------------------------
        [ERROR] /testptch/hadoop/hadoop-yarn-project/hadoop-yarn/hadoop-yarn-server/hadoop-yarn-server-timelineservice/src/main/java/org/apache/hadoop/yarn/server/timelineservice/storage/reader/ApplicationEntityReader.java:[377,42] error: constructor AppToFlowRowKey in class AppToFlowRowKey cannot be applied to given types;
        [ERROR]   required: String
          found: String,String
          reason: actual and formal argument lists differ in length
        /testptch/hadoop/hadoop-yarn-project/hadoop-yarn/hadoop-yarn-server/hadoop-yarn-server-timelineservice/src/main/java/org/apache/hadoop/yarn/server/timelineservice/storage/reader/ApplicationEntityReader.java:[380,12] error: method lookupFlowContext in class AbstractTimelineStorageReader cannot be applied to given types;
        [INFO] 2 errors 
        

        It is as if the latest version of AbstractTimelineStorageReader was compiled against an old version of AppToFlowRowKey. The funny thing is that both classes are in the same module!

        Show
        sjlee0 Sangjin Lee added a comment - That is failing too. This is the compilation error: [INFO] ------------------------------------------------------------- [ERROR] COMPILATION ERROR : [INFO] ------------------------------------------------------------- [ERROR] /testptch/hadoop/hadoop-yarn-project/hadoop-yarn/hadoop-yarn-server/hadoop-yarn-server-timelineservice/src/main/java/org/apache/hadoop/yarn/server/timelineservice/storage/reader/ApplicationEntityReader.java:[377,42] error: constructor AppToFlowRowKey in class AppToFlowRowKey cannot be applied to given types; [ERROR] required: String found: String,String reason: actual and formal argument lists differ in length /testptch/hadoop/hadoop-yarn-project/hadoop-yarn/hadoop-yarn-server/hadoop-yarn-server-timelineservice/src/main/java/org/apache/hadoop/yarn/server/timelineservice/storage/reader/ApplicationEntityReader.java:[380,12] error: method lookupFlowContext in class AbstractTimelineStorageReader cannot be applied to given types; [INFO] 2 errors It is as if the latest version of AbstractTimelineStorageReader was compiled against an old version of AppToFlowRowKey . The funny thing is that both classes are in the same module!
        Hide
        hadoopqa Hadoop QA added a comment -
        -1 overall



        Vote Subsystem Runtime Comment
        0 reexec 0m 14s Docker mode activated.
        +1 @author 0m 0s The patch does not contain any @author tags.
        +1 test4tests 0m 0s The patch appears to include 8 new or modified test files.
        0 mvndep 0m 21s Maven dependency ordering for branch
        +1 mvninstall 13m 18s trunk passed
        +1 compile 10m 3s trunk passed
        +1 checkstyle 1m 35s trunk passed
        +1 mvnsite 6m 26s trunk passed
        +1 mvneclipse 2m 10s trunk passed
        0 findbugs 0m 0s Skipped patched modules with no Java source: hadoop-project hadoop-yarn-project/hadoop-yarn/hadoop-yarn-server hadoop-yarn-project/hadoop-yarn/hadoop-yarn-server/hadoop-yarn-server-timelineservice-hbase-tests hadoop-yarn-project/hadoop-yarn/hadoop-yarn-site hadoop-yarn-project
        +1 findbugs 1m 49s trunk passed
        +1 javadoc 3m 55s trunk passed
        0 mvndep 0m 16s Maven dependency ordering for patch
        +1 mvninstall 6m 40s the patch passed
        +1 compile 10m 47s the patch passed
        +1 javac 10m 47s the patch passed
        +1 checkstyle 1m 37s the patch passed
        +1 mvnsite 7m 8s the patch passed
        +1 mvneclipse 2m 38s the patch passed
        +1 whitespace 0m 0s The patch has no whitespace issues.
        +1 xml 0m 7s The patch has no ill-formed XML file.
        0 findbugs 0m 0s Skipped patched modules with no Java source: hadoop-project hadoop-yarn-project/hadoop-yarn/hadoop-yarn-server hadoop-yarn-project hadoop-yarn-project/hadoop-yarn/hadoop-yarn-server/hadoop-yarn-server-timelineservice-hbase-tests hadoop-yarn-project/hadoop-yarn/hadoop-yarn-site
        +1 findbugs 2m 22s the patch passed
        +1 javadoc 4m 53s the patch passed
        +1 unit 0m 18s hadoop-project in the patch passed.
        -1 unit 16m 0s hadoop-yarn-server in the patch failed.
        +1 unit 0m 48s hadoop-yarn-server-timelineservice in the patch passed.
        -1 unit 38m 28s hadoop-yarn-server-resourcemanager in the patch failed.
        +1 unit 0m 24s hadoop-yarn-server-timelineservice-hbase in the patch passed.
        -1 unit 22m 16s hadoop-yarn-project in the patch failed.
        +1 unit 4m 26s hadoop-yarn-server-timelineservice-hbase-tests in the patch passed.
        +1 unit 0m 19s hadoop-yarn-site in the patch passed.
        +1 asflicense 0m 42s The patch does not generate ASF License warnings.
        183m 40s



        Reason Tests
        Failed junit tests hadoop.yarn.server.timeline.webapp.TestTimelineWebServices
          hadoop.yarn.server.resourcemanager.security.TestDelegationTokenRenewer
          hadoop.yarn.server.resourcemanager.security.TestDelegationTokenRenewer
          hadoop.yarn.server.timeline.webapp.TestTimelineWebServices
          hadoop.yarn.server.resourcemanager.security.TestDelegationTokenRenewer



        Subsystem Report/Notes
        Docker Image:yetus/hadoop:a9ad5d6
        JIRA Issue YARN-5928
        JIRA Patch URL https://issues.apache.org/jira/secure/attachment/12848144/YARN-5928.06.patch
        Optional Tests asflicense compile javac javadoc mvninstall mvnsite unit xml findbugs checkstyle
        uname Linux f52d8948f02a 3.13.0-103-generic #150-Ubuntu SMP Thu Nov 24 10:34:17 UTC 2016 x86_64 x86_64 x86_64 GNU/Linux
        Build tool maven
        Personality /testptch/hadoop/patchprocess/precommit/personality/provided.sh
        git revision trunk / 72054a8
        Default Java 1.8.0_111
        findbugs v3.0.0
        unit https://builds.apache.org/job/PreCommit-YARN-Build/14693/artifact/patchprocess/patch-unit-hadoop-yarn-project_hadoop-yarn_hadoop-yarn-server.txt
        unit https://builds.apache.org/job/PreCommit-YARN-Build/14693/artifact/patchprocess/patch-unit-hadoop-yarn-project_hadoop-yarn_hadoop-yarn-server_hadoop-yarn-server-resourcemanager.txt
        unit https://builds.apache.org/job/PreCommit-YARN-Build/14693/artifact/patchprocess/patch-unit-hadoop-yarn-project.txt
        Test Results https://builds.apache.org/job/PreCommit-YARN-Build/14693/testReport/
        modules C: hadoop-project hadoop-yarn-project/hadoop-yarn/hadoop-yarn-server hadoop-yarn-project/hadoop-yarn/hadoop-yarn-server/hadoop-yarn-server-timelineservice hadoop-yarn-project/hadoop-yarn/hadoop-yarn-server/hadoop-yarn-server-resourcemanager hadoop-yarn-project/hadoop-yarn/hadoop-yarn-server/hadoop-yarn-server-timelineservice-hbase hadoop-yarn-project hadoop-yarn-project/hadoop-yarn/hadoop-yarn-server/hadoop-yarn-server-timelineservice-hbase-tests hadoop-yarn-project/hadoop-yarn/hadoop-yarn-site U: .
        Console output https://builds.apache.org/job/PreCommit-YARN-Build/14693/console
        Powered by Apache Yetus 0.5.0-SNAPSHOT http://yetus.apache.org

        This message was automatically generated.

        Show
        hadoopqa Hadoop QA added a comment - -1 overall Vote Subsystem Runtime Comment 0 reexec 0m 14s Docker mode activated. +1 @author 0m 0s The patch does not contain any @author tags. +1 test4tests 0m 0s The patch appears to include 8 new or modified test files. 0 mvndep 0m 21s Maven dependency ordering for branch +1 mvninstall 13m 18s trunk passed +1 compile 10m 3s trunk passed +1 checkstyle 1m 35s trunk passed +1 mvnsite 6m 26s trunk passed +1 mvneclipse 2m 10s trunk passed 0 findbugs 0m 0s Skipped patched modules with no Java source: hadoop-project hadoop-yarn-project/hadoop-yarn/hadoop-yarn-server hadoop-yarn-project/hadoop-yarn/hadoop-yarn-server/hadoop-yarn-server-timelineservice-hbase-tests hadoop-yarn-project/hadoop-yarn/hadoop-yarn-site hadoop-yarn-project +1 findbugs 1m 49s trunk passed +1 javadoc 3m 55s trunk passed 0 mvndep 0m 16s Maven dependency ordering for patch +1 mvninstall 6m 40s the patch passed +1 compile 10m 47s the patch passed +1 javac 10m 47s the patch passed +1 checkstyle 1m 37s the patch passed +1 mvnsite 7m 8s the patch passed +1 mvneclipse 2m 38s the patch passed +1 whitespace 0m 0s The patch has no whitespace issues. +1 xml 0m 7s The patch has no ill-formed XML file. 0 findbugs 0m 0s Skipped patched modules with no Java source: hadoop-project hadoop-yarn-project/hadoop-yarn/hadoop-yarn-server hadoop-yarn-project hadoop-yarn-project/hadoop-yarn/hadoop-yarn-server/hadoop-yarn-server-timelineservice-hbase-tests hadoop-yarn-project/hadoop-yarn/hadoop-yarn-site +1 findbugs 2m 22s the patch passed +1 javadoc 4m 53s the patch passed +1 unit 0m 18s hadoop-project in the patch passed. -1 unit 16m 0s hadoop-yarn-server in the patch failed. +1 unit 0m 48s hadoop-yarn-server-timelineservice in the patch passed. -1 unit 38m 28s hadoop-yarn-server-resourcemanager in the patch failed. +1 unit 0m 24s hadoop-yarn-server-timelineservice-hbase in the patch passed. -1 unit 22m 16s hadoop-yarn-project in the patch failed. +1 unit 4m 26s hadoop-yarn-server-timelineservice-hbase-tests in the patch passed. +1 unit 0m 19s hadoop-yarn-site in the patch passed. +1 asflicense 0m 42s The patch does not generate ASF License warnings. 183m 40s Reason Tests Failed junit tests hadoop.yarn.server.timeline.webapp.TestTimelineWebServices   hadoop.yarn.server.resourcemanager.security.TestDelegationTokenRenewer   hadoop.yarn.server.resourcemanager.security.TestDelegationTokenRenewer   hadoop.yarn.server.timeline.webapp.TestTimelineWebServices   hadoop.yarn.server.resourcemanager.security.TestDelegationTokenRenewer Subsystem Report/Notes Docker Image:yetus/hadoop:a9ad5d6 JIRA Issue YARN-5928 JIRA Patch URL https://issues.apache.org/jira/secure/attachment/12848144/YARN-5928.06.patch Optional Tests asflicense compile javac javadoc mvninstall mvnsite unit xml findbugs checkstyle uname Linux f52d8948f02a 3.13.0-103-generic #150-Ubuntu SMP Thu Nov 24 10:34:17 UTC 2016 x86_64 x86_64 x86_64 GNU/Linux Build tool maven Personality /testptch/hadoop/patchprocess/precommit/personality/provided.sh git revision trunk / 72054a8 Default Java 1.8.0_111 findbugs v3.0.0 unit https://builds.apache.org/job/PreCommit-YARN-Build/14693/artifact/patchprocess/patch-unit-hadoop-yarn-project_hadoop-yarn_hadoop-yarn-server.txt unit https://builds.apache.org/job/PreCommit-YARN-Build/14693/artifact/patchprocess/patch-unit-hadoop-yarn-project_hadoop-yarn_hadoop-yarn-server_hadoop-yarn-server-resourcemanager.txt unit https://builds.apache.org/job/PreCommit-YARN-Build/14693/artifact/patchprocess/patch-unit-hadoop-yarn-project.txt Test Results https://builds.apache.org/job/PreCommit-YARN-Build/14693/testReport/ modules C: hadoop-project hadoop-yarn-project/hadoop-yarn/hadoop-yarn-server hadoop-yarn-project/hadoop-yarn/hadoop-yarn-server/hadoop-yarn-server-timelineservice hadoop-yarn-project/hadoop-yarn/hadoop-yarn-server/hadoop-yarn-server-resourcemanager hadoop-yarn-project/hadoop-yarn/hadoop-yarn-server/hadoop-yarn-server-timelineservice-hbase hadoop-yarn-project hadoop-yarn-project/hadoop-yarn/hadoop-yarn-server/hadoop-yarn-server-timelineservice-hbase-tests hadoop-yarn-project/hadoop-yarn/hadoop-yarn-site U: . Console output https://builds.apache.org/job/PreCommit-YARN-Build/14693/console Powered by Apache Yetus 0.5.0-SNAPSHOT http://yetus.apache.org This message was automatically generated.
        Hide
        sjlee0 Sangjin Lee added a comment -

        As mentioned in YARN-6064, the build on the branch is broken and that's causing the jenkins issues. I'll kick off the jenkins build again once that's fixed.

        Show
        sjlee0 Sangjin Lee added a comment - As mentioned in YARN-6064 , the build on the branch is broken and that's causing the jenkins issues. I'll kick off the jenkins build again once that's fixed.
        Hide
        hadoopqa Hadoop QA added a comment -
        -1 overall



        Vote Subsystem Runtime Comment
        0 reexec 0m 14s Docker mode activated.
        +1 @author 0m 0s The patch does not contain any @author tags.
        +1 test4tests 0m 0s The patch appears to include 8 new or modified test files.
        0 mvndep 1m 52s Maven dependency ordering for branch
        +1 mvninstall 15m 45s trunk passed
        +1 compile 12m 9s trunk passed
        +1 checkstyle 1m 53s trunk passed
        +1 mvnsite 8m 23s trunk passed
        +1 mvneclipse 2m 25s trunk passed
        0 findbugs 0m 0s Skipped patched modules with no Java source: hadoop-project hadoop-yarn-project/hadoop-yarn/hadoop-yarn-server hadoop-yarn-project/hadoop-yarn/hadoop-yarn-server/hadoop-yarn-server-timelineservice-hbase-tests hadoop-yarn-project/hadoop-yarn/hadoop-yarn-site hadoop-yarn-project
        +1 findbugs 1m 59s trunk passed
        +1 javadoc 4m 48s trunk passed
        0 mvndep 0m 17s Maven dependency ordering for patch
        +1 mvninstall 7m 10s the patch passed
        +1 compile 11m 32s the patch passed
        +1 javac 11m 32s the patch passed
        +1 checkstyle 1m 45s the patch passed
        +1 mvnsite 8m 29s the patch passed
        +1 mvneclipse 3m 11s the patch passed
        +1 whitespace 0m 0s The patch has no whitespace issues.
        +1 xml 0m 9s The patch has no ill-formed XML file.
        0 findbugs 0m 0s Skipped patched modules with no Java source: hadoop-project hadoop-yarn-project/hadoop-yarn/hadoop-yarn-server hadoop-yarn-project hadoop-yarn-project/hadoop-yarn/hadoop-yarn-server/hadoop-yarn-server-timelineservice-hbase-tests hadoop-yarn-project/hadoop-yarn/hadoop-yarn-site
        +1 findbugs 3m 2s the patch passed
        +1 javadoc 4m 45s the patch passed
        +1 unit 0m 15s hadoop-project in the patch passed.
        -1 unit 16m 37s hadoop-yarn-server in the patch failed.
        +1 unit 0m 53s hadoop-yarn-server-timelineservice in the patch passed.
        +1 unit 40m 39s hadoop-yarn-server-resourcemanager in the patch passed.
        +1 unit 0m 26s hadoop-yarn-server-timelineservice-hbase in the patch passed.
        -1 unit 22m 46s hadoop-yarn-project in the patch failed.
        +1 unit 4m 34s hadoop-yarn-server-timelineservice-hbase-tests in the patch passed.
        +1 unit 0m 20s hadoop-yarn-site in the patch passed.
        +1 asflicense 0m 39s The patch does not generate ASF License warnings.
        200m 54s



        Reason Tests
        Failed junit tests hadoop.yarn.server.timeline.webapp.TestTimelineWebServices
          hadoop.yarn.server.timeline.webapp.TestTimelineWebServices



        Subsystem Report/Notes
        Docker Image:yetus/hadoop:a9ad5d6
        JIRA Issue YARN-5928
        JIRA Patch URL https://issues.apache.org/jira/secure/attachment/12848144/YARN-5928.06.patch
        Optional Tests asflicense compile javac javadoc mvninstall mvnsite unit xml findbugs checkstyle
        uname Linux 21b6e5b4920a 3.13.0-105-generic #152-Ubuntu SMP Fri Dec 2 15:37:11 UTC 2016 x86_64 x86_64 x86_64 GNU/Linux
        Build tool maven
        Personality /testptch/hadoop/patchprocess/precommit/personality/provided.sh
        git revision trunk / 2bf4c6e
        Default Java 1.8.0_111
        findbugs v3.0.0
        unit https://builds.apache.org/job/PreCommit-YARN-Build/14697/artifact/patchprocess/patch-unit-hadoop-yarn-project_hadoop-yarn_hadoop-yarn-server.txt
        unit https://builds.apache.org/job/PreCommit-YARN-Build/14697/artifact/patchprocess/patch-unit-hadoop-yarn-project.txt
        Test Results https://builds.apache.org/job/PreCommit-YARN-Build/14697/testReport/
        modules C: hadoop-project hadoop-yarn-project/hadoop-yarn/hadoop-yarn-server hadoop-yarn-project/hadoop-yarn/hadoop-yarn-server/hadoop-yarn-server-timelineservice hadoop-yarn-project/hadoop-yarn/hadoop-yarn-server/hadoop-yarn-server-resourcemanager hadoop-yarn-project/hadoop-yarn/hadoop-yarn-server/hadoop-yarn-server-timelineservice-hbase hadoop-yarn-project hadoop-yarn-project/hadoop-yarn/hadoop-yarn-server/hadoop-yarn-server-timelineservice-hbase-tests hadoop-yarn-project/hadoop-yarn/hadoop-yarn-site U: .
        Console output https://builds.apache.org/job/PreCommit-YARN-Build/14697/console
        Powered by Apache Yetus 0.5.0-SNAPSHOT http://yetus.apache.org

        This message was automatically generated.

        Show
        hadoopqa Hadoop QA added a comment - -1 overall Vote Subsystem Runtime Comment 0 reexec 0m 14s Docker mode activated. +1 @author 0m 0s The patch does not contain any @author tags. +1 test4tests 0m 0s The patch appears to include 8 new or modified test files. 0 mvndep 1m 52s Maven dependency ordering for branch +1 mvninstall 15m 45s trunk passed +1 compile 12m 9s trunk passed +1 checkstyle 1m 53s trunk passed +1 mvnsite 8m 23s trunk passed +1 mvneclipse 2m 25s trunk passed 0 findbugs 0m 0s Skipped patched modules with no Java source: hadoop-project hadoop-yarn-project/hadoop-yarn/hadoop-yarn-server hadoop-yarn-project/hadoop-yarn/hadoop-yarn-server/hadoop-yarn-server-timelineservice-hbase-tests hadoop-yarn-project/hadoop-yarn/hadoop-yarn-site hadoop-yarn-project +1 findbugs 1m 59s trunk passed +1 javadoc 4m 48s trunk passed 0 mvndep 0m 17s Maven dependency ordering for patch +1 mvninstall 7m 10s the patch passed +1 compile 11m 32s the patch passed +1 javac 11m 32s the patch passed +1 checkstyle 1m 45s the patch passed +1 mvnsite 8m 29s the patch passed +1 mvneclipse 3m 11s the patch passed +1 whitespace 0m 0s The patch has no whitespace issues. +1 xml 0m 9s The patch has no ill-formed XML file. 0 findbugs 0m 0s Skipped patched modules with no Java source: hadoop-project hadoop-yarn-project/hadoop-yarn/hadoop-yarn-server hadoop-yarn-project hadoop-yarn-project/hadoop-yarn/hadoop-yarn-server/hadoop-yarn-server-timelineservice-hbase-tests hadoop-yarn-project/hadoop-yarn/hadoop-yarn-site +1 findbugs 3m 2s the patch passed +1 javadoc 4m 45s the patch passed +1 unit 0m 15s hadoop-project in the patch passed. -1 unit 16m 37s hadoop-yarn-server in the patch failed. +1 unit 0m 53s hadoop-yarn-server-timelineservice in the patch passed. +1 unit 40m 39s hadoop-yarn-server-resourcemanager in the patch passed. +1 unit 0m 26s hadoop-yarn-server-timelineservice-hbase in the patch passed. -1 unit 22m 46s hadoop-yarn-project in the patch failed. +1 unit 4m 34s hadoop-yarn-server-timelineservice-hbase-tests in the patch passed. +1 unit 0m 20s hadoop-yarn-site in the patch passed. +1 asflicense 0m 39s The patch does not generate ASF License warnings. 200m 54s Reason Tests Failed junit tests hadoop.yarn.server.timeline.webapp.TestTimelineWebServices   hadoop.yarn.server.timeline.webapp.TestTimelineWebServices Subsystem Report/Notes Docker Image:yetus/hadoop:a9ad5d6 JIRA Issue YARN-5928 JIRA Patch URL https://issues.apache.org/jira/secure/attachment/12848144/YARN-5928.06.patch Optional Tests asflicense compile javac javadoc mvninstall mvnsite unit xml findbugs checkstyle uname Linux 21b6e5b4920a 3.13.0-105-generic #152-Ubuntu SMP Fri Dec 2 15:37:11 UTC 2016 x86_64 x86_64 x86_64 GNU/Linux Build tool maven Personality /testptch/hadoop/patchprocess/precommit/personality/provided.sh git revision trunk / 2bf4c6e Default Java 1.8.0_111 findbugs v3.0.0 unit https://builds.apache.org/job/PreCommit-YARN-Build/14697/artifact/patchprocess/patch-unit-hadoop-yarn-project_hadoop-yarn_hadoop-yarn-server.txt unit https://builds.apache.org/job/PreCommit-YARN-Build/14697/artifact/patchprocess/patch-unit-hadoop-yarn-project.txt Test Results https://builds.apache.org/job/PreCommit-YARN-Build/14697/testReport/ modules C: hadoop-project hadoop-yarn-project/hadoop-yarn/hadoop-yarn-server hadoop-yarn-project/hadoop-yarn/hadoop-yarn-server/hadoop-yarn-server-timelineservice hadoop-yarn-project/hadoop-yarn/hadoop-yarn-server/hadoop-yarn-server-resourcemanager hadoop-yarn-project/hadoop-yarn/hadoop-yarn-server/hadoop-yarn-server-timelineservice-hbase hadoop-yarn-project hadoop-yarn-project/hadoop-yarn/hadoop-yarn-server/hadoop-yarn-server-timelineservice-hbase-tests hadoop-yarn-project/hadoop-yarn/hadoop-yarn-site U: . Console output https://builds.apache.org/job/PreCommit-YARN-Build/14697/console Powered by Apache Yetus 0.5.0-SNAPSHOT http://yetus.apache.org This message was automatically generated.
        Hide
        varun_saxena Varun Saxena added a comment -

        Kindly note that addendum for YARN-6064 which fixes the build issue has been committed.
        Sorry for the trouble.

        Show
        varun_saxena Varun Saxena added a comment - Kindly note that addendum for YARN-6064 which fixes the build issue has been committed. Sorry for the trouble.
        Hide
        hadoopqa Hadoop QA added a comment -
        -1 overall



        Vote Subsystem Runtime Comment
        0 reexec 0m 13s Docker mode activated.
        +1 @author 0m 0s The patch does not contain any @author tags.
        +1 test4tests 0m 0s The patch appears to include 8 new or modified test files.
        0 mvndep 0m 15s Maven dependency ordering for branch
        +1 mvninstall 13m 27s trunk passed
        +1 compile 11m 8s trunk passed
        +1 checkstyle 1m 40s trunk passed
        +1 mvnsite 7m 2s trunk passed
        +1 mvneclipse 2m 12s trunk passed
        0 findbugs 0m 0s Skipped patched modules with no Java source: hadoop-project hadoop-yarn-project/hadoop-yarn/hadoop-yarn-server hadoop-yarn-project/hadoop-yarn/hadoop-yarn-server/hadoop-yarn-server-timelineservice-hbase-tests hadoop-yarn-project/hadoop-yarn/hadoop-yarn-site hadoop-yarn-project
        +1 findbugs 1m 49s trunk passed
        +1 javadoc 3m 52s trunk passed
        0 mvndep 0m 15s Maven dependency ordering for patch
        +1 mvninstall 5m 47s the patch passed
        +1 compile 10m 9s the patch passed
        +1 javac 10m 9s the patch passed
        +1 checkstyle 1m 42s the patch passed
        +1 mvnsite 7m 5s the patch passed
        +1 mvneclipse 2m 44s the patch passed
        +1 whitespace 0m 0s The patch has no whitespace issues.
        +1 xml 0m 7s The patch has no ill-formed XML file.
        0 findbugs 0m 0s Skipped patched modules with no Java source: hadoop-project hadoop-yarn-project/hadoop-yarn/hadoop-yarn-server hadoop-yarn-project hadoop-yarn-project/hadoop-yarn/hadoop-yarn-server/hadoop-yarn-server-timelineservice-hbase-tests hadoop-yarn-project/hadoop-yarn/hadoop-yarn-site
        +1 findbugs 2m 35s the patch passed
        +1 javadoc 4m 27s the patch passed
        +1 unit 0m 15s hadoop-project in the patch passed.
        -1 unit 16m 46s hadoop-yarn-server in the patch failed.
        +1 unit 0m 57s hadoop-yarn-server-timelineservice in the patch passed.
        -1 unit 40m 27s hadoop-yarn-server-resourcemanager in the patch failed.
        +1 unit 0m 26s hadoop-yarn-server-timelineservice-hbase in the patch passed.
        -1 unit 22m 20s hadoop-yarn-project in the patch failed.
        +1 unit 4m 39s hadoop-yarn-server-timelineservice-hbase-tests in the patch passed.
        +1 unit 0m 21s hadoop-yarn-site in the patch passed.
        +1 asflicense 0m 43s The patch does not generate ASF License warnings.
        187m 20s



        Reason Tests
        Failed junit tests hadoop.yarn.server.resourcemanager.TestRMRestart
          hadoop.yarn.server.timeline.webapp.TestTimelineWebServices
          hadoop.yarn.server.resourcemanager.TestRMRestart
          hadoop.yarn.server.resourcemanager.TestRMRestart
          hadoop.yarn.server.timeline.webapp.TestTimelineWebServices



        Subsystem Report/Notes
        Docker Image:yetus/hadoop:a9ad5d6
        JIRA Issue YARN-5928
        JIRA Patch URL https://issues.apache.org/jira/secure/attachment/12848144/YARN-5928.06.patch
        Optional Tests asflicense compile javac javadoc mvninstall mvnsite unit xml findbugs checkstyle
        uname Linux 206e5a9f04d5 3.13.0-95-generic #142-Ubuntu SMP Fri Aug 12 17:00:09 UTC 2016 x86_64 x86_64 x86_64 GNU/Linux
        Build tool maven
        Personality /testptch/hadoop/patchprocess/precommit/personality/provided.sh
        git revision trunk / 724bb86
        Default Java 1.8.0_111
        findbugs v3.0.0
        unit https://builds.apache.org/job/PreCommit-YARN-Build/14701/artifact/patchprocess/patch-unit-hadoop-yarn-project_hadoop-yarn_hadoop-yarn-server.txt
        unit https://builds.apache.org/job/PreCommit-YARN-Build/14701/artifact/patchprocess/patch-unit-hadoop-yarn-project_hadoop-yarn_hadoop-yarn-server_hadoop-yarn-server-resourcemanager.txt
        unit https://builds.apache.org/job/PreCommit-YARN-Build/14701/artifact/patchprocess/patch-unit-hadoop-yarn-project.txt
        Test Results https://builds.apache.org/job/PreCommit-YARN-Build/14701/testReport/
        modules C: hadoop-project hadoop-yarn-project/hadoop-yarn/hadoop-yarn-server hadoop-yarn-project/hadoop-yarn/hadoop-yarn-server/hadoop-yarn-server-timelineservice hadoop-yarn-project/hadoop-yarn/hadoop-yarn-server/hadoop-yarn-server-resourcemanager hadoop-yarn-project/hadoop-yarn/hadoop-yarn-server/hadoop-yarn-server-timelineservice-hbase hadoop-yarn-project hadoop-yarn-project/hadoop-yarn/hadoop-yarn-server/hadoop-yarn-server-timelineservice-hbase-tests hadoop-yarn-project/hadoop-yarn/hadoop-yarn-site U: .
        Console output https://builds.apache.org/job/PreCommit-YARN-Build/14701/console
        Powered by Apache Yetus 0.5.0-SNAPSHOT http://yetus.apache.org

        This message was automatically generated.

        Show
        hadoopqa Hadoop QA added a comment - -1 overall Vote Subsystem Runtime Comment 0 reexec 0m 13s Docker mode activated. +1 @author 0m 0s The patch does not contain any @author tags. +1 test4tests 0m 0s The patch appears to include 8 new or modified test files. 0 mvndep 0m 15s Maven dependency ordering for branch +1 mvninstall 13m 27s trunk passed +1 compile 11m 8s trunk passed +1 checkstyle 1m 40s trunk passed +1 mvnsite 7m 2s trunk passed +1 mvneclipse 2m 12s trunk passed 0 findbugs 0m 0s Skipped patched modules with no Java source: hadoop-project hadoop-yarn-project/hadoop-yarn/hadoop-yarn-server hadoop-yarn-project/hadoop-yarn/hadoop-yarn-server/hadoop-yarn-server-timelineservice-hbase-tests hadoop-yarn-project/hadoop-yarn/hadoop-yarn-site hadoop-yarn-project +1 findbugs 1m 49s trunk passed +1 javadoc 3m 52s trunk passed 0 mvndep 0m 15s Maven dependency ordering for patch +1 mvninstall 5m 47s the patch passed +1 compile 10m 9s the patch passed +1 javac 10m 9s the patch passed +1 checkstyle 1m 42s the patch passed +1 mvnsite 7m 5s the patch passed +1 mvneclipse 2m 44s the patch passed +1 whitespace 0m 0s The patch has no whitespace issues. +1 xml 0m 7s The patch has no ill-formed XML file. 0 findbugs 0m 0s Skipped patched modules with no Java source: hadoop-project hadoop-yarn-project/hadoop-yarn/hadoop-yarn-server hadoop-yarn-project hadoop-yarn-project/hadoop-yarn/hadoop-yarn-server/hadoop-yarn-server-timelineservice-hbase-tests hadoop-yarn-project/hadoop-yarn/hadoop-yarn-site +1 findbugs 2m 35s the patch passed +1 javadoc 4m 27s the patch passed +1 unit 0m 15s hadoop-project in the patch passed. -1 unit 16m 46s hadoop-yarn-server in the patch failed. +1 unit 0m 57s hadoop-yarn-server-timelineservice in the patch passed. -1 unit 40m 27s hadoop-yarn-server-resourcemanager in the patch failed. +1 unit 0m 26s hadoop-yarn-server-timelineservice-hbase in the patch passed. -1 unit 22m 20s hadoop-yarn-project in the patch failed. +1 unit 4m 39s hadoop-yarn-server-timelineservice-hbase-tests in the patch passed. +1 unit 0m 21s hadoop-yarn-site in the patch passed. +1 asflicense 0m 43s The patch does not generate ASF License warnings. 187m 20s Reason Tests Failed junit tests hadoop.yarn.server.resourcemanager.TestRMRestart   hadoop.yarn.server.timeline.webapp.TestTimelineWebServices   hadoop.yarn.server.resourcemanager.TestRMRestart   hadoop.yarn.server.resourcemanager.TestRMRestart   hadoop.yarn.server.timeline.webapp.TestTimelineWebServices Subsystem Report/Notes Docker Image:yetus/hadoop:a9ad5d6 JIRA Issue YARN-5928 JIRA Patch URL https://issues.apache.org/jira/secure/attachment/12848144/YARN-5928.06.patch Optional Tests asflicense compile javac javadoc mvninstall mvnsite unit xml findbugs checkstyle uname Linux 206e5a9f04d5 3.13.0-95-generic #142-Ubuntu SMP Fri Aug 12 17:00:09 UTC 2016 x86_64 x86_64 x86_64 GNU/Linux Build tool maven Personality /testptch/hadoop/patchprocess/precommit/personality/provided.sh git revision trunk / 724bb86 Default Java 1.8.0_111 findbugs v3.0.0 unit https://builds.apache.org/job/PreCommit-YARN-Build/14701/artifact/patchprocess/patch-unit-hadoop-yarn-project_hadoop-yarn_hadoop-yarn-server.txt unit https://builds.apache.org/job/PreCommit-YARN-Build/14701/artifact/patchprocess/patch-unit-hadoop-yarn-project_hadoop-yarn_hadoop-yarn-server_hadoop-yarn-server-resourcemanager.txt unit https://builds.apache.org/job/PreCommit-YARN-Build/14701/artifact/patchprocess/patch-unit-hadoop-yarn-project.txt Test Results https://builds.apache.org/job/PreCommit-YARN-Build/14701/testReport/ modules C: hadoop-project hadoop-yarn-project/hadoop-yarn/hadoop-yarn-server hadoop-yarn-project/hadoop-yarn/hadoop-yarn-server/hadoop-yarn-server-timelineservice hadoop-yarn-project/hadoop-yarn/hadoop-yarn-server/hadoop-yarn-server-resourcemanager hadoop-yarn-project/hadoop-yarn/hadoop-yarn-server/hadoop-yarn-server-timelineservice-hbase hadoop-yarn-project hadoop-yarn-project/hadoop-yarn/hadoop-yarn-server/hadoop-yarn-server-timelineservice-hbase-tests hadoop-yarn-project/hadoop-yarn/hadoop-yarn-site U: . Console output https://builds.apache.org/job/PreCommit-YARN-Build/14701/console Powered by Apache Yetus 0.5.0-SNAPSHOT http://yetus.apache.org This message was automatically generated.
        Hide
        haibochen Haibo Chen added a comment -

        As before, the unit tests are not related.

        Show
        haibochen Haibo Chen added a comment - As before, the unit tests are not related.
        Hide
        sjlee0 Sangjin Lee added a comment -

        Haibo Chen, now that YARN-6094 has been committed, do you mind looking over the changes to see if anything needs to be updated (e.g. documentation)? I'm not sure if anything should change, but wanted to double check. Once we're clean, I can go ahead and commit it.

        Show
        sjlee0 Sangjin Lee added a comment - Haibo Chen , now that YARN-6094 has been committed, do you mind looking over the changes to see if anything needs to be updated (e.g. documentation)? I'm not sure if anything should change, but wanted to double check. Once we're clean, I can go ahead and commit it.
        Hide
        haibochen Haibo Chen added a comment -

        Uploading a new patch for branch YARN-5355 to resolve the documentation conflict with YARN-6094. The trunk patch is not impacted.

        Show
        haibochen Haibo Chen added a comment - Uploading a new patch for branch YARN-5355 to resolve the documentation conflict with YARN-6094 . The trunk patch is not impacted.
        Hide
        sjlee0 Sangjin Lee added a comment -

        Thanks Haibo Chen!

        Actually only the former argument needs to be updated. Thus, instead of

        226	    hadoop fs -put hadoop-yarn-server-timelineservice-hbase-3.0.0-alpha1-SNAPSHOT.jar
        227	           /hbase/coprocessor/hadoop-yarn-server-timelineservice-hbase.jar
        

        it should be

        226	    hadoop fs -put hadoop-yarn-server-timelineservice-hbase-3.0.0-alpha1-SNAPSHOT.jar
        227	           /hbase/coprocessor/hadoop-yarn-server-timelineservice.jar
        

        If you don't object, I'll update that line and commit it once jenkins returns with a clean build.

        Show
        sjlee0 Sangjin Lee added a comment - Thanks Haibo Chen ! Actually only the former argument needs to be updated. Thus, instead of 226 hadoop fs -put hadoop-yarn-server-timelineservice-hbase-3.0.0-alpha1-SNAPSHOT.jar 227 /hbase/coprocessor/hadoop-yarn-server-timelineservice-hbase.jar it should be 226 hadoop fs -put hadoop-yarn-server-timelineservice-hbase-3.0.0-alpha1-SNAPSHOT.jar 227 /hbase/coprocessor/hadoop-yarn-server-timelineservice.jar If you don't object, I'll update that line and commit it once jenkins returns with a clean build.
        Hide
        hadoopqa Hadoop QA added a comment -
        -1 overall



        Vote Subsystem Runtime Comment
        0 reexec 0m 16s Docker mode activated.
        +1 @author 0m 0s The patch does not contain any @author tags.
        +1 test4tests 0m 0s The patch appears to include 9 new or modified test files.
        0 mvndep 0m 56s Maven dependency ordering for branch
        +1 mvninstall 8m 24s YARN-5355 passed
        +1 compile 7m 56s YARN-5355 passed
        +1 checkstyle 2m 2s YARN-5355 passed
        +1 mvnsite 7m 34s YARN-5355 passed
        +1 mvneclipse 2m 6s YARN-5355 passed
        0 findbugs 0m 0s Skipped patched modules with no Java source: hadoop-project hadoop-yarn-project/hadoop-yarn/hadoop-yarn-server hadoop-yarn-project/hadoop-yarn/hadoop-yarn-server/hadoop-yarn-server-timelineservice-hbase-tests hadoop-yarn-project/hadoop-yarn/hadoop-yarn-site hadoop-yarn-project
        +1 findbugs 1m 37s YARN-5355 passed
        +1 javadoc 3m 46s YARN-5355 passed
        0 mvndep 0m 18s Maven dependency ordering for patch
        +1 mvninstall 6m 12s the patch passed
        +1 compile 7m 54s the patch passed
        +1 javac 7m 54s the patch passed
        +1 checkstyle 1m 36s the patch passed
        +1 mvnsite 8m 0s the patch passed
        +1 mvneclipse 2m 47s the patch passed
        +1 whitespace 0m 0s The patch has no whitespace issues.
        +1 xml 0m 9s The patch has no ill-formed XML file.
        0 findbugs 0m 0s Skipped patched modules with no Java source: hadoop-project hadoop-yarn-project/hadoop-yarn/hadoop-yarn-server hadoop-yarn-project/hadoop-yarn/hadoop-yarn-server/hadoop-yarn-server-timelineservice-hbase-tests hadoop-yarn-project/hadoop-yarn/hadoop-yarn-site hadoop-yarn-project
        +1 findbugs 2m 45s the patch passed
        +1 javadoc 4m 36s the patch passed
        +1 unit 0m 14s hadoop-project in the patch passed.
        -1 unit 59m 20s hadoop-yarn-server in the patch failed.
        +1 unit 0m 50s hadoop-yarn-server-timelineservice in the patch passed.
        +1 unit 34m 43s hadoop-yarn-server-resourcemanager in the patch passed.
        +1 unit 0m 22s hadoop-yarn-server-timelineservice-hbase in the patch passed.
        +1 unit 5m 14s hadoop-yarn-server-timelineservice-hbase-tests in the patch passed.
        +1 unit 0m 12s hadoop-yarn-site in the patch passed.
        -1 unit 72m 12s hadoop-yarn-project in the patch failed.
        +1 asflicense 0m 30s The patch does not generate ASF License warnings.
        266m 4s



        Reason Tests
        Failed junit tests hadoop.yarn.server.TestMiniYarnClusterNodeUtilization
          hadoop.yarn.server.TestContainerManagerSecurity
          hadoop.yarn.server.TestMiniYarnClusterNodeUtilization
          hadoop.yarn.server.TestContainerManagerSecurity



        Subsystem Report/Notes
        Docker Image:yetus/hadoop:9560f25
        JIRA Issue YARN-5928
        JIRA Patch URL https://issues.apache.org/jira/secure/attachment/12848415/YARN-5928-YARN-5355.07.patch
        Optional Tests asflicense compile javac javadoc mvninstall mvnsite unit xml findbugs checkstyle
        uname Linux f8bb8316417f 3.13.0-95-generic #142-Ubuntu SMP Fri Aug 12 17:00:09 UTC 2016 x86_64 x86_64 x86_64 GNU/Linux
        Build tool maven
        Personality /testptch/hadoop/patchprocess/precommit/personality/provided.sh
        git revision YARN-5355 / 0327a79
        Default Java 1.8.0_111
        findbugs v3.0.0
        unit https://builds.apache.org/job/PreCommit-YARN-Build/14711/artifact/patchprocess/patch-unit-hadoop-yarn-project_hadoop-yarn_hadoop-yarn-server.txt
        unit https://builds.apache.org/job/PreCommit-YARN-Build/14711/artifact/patchprocess/patch-unit-hadoop-yarn-project.txt
        Test Results https://builds.apache.org/job/PreCommit-YARN-Build/14711/testReport/
        modules C: hadoop-project hadoop-yarn-project/hadoop-yarn/hadoop-yarn-server hadoop-yarn-project/hadoop-yarn/hadoop-yarn-server/hadoop-yarn-server-timelineservice hadoop-yarn-project/hadoop-yarn/hadoop-yarn-server/hadoop-yarn-server-resourcemanager hadoop-yarn-project/hadoop-yarn/hadoop-yarn-server/hadoop-yarn-server-timelineservice-hbase hadoop-yarn-project/hadoop-yarn/hadoop-yarn-server/hadoop-yarn-server-timelineservice-hbase-tests hadoop-yarn-project/hadoop-yarn/hadoop-yarn-site hadoop-yarn-project U: .
        Console output https://builds.apache.org/job/PreCommit-YARN-Build/14711/console
        Powered by Apache Yetus 0.5.0-SNAPSHOT http://yetus.apache.org

        This message was automatically generated.

        Show
        hadoopqa Hadoop QA added a comment - -1 overall Vote Subsystem Runtime Comment 0 reexec 0m 16s Docker mode activated. +1 @author 0m 0s The patch does not contain any @author tags. +1 test4tests 0m 0s The patch appears to include 9 new or modified test files. 0 mvndep 0m 56s Maven dependency ordering for branch +1 mvninstall 8m 24s YARN-5355 passed +1 compile 7m 56s YARN-5355 passed +1 checkstyle 2m 2s YARN-5355 passed +1 mvnsite 7m 34s YARN-5355 passed +1 mvneclipse 2m 6s YARN-5355 passed 0 findbugs 0m 0s Skipped patched modules with no Java source: hadoop-project hadoop-yarn-project/hadoop-yarn/hadoop-yarn-server hadoop-yarn-project/hadoop-yarn/hadoop-yarn-server/hadoop-yarn-server-timelineservice-hbase-tests hadoop-yarn-project/hadoop-yarn/hadoop-yarn-site hadoop-yarn-project +1 findbugs 1m 37s YARN-5355 passed +1 javadoc 3m 46s YARN-5355 passed 0 mvndep 0m 18s Maven dependency ordering for patch +1 mvninstall 6m 12s the patch passed +1 compile 7m 54s the patch passed +1 javac 7m 54s the patch passed +1 checkstyle 1m 36s the patch passed +1 mvnsite 8m 0s the patch passed +1 mvneclipse 2m 47s the patch passed +1 whitespace 0m 0s The patch has no whitespace issues. +1 xml 0m 9s The patch has no ill-formed XML file. 0 findbugs 0m 0s Skipped patched modules with no Java source: hadoop-project hadoop-yarn-project/hadoop-yarn/hadoop-yarn-server hadoop-yarn-project/hadoop-yarn/hadoop-yarn-server/hadoop-yarn-server-timelineservice-hbase-tests hadoop-yarn-project/hadoop-yarn/hadoop-yarn-site hadoop-yarn-project +1 findbugs 2m 45s the patch passed +1 javadoc 4m 36s the patch passed +1 unit 0m 14s hadoop-project in the patch passed. -1 unit 59m 20s hadoop-yarn-server in the patch failed. +1 unit 0m 50s hadoop-yarn-server-timelineservice in the patch passed. +1 unit 34m 43s hadoop-yarn-server-resourcemanager in the patch passed. +1 unit 0m 22s hadoop-yarn-server-timelineservice-hbase in the patch passed. +1 unit 5m 14s hadoop-yarn-server-timelineservice-hbase-tests in the patch passed. +1 unit 0m 12s hadoop-yarn-site in the patch passed. -1 unit 72m 12s hadoop-yarn-project in the patch failed. +1 asflicense 0m 30s The patch does not generate ASF License warnings. 266m 4s Reason Tests Failed junit tests hadoop.yarn.server.TestMiniYarnClusterNodeUtilization   hadoop.yarn.server.TestContainerManagerSecurity   hadoop.yarn.server.TestMiniYarnClusterNodeUtilization   hadoop.yarn.server.TestContainerManagerSecurity Subsystem Report/Notes Docker Image:yetus/hadoop:9560f25 JIRA Issue YARN-5928 JIRA Patch URL https://issues.apache.org/jira/secure/attachment/12848415/YARN-5928-YARN-5355.07.patch Optional Tests asflicense compile javac javadoc mvninstall mvnsite unit xml findbugs checkstyle uname Linux f8bb8316417f 3.13.0-95-generic #142-Ubuntu SMP Fri Aug 12 17:00:09 UTC 2016 x86_64 x86_64 x86_64 GNU/Linux Build tool maven Personality /testptch/hadoop/patchprocess/precommit/personality/provided.sh git revision YARN-5355 / 0327a79 Default Java 1.8.0_111 findbugs v3.0.0 unit https://builds.apache.org/job/PreCommit-YARN-Build/14711/artifact/patchprocess/patch-unit-hadoop-yarn-project_hadoop-yarn_hadoop-yarn-server.txt unit https://builds.apache.org/job/PreCommit-YARN-Build/14711/artifact/patchprocess/patch-unit-hadoop-yarn-project.txt Test Results https://builds.apache.org/job/PreCommit-YARN-Build/14711/testReport/ modules C: hadoop-project hadoop-yarn-project/hadoop-yarn/hadoop-yarn-server hadoop-yarn-project/hadoop-yarn/hadoop-yarn-server/hadoop-yarn-server-timelineservice hadoop-yarn-project/hadoop-yarn/hadoop-yarn-server/hadoop-yarn-server-resourcemanager hadoop-yarn-project/hadoop-yarn/hadoop-yarn-server/hadoop-yarn-server-timelineservice-hbase hadoop-yarn-project/hadoop-yarn/hadoop-yarn-server/hadoop-yarn-server-timelineservice-hbase-tests hadoop-yarn-project/hadoop-yarn/hadoop-yarn-site hadoop-yarn-project U: . Console output https://builds.apache.org/job/PreCommit-YARN-Build/14711/console Powered by Apache Yetus 0.5.0-SNAPSHOT http://yetus.apache.org This message was automatically generated.
        Hide
        sjlee0 Sangjin Lee added a comment -

        The latest patches LGTM. Will commit shortly.

        Show
        sjlee0 Sangjin Lee added a comment - The latest patches LGTM. Will commit shortly.
        Hide
        sjlee0 Sangjin Lee added a comment -

        Since this is targeted for 3.0.0-alpha2, I'm merging this to branch-3.0.0-alpha2 as well as trunk.

        cc Andrew Wang

        Show
        sjlee0 Sangjin Lee added a comment - Since this is targeted for 3.0.0-alpha2, I'm merging this to branch-3.0.0-alpha2 as well as trunk. cc Andrew Wang
        Hide
        hudson Hudson added a comment -

        SUCCESS: Integrated in Jenkins build Hadoop-trunk-Commit #11152 (See https://builds.apache.org/job/Hadoop-trunk-Commit/11152/)
        YARN-5928. Move ATSv2 HBase backend code into a new module that is only (sjlee: rev b01514f65bc6090a50a583f67d1ecb5d74b6d276)

        • (add) hadoop-yarn-project/hadoop-yarn/hadoop-yarn-server/hadoop-yarn-server-timelineservice-hbase/src/main/java/org/apache/hadoop/yarn/server/timelineservice/storage/flow/FlowActivityRowKeyPrefix.java
        • (add) hadoop-yarn-project/hadoop-yarn/hadoop-yarn-server/hadoop-yarn-server-timelineservice-hbase/src/main/java/org/apache/hadoop/yarn/server/timelineservice/storage/common/TypedBufferedMutator.java
        • (delete) hadoop-yarn-project/hadoop-yarn/hadoop-yarn-server/hadoop-yarn-server-timelineservice/src/main/java/org/apache/hadoop/yarn/server/timelineservice/storage/flow/FlowActivityRowKey.java
        • (delete) hadoop-yarn-project/hadoop-yarn/hadoop-yarn-server/hadoop-yarn-server-timelineservice/src/main/java/org/apache/hadoop/yarn/server/timelineservice/storage/application/ApplicationColumnPrefix.java
        • (add) hadoop-yarn-project/hadoop-yarn/hadoop-yarn-server/hadoop-yarn-server-timelineservice-hbase/src/main/java/org/apache/hadoop/yarn/server/timelineservice/storage/common/ValueConverter.java
        • (add) hadoop-yarn-project/hadoop-yarn/hadoop-yarn-server/hadoop-yarn-server-timelineservice-hbase/src/main/java/org/apache/hadoop/yarn/server/timelineservice/reader/filter/TimelineFilterUtils.java
        • (delete) hadoop-yarn-project/hadoop-yarn/hadoop-yarn-server/hadoop-yarn-server-timelineservice/src/main/java/org/apache/hadoop/yarn/server/timelineservice/storage/application/ApplicationColumn.java
        • (add) hadoop-yarn-project/hadoop-yarn/hadoop-yarn-server/hadoop-yarn-server-timelineservice-hbase/src/main/java/org/apache/hadoop/yarn/server/timelineservice/storage/application/package-info.java
        • (add) hadoop-yarn-project/hadoop-yarn/hadoop-yarn-server/hadoop-yarn-server-timelineservice-hbase/src/main/java/org/apache/hadoop/yarn/server/timelineservice/storage/flow/AggregationCompactionDimension.java
        • (add) hadoop-yarn-project/hadoop-yarn/hadoop-yarn-server/hadoop-yarn-server-timelineservice-hbase/src/main/java/org/apache/hadoop/yarn/server/timelineservice/storage/package-info.java
        • (delete) hadoop-yarn-project/hadoop-yarn/hadoop-yarn-server/hadoop-yarn-server-timelineservice/src/main/java/org/apache/hadoop/yarn/server/timelineservice/storage/flow/AggregationCompactionDimension.java
        • (delete) hadoop-yarn-project/hadoop-yarn/hadoop-yarn-server/hadoop-yarn-server-timelineservice/src/main/java/org/apache/hadoop/yarn/server/timelineservice/storage/flow/FlowActivityColumnPrefix.java
        • (add) hadoop-yarn-project/hadoop-yarn/hadoop-yarn-server/hadoop-yarn-server-timelineservice-hbase/src/main/java/org/apache/hadoop/yarn/server/timelineservice/storage/flow/FlowRunRowKey.java
        • (edit) hadoop-yarn-project/hadoop-yarn/hadoop-yarn-server/pom.xml
        • (delete) hadoop-yarn-project/hadoop-yarn/hadoop-yarn-server/hadoop-yarn-server-timelineservice/src/main/java/org/apache/hadoop/yarn/server/timelineservice/storage/reader/FlowActivityEntityReader.java
        • (add) hadoop-yarn-project/hadoop-yarn/hadoop-yarn-server/hadoop-yarn-server-timelineservice-hbase/src/main/java/org/apache/hadoop/yarn/server/timelineservice/storage/reader/package-info.java
        • (delete) hadoop-yarn-project/hadoop-yarn/hadoop-yarn-server/hadoop-yarn-server-timelineservice/src/main/java/org/apache/hadoop/yarn/server/timelineservice/storage/apptoflow/AppToFlowColumn.java
        • (add) hadoop-yarn-project/hadoop-yarn/hadoop-yarn-server/hadoop-yarn-server-timelineservice-hbase/src/main/java/org/apache/hadoop/yarn/server/timelineservice/storage/entity/EntityTable.java
        • (add) hadoop-yarn-project/hadoop-yarn/hadoop-yarn-server/hadoop-yarn-server-timelineservice-hbase/src/main/java/org/apache/hadoop/yarn/server/timelineservice/storage/common/ColumnPrefix.java
        • (add) hadoop-yarn-project/hadoop-yarn/hadoop-yarn-server/hadoop-yarn-server-timelineservice-hbase/src/main/java/org/apache/hadoop/yarn/server/timelineservice/storage/apptoflow/AppToFlowRowKey.java
        • (delete) hadoop-yarn-project/hadoop-yarn/hadoop-yarn-server/hadoop-yarn-server-timelineservice/src/main/java/org/apache/hadoop/yarn/server/timelineservice/storage/common/StringKeyConverter.java
        • (delete) hadoop-yarn-project/hadoop-yarn/hadoop-yarn-server/hadoop-yarn-server-timelineservice/src/main/java/org/apache/hadoop/yarn/server/timelineservice/storage/flow/FlowScanner.java
        • (add) hadoop-yarn-project/hadoop-yarn/hadoop-yarn-server/hadoop-yarn-server-timelineservice-hbase/src/main/java/org/apache/hadoop/yarn/server/timelineservice/storage/common/BaseTable.java
        • (delete) hadoop-yarn-project/hadoop-yarn/hadoop-yarn-server/hadoop-yarn-server-timelineservice/src/main/java/org/apache/hadoop/yarn/server/timelineservice/storage/TimelineSchemaCreator.java
        • (add) hadoop-yarn-project/hadoop-yarn/hadoop-yarn-server/hadoop-yarn-server-timelineservice-hbase/src/test/java/org/apache/hadoop/yarn/server/timelineservice/storage/common/TestKeyConverters.java
        • (edit) hadoop-yarn-project/hadoop-yarn/hadoop-yarn-server/hadoop-yarn-server-timelineservice/pom.xml
        • (add) hadoop-yarn-project/hadoop-yarn/hadoop-yarn-server/hadoop-yarn-server-timelineservice-hbase/src/main/java/org/apache/hadoop/yarn/server/timelineservice/storage/common/GenericConverter.java
        • (add) hadoop-yarn-project/hadoop-yarn/hadoop-yarn-server/hadoop-yarn-server-timelineservice-hbase/src/main/java/org/apache/hadoop/yarn/server/timelineservice/storage/TimelineSchemaCreator.java
        • (delete) hadoop-yarn-project/hadoop-yarn/hadoop-yarn-server/hadoop-yarn-server-timelineservice/src/main/java/org/apache/hadoop/yarn/server/timelineservice/storage/reader/TimelineEntityReaderFactory.java
        • (add) hadoop-yarn-project/hadoop-yarn/hadoop-yarn-server/hadoop-yarn-server-timelineservice-hbase/src/main/java/org/apache/hadoop/yarn/server/timelineservice/storage/common/ColumnFamily.java
        • (delete) hadoop-yarn-project/hadoop-yarn/hadoop-yarn-server/hadoop-yarn-server-timelineservice/src/main/java/org/apache/hadoop/yarn/server/timelineservice/storage/reader/GenericEntityReader.java
        • (add) hadoop-yarn-project/hadoop-yarn/hadoop-yarn-server/hadoop-yarn-server-timelineservice-hbase/src/main/java/org/apache/hadoop/yarn/server/timelineservice/storage/flow/package-info.java
        • (add) hadoop-yarn-project/hadoop-yarn/hadoop-yarn-server/hadoop-yarn-server-timelineservice-hbase/src/main/java/org/apache/hadoop/yarn/server/timelineservice/storage/apptoflow/AppToFlowTable.java
        • (delete) hadoop-yarn-project/hadoop-yarn/hadoop-yarn-server/hadoop-yarn-server-timelineservice/src/main/java/org/apache/hadoop/yarn/server/timelineservice/storage/common/ColumnPrefix.java
        • (delete) hadoop-yarn-project/hadoop-yarn/hadoop-yarn-server/hadoop-yarn-server-timelineservice/src/main/java/org/apache/hadoop/yarn/server/timelineservice/storage/common/TimelineHBaseSchemaConstants.java
        • (edit) hadoop-yarn-project/hadoop-yarn/hadoop-yarn-server/hadoop-yarn-server-timelineservice-hbase-tests/pom.xml
        • (delete) hadoop-yarn-project/hadoop-yarn/hadoop-yarn-server/hadoop-yarn-server-timelineservice/src/main/java/org/apache/hadoop/yarn/server/timelineservice/storage/common/ColumnHelper.java
        • (delete) hadoop-yarn-project/hadoop-yarn/hadoop-yarn-server/hadoop-yarn-server-timelineservice/src/main/java/org/apache/hadoop/yarn/server/timelineservice/storage/common/EventColumnNameConverter.java
        • (add) hadoop-yarn-project/hadoop-yarn/hadoop-yarn-server/hadoop-yarn-server-timelineservice-hbase/src/main/java/org/apache/hadoop/yarn/server/timelineservice/storage/apptoflow/AppToFlowColumnFamily.java
        • (add) hadoop-yarn-project/hadoop-yarn/hadoop-yarn-server/hadoop-yarn-server-timelineservice-hbase/src/main/java/org/apache/hadoop/yarn/server/timelineservice/storage/common/Separator.java
        • (add) hadoop-yarn-project/hadoop-yarn/hadoop-yarn-server/hadoop-yarn-server-timelineservice-hbase/src/main/java/org/apache/hadoop/yarn/server/timelineservice/storage/reader/TimelineEntityReaderFactory.java
        • (add) hadoop-yarn-project/hadoop-yarn/hadoop-yarn-server/hadoop-yarn-server-timelineservice-hbase/src/main/java/org/apache/hadoop/yarn/server/timelineservice/storage/flow/FlowRunColumnPrefix.java
        • (delete) hadoop-yarn-project/hadoop-yarn/hadoop-yarn-server/hadoop-yarn-server-timelineservice/src/main/java/org/apache/hadoop/yarn/server/timelineservice/storage/common/BaseTable.java
        • (delete) hadoop-yarn-project/hadoop-yarn/hadoop-yarn-server/hadoop-yarn-server-timelineservice/src/main/java/org/apache/hadoop/yarn/server/timelineservice/storage/reader/ApplicationEntityReader.java
        • (delete) hadoop-yarn-project/hadoop-yarn/hadoop-yarn-server/hadoop-yarn-server-timelineservice/src/main/java/org/apache/hadoop/yarn/server/timelineservice/storage/flow/FlowRunRowKeyPrefix.java
        • (add) hadoop-yarn-project/hadoop-yarn/hadoop-yarn-server/hadoop-yarn-server-timelineservice-hbase/src/main/java/org/apache/hadoop/yarn/server/timelineservice/storage/common/EventColumnNameConverter.java
        • (delete) hadoop-yarn-project/hadoop-yarn/hadoop-yarn-server/hadoop-yarn-server-timelineservice/src/main/java/org/apache/hadoop/yarn/server/timelineservice/storage/common/TypedBufferedMutator.java
        • (add) hadoop-yarn-project/hadoop-yarn/hadoop-yarn-server/hadoop-yarn-server-timelineservice-hbase/src/main/java/org/apache/hadoop/yarn/server/timelineservice/storage/entity/EntityColumnFamily.java
        • (delete) hadoop-yarn-project/hadoop-yarn/hadoop-yarn-server/hadoop-yarn-server-timelineservice/src/main/java/org/apache/hadoop/yarn/server/timelineservice/storage/reader/package-info.java
        • (delete) hadoop-yarn-project/hadoop-yarn/hadoop-yarn-server/hadoop-yarn-server-timelineservice/src/main/java/org/apache/hadoop/yarn/server/timelineservice/storage/flow/FlowRunColumn.java
        • (add) hadoop-yarn-project/hadoop-yarn/hadoop-yarn-server/hadoop-yarn-server-timelineservice-hbase/src/main/java/org/apache/hadoop/yarn/server/timelineservice/storage/flow/FlowRunRowKeyPrefix.java
        • (delete) hadoop-yarn-project/hadoop-yarn/hadoop-yarn-server/hadoop-yarn-server-timelineservice/src/main/java/org/apache/hadoop/yarn/server/timelineservice/storage/application/ApplicationTable.java
        • (delete) hadoop-yarn-project/hadoop-yarn/hadoop-yarn-server/hadoop-yarn-server-timelineservice/src/main/java/org/apache/hadoop/yarn/server/timelineservice/storage/common/LongKeyConverter.java
        • (add) hadoop-yarn-project/hadoop-yarn/hadoop-yarn-server/hadoop-yarn-server-timelineservice-hbase/src/main/java/org/apache/hadoop/yarn/server/timelineservice/storage/reader/TimelineEntityReader.java
        • (add) hadoop-yarn-project/hadoop-yarn/hadoop-yarn-server/hadoop-yarn-server-timelineservice-hbase/src/main/java/org/apache/hadoop/yarn/server/timelineservice/storage/entity/EntityColumn.java
        • (delete) hadoop-yarn-project/hadoop-yarn/hadoop-yarn-server/hadoop-yarn-server-timelineservice/src/main/java/org/apache/hadoop/yarn/server/timelineservice/storage/flow/FlowActivityRowKeyPrefix.java
        • (edit) hadoop-yarn-project/pom.xml
        • (delete) hadoop-yarn-project/hadoop-yarn/hadoop-yarn-server/hadoop-yarn-server-timelineservice/src/main/java/org/apache/hadoop/yarn/server/timelineservice/storage/apptoflow/AppToFlowRowKey.java
        • (delete) hadoop-yarn-project/hadoop-yarn/hadoop-yarn-server/hadoop-yarn-server-timelineservice/src/main/java/org/apache/hadoop/yarn/server/timelineservice/storage/common/Separator.java
        • (add) hadoop-yarn-project/hadoop-yarn/hadoop-yarn-server/hadoop-yarn-server-timelineservice-hbase/src/main/java/org/apache/hadoop/yarn/server/timelineservice/storage/flow/FlowRunColumnFamily.java
        • (add) hadoop-yarn-project/hadoop-yarn/hadoop-yarn-server/hadoop-yarn-server-timelineservice-hbase/src/main/java/org/apache/hadoop/yarn/server/timelineservice/storage/common/TimelineHBaseSchemaConstants.java
        • (delete) hadoop-yarn-project/hadoop-yarn/hadoop-yarn-server/hadoop-yarn-server-timelineservice/src/main/java/org/apache/hadoop/yarn/server/timelineservice/storage/entity/EntityColumnFamily.java
        • (add) hadoop-yarn-project/hadoop-yarn/hadoop-yarn-server/hadoop-yarn-server-timelineservice-hbase/src/main/java/org/apache/hadoop/yarn/server/timelineservice/storage/reader/ApplicationEntityReader.java
        • (delete) hadoop-yarn-project/hadoop-yarn/hadoop-yarn-server/hadoop-yarn-server-timelineservice/src/main/java/org/apache/hadoop/yarn/server/timelineservice/storage/HBaseTimelineWriterImpl.java
        • (add) hadoop-yarn-project/hadoop-yarn/hadoop-yarn-server/hadoop-yarn-server-timelineservice-hbase/src/main/java/org/apache/hadoop/yarn/server/timelineservice/storage/common/TimestampGenerator.java
        • (add) hadoop-yarn-project/hadoop-yarn/hadoop-yarn-server/hadoop-yarn-server-timelineservice-hbase/src/main/java/org/apache/hadoop/yarn/server/timelineservice/storage/application/ApplicationColumn.java
        • (add) hadoop-yarn-project/hadoop-yarn/hadoop-yarn-server/hadoop-yarn-server-timelineservice-hbase/src/main/java/org/apache/hadoop/yarn/server/timelineservice/storage/application/ApplicationColumnPrefix.java
        • (delete) hadoop-yarn-project/hadoop-yarn/hadoop-yarn-server/hadoop-yarn-server-timelineservice/src/main/java/org/apache/hadoop/yarn/server/timelineservice/storage/common/RowKeyPrefix.java
        • (add) hadoop-yarn-project/hadoop-yarn/hadoop-yarn-server/hadoop-yarn-server-timelineservice-hbase/src/main/java/org/apache/hadoop/yarn/server/timelineservice/storage/common/Column.java
        • (add) hadoop-yarn-project/hadoop-yarn/hadoop-yarn-server/hadoop-yarn-server-timelineservice-hbase/src/main/java/org/apache/hadoop/yarn/server/timelineservice/storage/flow/AggregationOperation.java
        • (add) hadoop-yarn-project/hadoop-yarn/hadoop-yarn-server/hadoop-yarn-server-timelineservice-hbase/src/main/java/org/apache/hadoop/yarn/server/timelineservice/storage/flow/FlowRunColumn.java
        • (add) hadoop-yarn-project/hadoop-yarn/hadoop-yarn-server/hadoop-yarn-server-timelineservice-hbase/src/main/java/org/apache/hadoop/yarn/server/timelineservice/storage/common/HBaseTimelineStorageUtils.java
        • (add) hadoop-yarn-project/hadoop-yarn/hadoop-yarn-server/hadoop-yarn-server-timelineservice-hbase/src/main/java/org/apache/hadoop/yarn/server/timelineservice/storage/application/ApplicationRowKey.java
        • (add) hadoop-yarn-project/hadoop-yarn/hadoop-yarn-server/hadoop-yarn-server-timelineservice-hbase/src/main/java/org/apache/hadoop/yarn/server/timelineservice/storage/application/ApplicationColumnFamily.java
        • (delete) hadoop-yarn-project/hadoop-yarn/hadoop-yarn-server/hadoop-yarn-server-timelineservice/src/main/java/org/apache/hadoop/yarn/server/timelineservice/storage/HBaseTimelineReaderImpl.java
        • (delete) hadoop-yarn-project/hadoop-yarn/hadoop-yarn-server/hadoop-yarn-server-timelineservice/src/main/java/org/apache/hadoop/yarn/server/timelineservice/storage/common/HBaseTimelineStorageUtils.java
        • (delete) hadoop-yarn-project/hadoop-yarn/hadoop-yarn-server/hadoop-yarn-server-timelineservice/src/main/java/org/apache/hadoop/yarn/server/timelineservice/storage/flow/FlowScannerOperation.java
        • (add) hadoop-yarn-project/hadoop-yarn/hadoop-yarn-server/hadoop-yarn-server-timelineservice-hbase/src/main/java/org/apache/hadoop/yarn/server/timelineservice/storage/HBaseTimelineReaderImpl.java
        • (add) hadoop-yarn-project/hadoop-yarn/hadoop-yarn-server/hadoop-yarn-server-timelineservice-hbase/src/main/java/org/apache/hadoop/yarn/server/timelineservice/storage/flow/FlowScannerOperation.java
        • (add) hadoop-yarn-project/hadoop-yarn/hadoop-yarn-server/hadoop-yarn-server-timelineservice-hbase/pom.xml
        • (add) hadoop-yarn-project/hadoop-yarn/hadoop-yarn-server/hadoop-yarn-server-timelineservice-hbase/src/main/java/org/apache/hadoop/yarn/server/timelineservice/storage/entity/package-info.java
        • (delete) hadoop-yarn-project/hadoop-yarn/hadoop-yarn-server/hadoop-yarn-server-timelineservice/src/main/java/org/apache/hadoop/yarn/server/timelineservice/storage/entity/EntityTable.java
        • (delete) hadoop-yarn-project/hadoop-yarn/hadoop-yarn-server/hadoop-yarn-server-timelineservice/src/main/java/org/apache/hadoop/yarn/server/timelineservice/storage/common/NumericValueConverter.java
        • (delete) hadoop-yarn-project/hadoop-yarn/hadoop-yarn-server/hadoop-yarn-server-timelineservice/src/main/java/org/apache/hadoop/yarn/server/timelineservice/storage/apptoflow/AppToFlowTable.java
        • (delete) hadoop-yarn-project/hadoop-yarn/hadoop-yarn-server/hadoop-yarn-server-timelineservice/src/main/java/org/apache/hadoop/yarn/server/timelineservice/storage/application/package-info.java
        • (delete) hadoop-yarn-project/hadoop-yarn/hadoop-yarn-server/hadoop-yarn-server-timelineservice/src/main/java/org/apache/hadoop/yarn/server/timelineservice/storage/common/TimestampGenerator.java
        • (delete) hadoop-yarn-project/hadoop-yarn/hadoop-yarn-server/hadoop-yarn-server-timelineservice/src/main/java/org/apache/hadoop/yarn/server/timelineservice/storage/common/EventColumnName.java
        • (add) hadoop-yarn-project/hadoop-yarn/hadoop-yarn-server/hadoop-yarn-server-timelineservice-hbase/src/main/java/org/apache/hadoop/yarn/server/timelineservice/storage/common/BufferedMutatorDelegator.java
        • (add) hadoop-yarn-project/hadoop-yarn/hadoop-yarn-server/hadoop-yarn-server-timelineservice-hbase/src/main/java/org/apache/hadoop/yarn/server/timelineservice/storage/application/ApplicationTable.java
        • (delete) hadoop-yarn-project/hadoop-yarn/hadoop-yarn-server/hadoop-yarn-server-timelineservice/src/main/java/org/apache/hadoop/yarn/server/timelineservice/storage/application/ApplicationColumnFamily.java
        • (add) hadoop-yarn-project/hadoop-yarn/hadoop-yarn-server/hadoop-yarn-server-timelineservice-hbase/src/main/java/org/apache/hadoop/yarn/server/timelineservice/storage/flow/FlowActivityRowKey.java
        • (delete) hadoop-yarn-project/hadoop-yarn/hadoop-yarn-server/hadoop-yarn-server-timelineservice/src/test/java/org/apache/hadoop/yarn/server/timelineservice/storage/common/TestSeparator.java
        • (edit) hadoop-yarn-project/hadoop-yarn/hadoop-yarn-server/hadoop-yarn-server-resourcemanager/src/test/java/org/apache/hadoop/yarn/server/resourcemanager/TestResourceTrackerService.java
        • (delete) hadoop-yarn-project/hadoop-yarn/hadoop-yarn-server/hadoop-yarn-server-timelineservice/src/main/java/org/apache/hadoop/yarn/server/timelineservice/reader/filter/TimelineFilterUtils.java
        • (add) hadoop-yarn-project/hadoop-yarn/hadoop-yarn-server/hadoop-yarn-server-timelineservice-hbase/src/main/java/org/apache/hadoop/yarn/server/timelineservice/storage/common/LongKeyConverter.java
        • (delete) hadoop-yarn-project/hadoop-yarn/hadoop-yarn-server/hadoop-yarn-server-timelineservice/src/main/java/org/apache/hadoop/yarn/server/timelineservice/storage/flow/package-info.java
        • (delete) hadoop-yarn-project/hadoop-yarn/hadoop-yarn-server/hadoop-yarn-server-timelineservice/src/test/java/org/apache/hadoop/yarn/server/timelineservice/storage/common/TestRowKeys.java
        • (add) hadoop-yarn-project/hadoop-yarn/hadoop-yarn-server/hadoop-yarn-server-timelineservice-hbase/src/main/java/org/apache/hadoop/yarn/server/timelineservice/storage/apptoflow/package-info.java
        • (add) hadoop-yarn-project/hadoop-yarn/hadoop-yarn-server/hadoop-yarn-server-timelineservice-hbase/src/main/java/org/apache/hadoop/yarn/server/timelineservice/storage/common/ColumnHelper.java
        • (delete) hadoop-yarn-project/hadoop-yarn/hadoop-yarn-server/hadoop-yarn-server-timelineservice/src/main/java/org/apache/hadoop/yarn/server/timelineservice/storage/reader/FlowRunEntityReader.java
        • (delete) hadoop-yarn-project/hadoop-yarn/hadoop-yarn-server/hadoop-yarn-server-timelineservice/src/main/java/org/apache/hadoop/yarn/server/timelineservice/storage/application/ApplicationRowKeyPrefix.java
        • (add) hadoop-yarn-project/hadoop-yarn/hadoop-yarn-server/hadoop-yarn-server-timelineservice-hbase/src/main/java/org/apache/hadoop/yarn/server/timelineservice/storage/common/EventColumnName.java
        • (add) hadoop-yarn-project/hadoop-yarn/hadoop-yarn-server/hadoop-yarn-server-timelineservice-hbase/src/main/java/org/apache/hadoop/yarn/server/timelineservice/storage/apptoflow/AppToFlowColumn.java
        • (add) hadoop-yarn-project/hadoop-yarn/hadoop-yarn-server/hadoop-yarn-server-timelineservice-hbase/src/main/java/org/apache/hadoop/yarn/server/timelineservice/storage/common/LongConverter.java
        • (delete) hadoop-yarn-project/hadoop-yarn/hadoop-yarn-server/hadoop-yarn-server-timelineservice/src/main/java/org/apache/hadoop/yarn/server/timelineservice/storage/flow/Attribute.java
        • (delete) hadoop-yarn-project/hadoop-yarn/hadoop-yarn-server/hadoop-yarn-server-timelineservice/src/main/java/org/apache/hadoop/yarn/server/timelineservice/storage/entity/EntityColumnPrefix.java
        • (delete) hadoop-yarn-project/hadoop-yarn/hadoop-yarn-server/hadoop-yarn-server-timelineservice/src/main/java/org/apache/hadoop/yarn/server/timelineservice/storage/flow/FlowActivityColumnFamily.java
        • (add) hadoop-yarn-project/hadoop-yarn/hadoop-yarn-server/hadoop-yarn-server-timelineservice-hbase/src/main/java/org/apache/hadoop/yarn/server/timelineservice/storage/common/package-info.java
        • (add) hadoop-yarn-project/hadoop-yarn/hadoop-yarn-server/hadoop-yarn-server-timelineservice-hbase/src/main/java/org/apache/hadoop/yarn/server/timelineservice/storage/reader/FlowRunEntityReader.java
        • (add) hadoop-yarn-project/hadoop-yarn/hadoop-yarn-server/hadoop-yarn-server-timelineservice-hbase/src/main/java/org/apache/hadoop/yarn/server/timelineservice/storage/common/KeyConverter.java
        • (add) hadoop-yarn-project/hadoop-yarn/hadoop-yarn-server/hadoop-yarn-server-timelineservice-hbase/src/main/java/org/apache/hadoop/yarn/server/timelineservice/storage/entity/EntityColumnPrefix.java
        • (add) hadoop-yarn-project/hadoop-yarn/hadoop-yarn-server/hadoop-yarn-server-timelineservice-hbase/src/main/java/org/apache/hadoop/yarn/server/timelineservice/storage/entity/EntityRowKeyPrefix.java
        • (delete) hadoop-yarn-project/hadoop-yarn/hadoop-yarn-server/hadoop-yarn-server-timelineservice/src/main/java/org/apache/hadoop/yarn/server/timelineservice/storage/flow/FlowRunRowKey.java
        • (add) hadoop-yarn-project/hadoop-yarn/hadoop-yarn-server/hadoop-yarn-server-timelineservice-hbase/src/main/java/org/apache/hadoop/yarn/server/timelineservice/storage/flow/FlowActivityColumnFamily.java
        • (delete) hadoop-yarn-project/hadoop-yarn/hadoop-yarn-server/hadoop-yarn-server-timelineservice/src/test/java/org/apache/hadoop/yarn/server/timelineservice/storage/common/TestKeyConverters.java
        • (delete) hadoop-yarn-project/hadoop-yarn/hadoop-yarn-server/hadoop-yarn-server-timelineservice/src/main/java/org/apache/hadoop/yarn/server/timelineservice/storage/common/Range.java
        • (add) hadoop-yarn-project/hadoop-yarn/hadoop-yarn-server/hadoop-yarn-server-timelineservice-hbase/src/main/java/org/apache/hadoop/yarn/server/timelineservice/storage/flow/Attribute.java
        • (add) hadoop-yarn-project/hadoop-yarn/hadoop-yarn-server/hadoop-yarn-server-timelineservice-hbase/src/main/java/org/apache/hadoop/yarn/server/timelineservice/storage/flow/FlowActivityColumnPrefix.java
        • (delete) hadoop-yarn-project/hadoop-yarn/hadoop-yarn-server/hadoop-yarn-server-timelineservice/src/main/java/org/apache/hadoop/yarn/server/timelineservice/storage/flow/FlowRunCoprocessor.java
        • (delete) hadoop-yarn-project/hadoop-yarn/hadoop-yarn-server/hadoop-yarn-server-timelineservice/src/main/java/org/apache/hadoop/yarn/server/timelineservice/storage/common/ColumnFamily.java
        • (add) hadoop-yarn-project/hadoop-yarn/hadoop-yarn-server/hadoop-yarn-server-timelineservice-hbase/src/main/java/org/apache/hadoop/yarn/server/timelineservice/storage/reader/FlowActivityEntityReader.java
        • (delete) hadoop-yarn-project/hadoop-yarn/hadoop-yarn-server/hadoop-yarn-server-timelineservice/src/main/java/org/apache/hadoop/yarn/server/timelineservice/storage/flow/FlowRunColumnFamily.java
        • (delete) hadoop-yarn-project/hadoop-yarn/hadoop-yarn-server/hadoop-yarn-server-timelineservice/src/main/java/org/apache/hadoop/yarn/server/timelineservice/storage/common/LongConverter.java
        • (delete) hadoop-yarn-project/hadoop-yarn/hadoop-yarn-server/hadoop-yarn-server-timelineservice/src/main/java/org/apache/hadoop/yarn/server/timelineservice/storage/reader/TimelineEntityReader.java
        • (edit) hadoop-project/pom.xml
        • (add) hadoop-yarn-project/hadoop-yarn/hadoop-yarn-server/hadoop-yarn-server-timelineservice-hbase/src/main/java/org/apache/hadoop/yarn/server/timelineservice/reader/filter/package-info.java
        • (delete) hadoop-yarn-project/hadoop-yarn/hadoop-yarn-server/hadoop-yarn-server-timelineservice/src/main/java/org/apache/hadoop/yarn/server/timelineservice/storage/common/BufferedMutatorDelegator.java
        • (delete) hadoop-yarn-project/hadoop-yarn/hadoop-yarn-server/hadoop-yarn-server-timelineservice/src/main/java/org/apache/hadoop/yarn/server/timelineservice/storage/flow/FlowRunTable.java
        • (edit) hadoop-yarn-project/hadoop-yarn/hadoop-yarn-site/src/site/markdown/TimelineServiceV2.md
        • (delete) hadoop-yarn-project/hadoop-yarn/hadoop-yarn-server/hadoop-yarn-server-timelineservice/src/main/java/org/apache/hadoop/yarn/server/timelineservice/storage/entity/EntityRowKey.java
        • (delete) hadoop-yarn-project/hadoop-yarn/hadoop-yarn-server/hadoop-yarn-server-timelineservice/src/main/java/org/apache/hadoop/yarn/server/timelineservice/storage/entity/EntityRowKeyPrefix.java
        • (add) hadoop-yarn-project/hadoop-yarn/hadoop-yarn-server/hadoop-yarn-server-timelineservice-hbase/src/main/java/org/apache/hadoop/yarn/server/timelineservice/storage/application/ApplicationRowKeyPrefix.java
        • (add) hadoop-yarn-project/hadoop-yarn/hadoop-yarn-server/hadoop-yarn-server-timelineservice-hbase/src/test/java/org/apache/hadoop/yarn/server/timelineservice/storage/common/TestSeparator.java
        • (add) hadoop-yarn-project/hadoop-yarn/hadoop-yarn-server/hadoop-yarn-server-timelineservice-hbase/src/main/java/org/apache/hadoop/yarn/server/timelineservice/storage/common/Range.java
        • (add) hadoop-yarn-project/hadoop-yarn/hadoop-yarn-server/hadoop-yarn-server-timelineservice-hbase/src/main/java/org/apache/hadoop/yarn/server/timelineservice/storage/flow/FlowScanner.java
        • (delete) hadoop-yarn-project/hadoop-yarn/hadoop-yarn-server/hadoop-yarn-server-timelineservice/src/main/java/org/apache/hadoop/yarn/server/timelineservice/storage/flow/AggregationOperation.java
        • (add) hadoop-yarn-project/hadoop-yarn/hadoop-yarn-server/hadoop-yarn-server-timelineservice-hbase/src/main/java/org/apache/hadoop/yarn/server/timelineservice/storage/flow/FlowRunCoprocessor.java
        • (delete) hadoop-yarn-project/hadoop-yarn/hadoop-yarn-server/hadoop-yarn-server-timelineservice/src/main/java/org/apache/hadoop/yarn/server/timelineservice/storage/entity/EntityColumn.java
        • (delete) hadoop-yarn-project/hadoop-yarn/hadoop-yarn-server/hadoop-yarn-server-timelineservice/src/main/java/org/apache/hadoop/yarn/server/timelineservice/storage/entity/package-info.java
        • (delete) hadoop-yarn-project/hadoop-yarn/hadoop-yarn-server/hadoop-yarn-server-timelineservice/src/main/java/org/apache/hadoop/yarn/server/timelineservice/storage/common/Column.java
        • (delete) hadoop-yarn-project/hadoop-yarn/hadoop-yarn-server/hadoop-yarn-server-timelineservice/src/main/java/org/apache/hadoop/yarn/server/timelineservice/storage/flow/FlowRunColumnPrefix.java
        • (delete) hadoop-yarn-project/hadoop-yarn/hadoop-yarn-server/hadoop-yarn-server-timelineservice/src/main/java/org/apache/hadoop/yarn/server/timelineservice/storage/apptoflow/AppToFlowColumnFamily.java
        • (delete) hadoop-yarn-project/hadoop-yarn/hadoop-yarn-server/hadoop-yarn-server-timelineservice/src/main/java/org/apache/hadoop/yarn/server/timelineservice/storage/common/GenericConverter.java
        • (add) hadoop-yarn-project/hadoop-yarn/hadoop-yarn-server/hadoop-yarn-server-timelineservice-hbase/src/main/java/org/apache/hadoop/yarn/server/timelineservice/storage/common/RowKeyPrefix.java
        • (delete) hadoop-yarn-project/hadoop-yarn/hadoop-yarn-server/hadoop-yarn-server-timelineservice/src/main/java/org/apache/hadoop/yarn/server/timelineservice/storage/flow/FlowActivityTable.java
        • (delete) hadoop-yarn-project/hadoop-yarn/hadoop-yarn-server/hadoop-yarn-server-timelineservice/src/main/java/org/apache/hadoop/yarn/server/timelineservice/storage/common/KeyConverter.java
        • (add) hadoop-yarn-project/hadoop-yarn/hadoop-yarn-server/hadoop-yarn-server-timelineservice-hbase/src/main/java/org/apache/hadoop/yarn/server/timelineservice/storage/flow/FlowActivityTable.java
        • (add) hadoop-yarn-project/hadoop-yarn/hadoop-yarn-server/hadoop-yarn-server-timelineservice-hbase/src/main/java/org/apache/hadoop/yarn/server/timelineservice/storage/reader/GenericEntityReader.java
        • (add) hadoop-yarn-project/hadoop-yarn/hadoop-yarn-server/hadoop-yarn-server-timelineservice-hbase/src/main/java/org/apache/hadoop/yarn/server/timelineservice/storage/HBaseTimelineWriterImpl.java
        • (delete) hadoop-yarn-project/hadoop-yarn/hadoop-yarn-server/hadoop-yarn-server-timelineservice/src/main/java/org/apache/hadoop/yarn/server/timelineservice/storage/application/ApplicationRowKey.java
        • (delete) hadoop-yarn-project/hadoop-yarn/hadoop-yarn-server/hadoop-yarn-server-timelineservice/src/main/java/org/apache/hadoop/yarn/server/timelineservice/storage/apptoflow/package-info.java
        • (add) hadoop-yarn-project/hadoop-yarn/hadoop-yarn-server/hadoop-yarn-server-timelineservice-hbase/src/main/java/org/apache/hadoop/yarn/server/timelineservice/storage/common/AppIdKeyConverter.java
        • (add) hadoop-yarn-project/hadoop-yarn/hadoop-yarn-server/hadoop-yarn-server-timelineservice-hbase/src/main/java/org/apache/hadoop/yarn/server/timelineservice/storage/flow/FlowRunTable.java
        • (add) hadoop-yarn-project/hadoop-yarn/hadoop-yarn-server/hadoop-yarn-server-timelineservice-hbase/src/main/java/org/apache/hadoop/yarn/server/timelineservice/storage/common/StringKeyConverter.java
        • (delete) hadoop-yarn-project/hadoop-yarn/hadoop-yarn-server/hadoop-yarn-server-timelineservice/src/main/java/org/apache/hadoop/yarn/server/timelineservice/storage/common/package-info.java
        • (add) hadoop-yarn-project/hadoop-yarn/hadoop-yarn-server/hadoop-yarn-server-timelineservice-hbase/src/main/java/org/apache/hadoop/yarn/server/timelineservice/storage/entity/EntityRowKey.java
        • (add) hadoop-yarn-project/hadoop-yarn/hadoop-yarn-server/hadoop-yarn-server-timelineservice-hbase/src/test/java/org/apache/hadoop/yarn/server/timelineservice/storage/common/TestRowKeys.java
        • (delete) hadoop-yarn-project/hadoop-yarn/hadoop-yarn-server/hadoop-yarn-server-timelineservice/src/main/java/org/apache/hadoop/yarn/server/timelineservice/storage/common/ValueConverter.java
        • (delete) hadoop-yarn-project/hadoop-yarn/hadoop-yarn-server/hadoop-yarn-server-timelineservice/src/main/java/org/apache/hadoop/yarn/server/timelineservice/storage/common/AppIdKeyConverter.java
        • (add) hadoop-yarn-project/hadoop-yarn/hadoop-yarn-server/hadoop-yarn-server-timelineservice-hbase/src/main/java/org/apache/hadoop/yarn/server/timelineservice/storage/common/NumericValueConverter.java
        • (edit) hadoop-yarn-project/hadoop-yarn/hadoop-yarn-server/hadoop-yarn-server-resourcemanager/src/test/java/org/apache/hadoop/yarn/server/resourcemanager/TestRMRestart.java
        Show
        hudson Hudson added a comment - SUCCESS: Integrated in Jenkins build Hadoop-trunk-Commit #11152 (See https://builds.apache.org/job/Hadoop-trunk-Commit/11152/ ) YARN-5928 . Move ATSv2 HBase backend code into a new module that is only (sjlee: rev b01514f65bc6090a50a583f67d1ecb5d74b6d276) (add) hadoop-yarn-project/hadoop-yarn/hadoop-yarn-server/hadoop-yarn-server-timelineservice-hbase/src/main/java/org/apache/hadoop/yarn/server/timelineservice/storage/flow/FlowActivityRowKeyPrefix.java (add) hadoop-yarn-project/hadoop-yarn/hadoop-yarn-server/hadoop-yarn-server-timelineservice-hbase/src/main/java/org/apache/hadoop/yarn/server/timelineservice/storage/common/TypedBufferedMutator.java (delete) hadoop-yarn-project/hadoop-yarn/hadoop-yarn-server/hadoop-yarn-server-timelineservice/src/main/java/org/apache/hadoop/yarn/server/timelineservice/storage/flow/FlowActivityRowKey.java (delete) hadoop-yarn-project/hadoop-yarn/hadoop-yarn-server/hadoop-yarn-server-timelineservice/src/main/java/org/apache/hadoop/yarn/server/timelineservice/storage/application/ApplicationColumnPrefix.java (add) hadoop-yarn-project/hadoop-yarn/hadoop-yarn-server/hadoop-yarn-server-timelineservice-hbase/src/main/java/org/apache/hadoop/yarn/server/timelineservice/storage/common/ValueConverter.java (add) hadoop-yarn-project/hadoop-yarn/hadoop-yarn-server/hadoop-yarn-server-timelineservice-hbase/src/main/java/org/apache/hadoop/yarn/server/timelineservice/reader/filter/TimelineFilterUtils.java (delete) hadoop-yarn-project/hadoop-yarn/hadoop-yarn-server/hadoop-yarn-server-timelineservice/src/main/java/org/apache/hadoop/yarn/server/timelineservice/storage/application/ApplicationColumn.java (add) hadoop-yarn-project/hadoop-yarn/hadoop-yarn-server/hadoop-yarn-server-timelineservice-hbase/src/main/java/org/apache/hadoop/yarn/server/timelineservice/storage/application/package-info.java (add) hadoop-yarn-project/hadoop-yarn/hadoop-yarn-server/hadoop-yarn-server-timelineservice-hbase/src/main/java/org/apache/hadoop/yarn/server/timelineservice/storage/flow/AggregationCompactionDimension.java (add) hadoop-yarn-project/hadoop-yarn/hadoop-yarn-server/hadoop-yarn-server-timelineservice-hbase/src/main/java/org/apache/hadoop/yarn/server/timelineservice/storage/package-info.java (delete) hadoop-yarn-project/hadoop-yarn/hadoop-yarn-server/hadoop-yarn-server-timelineservice/src/main/java/org/apache/hadoop/yarn/server/timelineservice/storage/flow/AggregationCompactionDimension.java (delete) hadoop-yarn-project/hadoop-yarn/hadoop-yarn-server/hadoop-yarn-server-timelineservice/src/main/java/org/apache/hadoop/yarn/server/timelineservice/storage/flow/FlowActivityColumnPrefix.java (add) hadoop-yarn-project/hadoop-yarn/hadoop-yarn-server/hadoop-yarn-server-timelineservice-hbase/src/main/java/org/apache/hadoop/yarn/server/timelineservice/storage/flow/FlowRunRowKey.java (edit) hadoop-yarn-project/hadoop-yarn/hadoop-yarn-server/pom.xml (delete) hadoop-yarn-project/hadoop-yarn/hadoop-yarn-server/hadoop-yarn-server-timelineservice/src/main/java/org/apache/hadoop/yarn/server/timelineservice/storage/reader/FlowActivityEntityReader.java (add) hadoop-yarn-project/hadoop-yarn/hadoop-yarn-server/hadoop-yarn-server-timelineservice-hbase/src/main/java/org/apache/hadoop/yarn/server/timelineservice/storage/reader/package-info.java (delete) hadoop-yarn-project/hadoop-yarn/hadoop-yarn-server/hadoop-yarn-server-timelineservice/src/main/java/org/apache/hadoop/yarn/server/timelineservice/storage/apptoflow/AppToFlowColumn.java (add) hadoop-yarn-project/hadoop-yarn/hadoop-yarn-server/hadoop-yarn-server-timelineservice-hbase/src/main/java/org/apache/hadoop/yarn/server/timelineservice/storage/entity/EntityTable.java (add) hadoop-yarn-project/hadoop-yarn/hadoop-yarn-server/hadoop-yarn-server-timelineservice-hbase/src/main/java/org/apache/hadoop/yarn/server/timelineservice/storage/common/ColumnPrefix.java (add) hadoop-yarn-project/hadoop-yarn/hadoop-yarn-server/hadoop-yarn-server-timelineservice-hbase/src/main/java/org/apache/hadoop/yarn/server/timelineservice/storage/apptoflow/AppToFlowRowKey.java (delete) hadoop-yarn-project/hadoop-yarn/hadoop-yarn-server/hadoop-yarn-server-timelineservice/src/main/java/org/apache/hadoop/yarn/server/timelineservice/storage/common/StringKeyConverter.java (delete) hadoop-yarn-project/hadoop-yarn/hadoop-yarn-server/hadoop-yarn-server-timelineservice/src/main/java/org/apache/hadoop/yarn/server/timelineservice/storage/flow/FlowScanner.java (add) hadoop-yarn-project/hadoop-yarn/hadoop-yarn-server/hadoop-yarn-server-timelineservice-hbase/src/main/java/org/apache/hadoop/yarn/server/timelineservice/storage/common/BaseTable.java (delete) hadoop-yarn-project/hadoop-yarn/hadoop-yarn-server/hadoop-yarn-server-timelineservice/src/main/java/org/apache/hadoop/yarn/server/timelineservice/storage/TimelineSchemaCreator.java (add) hadoop-yarn-project/hadoop-yarn/hadoop-yarn-server/hadoop-yarn-server-timelineservice-hbase/src/test/java/org/apache/hadoop/yarn/server/timelineservice/storage/common/TestKeyConverters.java (edit) hadoop-yarn-project/hadoop-yarn/hadoop-yarn-server/hadoop-yarn-server-timelineservice/pom.xml (add) hadoop-yarn-project/hadoop-yarn/hadoop-yarn-server/hadoop-yarn-server-timelineservice-hbase/src/main/java/org/apache/hadoop/yarn/server/timelineservice/storage/common/GenericConverter.java (add) hadoop-yarn-project/hadoop-yarn/hadoop-yarn-server/hadoop-yarn-server-timelineservice-hbase/src/main/java/org/apache/hadoop/yarn/server/timelineservice/storage/TimelineSchemaCreator.java (delete) hadoop-yarn-project/hadoop-yarn/hadoop-yarn-server/hadoop-yarn-server-timelineservice/src/main/java/org/apache/hadoop/yarn/server/timelineservice/storage/reader/TimelineEntityReaderFactory.java (add) hadoop-yarn-project/hadoop-yarn/hadoop-yarn-server/hadoop-yarn-server-timelineservice-hbase/src/main/java/org/apache/hadoop/yarn/server/timelineservice/storage/common/ColumnFamily.java (delete) hadoop-yarn-project/hadoop-yarn/hadoop-yarn-server/hadoop-yarn-server-timelineservice/src/main/java/org/apache/hadoop/yarn/server/timelineservice/storage/reader/GenericEntityReader.java (add) hadoop-yarn-project/hadoop-yarn/hadoop-yarn-server/hadoop-yarn-server-timelineservice-hbase/src/main/java/org/apache/hadoop/yarn/server/timelineservice/storage/flow/package-info.java (add) hadoop-yarn-project/hadoop-yarn/hadoop-yarn-server/hadoop-yarn-server-timelineservice-hbase/src/main/java/org/apache/hadoop/yarn/server/timelineservice/storage/apptoflow/AppToFlowTable.java (delete) hadoop-yarn-project/hadoop-yarn/hadoop-yarn-server/hadoop-yarn-server-timelineservice/src/main/java/org/apache/hadoop/yarn/server/timelineservice/storage/common/ColumnPrefix.java (delete) hadoop-yarn-project/hadoop-yarn/hadoop-yarn-server/hadoop-yarn-server-timelineservice/src/main/java/org/apache/hadoop/yarn/server/timelineservice/storage/common/TimelineHBaseSchemaConstants.java (edit) hadoop-yarn-project/hadoop-yarn/hadoop-yarn-server/hadoop-yarn-server-timelineservice-hbase-tests/pom.xml (delete) hadoop-yarn-project/hadoop-yarn/hadoop-yarn-server/hadoop-yarn-server-timelineservice/src/main/java/org/apache/hadoop/yarn/server/timelineservice/storage/common/ColumnHelper.java (delete) hadoop-yarn-project/hadoop-yarn/hadoop-yarn-server/hadoop-yarn-server-timelineservice/src/main/java/org/apache/hadoop/yarn/server/timelineservice/storage/common/EventColumnNameConverter.java (add) hadoop-yarn-project/hadoop-yarn/hadoop-yarn-server/hadoop-yarn-server-timelineservice-hbase/src/main/java/org/apache/hadoop/yarn/server/timelineservice/storage/apptoflow/AppToFlowColumnFamily.java (add) hadoop-yarn-project/hadoop-yarn/hadoop-yarn-server/hadoop-yarn-server-timelineservice-hbase/src/main/java/org/apache/hadoop/yarn/server/timelineservice/storage/common/Separator.java (add) hadoop-yarn-project/hadoop-yarn/hadoop-yarn-server/hadoop-yarn-server-timelineservice-hbase/src/main/java/org/apache/hadoop/yarn/server/timelineservice/storage/reader/TimelineEntityReaderFactory.java (add) hadoop-yarn-project/hadoop-yarn/hadoop-yarn-server/hadoop-yarn-server-timelineservice-hbase/src/main/java/org/apache/hadoop/yarn/server/timelineservice/storage/flow/FlowRunColumnPrefix.java (delete) hadoop-yarn-project/hadoop-yarn/hadoop-yarn-server/hadoop-yarn-server-timelineservice/src/main/java/org/apache/hadoop/yarn/server/timelineservice/storage/common/BaseTable.java (delete) hadoop-yarn-project/hadoop-yarn/hadoop-yarn-server/hadoop-yarn-server-timelineservice/src/main/java/org/apache/hadoop/yarn/server/timelineservice/storage/reader/ApplicationEntityReader.java (delete) hadoop-yarn-project/hadoop-yarn/hadoop-yarn-server/hadoop-yarn-server-timelineservice/src/main/java/org/apache/hadoop/yarn/server/timelineservice/storage/flow/FlowRunRowKeyPrefix.java (add) hadoop-yarn-project/hadoop-yarn/hadoop-yarn-server/hadoop-yarn-server-timelineservice-hbase/src/main/java/org/apache/hadoop/yarn/server/timelineservice/storage/common/EventColumnNameConverter.java (delete) hadoop-yarn-project/hadoop-yarn/hadoop-yarn-server/hadoop-yarn-server-timelineservice/src/main/java/org/apache/hadoop/yarn/server/timelineservice/storage/common/TypedBufferedMutator.java (add) hadoop-yarn-project/hadoop-yarn/hadoop-yarn-server/hadoop-yarn-server-timelineservice-hbase/src/main/java/org/apache/hadoop/yarn/server/timelineservice/storage/entity/EntityColumnFamily.java (delete) hadoop-yarn-project/hadoop-yarn/hadoop-yarn-server/hadoop-yarn-server-timelineservice/src/main/java/org/apache/hadoop/yarn/server/timelineservice/storage/reader/package-info.java (delete) hadoop-yarn-project/hadoop-yarn/hadoop-yarn-server/hadoop-yarn-server-timelineservice/src/main/java/org/apache/hadoop/yarn/server/timelineservice/storage/flow/FlowRunColumn.java (add) hadoop-yarn-project/hadoop-yarn/hadoop-yarn-server/hadoop-yarn-server-timelineservice-hbase/src/main/java/org/apache/hadoop/yarn/server/timelineservice/storage/flow/FlowRunRowKeyPrefix.java (delete) hadoop-yarn-project/hadoop-yarn/hadoop-yarn-server/hadoop-yarn-server-timelineservice/src/main/java/org/apache/hadoop/yarn/server/timelineservice/storage/application/ApplicationTable.java (delete) hadoop-yarn-project/hadoop-yarn/hadoop-yarn-server/hadoop-yarn-server-timelineservice/src/main/java/org/apache/hadoop/yarn/server/timelineservice/storage/common/LongKeyConverter.java (add) hadoop-yarn-project/hadoop-yarn/hadoop-yarn-server/hadoop-yarn-server-timelineservice-hbase/src/main/java/org/apache/hadoop/yarn/server/timelineservice/storage/reader/TimelineEntityReader.java (add) hadoop-yarn-project/hadoop-yarn/hadoop-yarn-server/hadoop-yarn-server-timelineservice-hbase/src/main/java/org/apache/hadoop/yarn/server/timelineservice/storage/entity/EntityColumn.java (delete) hadoop-yarn-project/hadoop-yarn/hadoop-yarn-server/hadoop-yarn-server-timelineservice/src/main/java/org/apache/hadoop/yarn/server/timelineservice/storage/flow/FlowActivityRowKeyPrefix.java (edit) hadoop-yarn-project/pom.xml (delete) hadoop-yarn-project/hadoop-yarn/hadoop-yarn-server/hadoop-yarn-server-timelineservice/src/main/java/org/apache/hadoop/yarn/server/timelineservice/storage/apptoflow/AppToFlowRowKey.java (delete) hadoop-yarn-project/hadoop-yarn/hadoop-yarn-server/hadoop-yarn-server-timelineservice/src/main/java/org/apache/hadoop/yarn/server/timelineservice/storage/common/Separator.java (add) hadoop-yarn-project/hadoop-yarn/hadoop-yarn-server/hadoop-yarn-server-timelineservice-hbase/src/main/java/org/apache/hadoop/yarn/server/timelineservice/storage/flow/FlowRunColumnFamily.java (add) hadoop-yarn-project/hadoop-yarn/hadoop-yarn-server/hadoop-yarn-server-timelineservice-hbase/src/main/java/org/apache/hadoop/yarn/server/timelineservice/storage/common/TimelineHBaseSchemaConstants.java (delete) hadoop-yarn-project/hadoop-yarn/hadoop-yarn-server/hadoop-yarn-server-timelineservice/src/main/java/org/apache/hadoop/yarn/server/timelineservice/storage/entity/EntityColumnFamily.java (add) hadoop-yarn-project/hadoop-yarn/hadoop-yarn-server/hadoop-yarn-server-timelineservice-hbase/src/main/java/org/apache/hadoop/yarn/server/timelineservice/storage/reader/ApplicationEntityReader.java (delete) hadoop-yarn-project/hadoop-yarn/hadoop-yarn-server/hadoop-yarn-server-timelineservice/src/main/java/org/apache/hadoop/yarn/server/timelineservice/storage/HBaseTimelineWriterImpl.java (add) hadoop-yarn-project/hadoop-yarn/hadoop-yarn-server/hadoop-yarn-server-timelineservice-hbase/src/main/java/org/apache/hadoop/yarn/server/timelineservice/storage/common/TimestampGenerator.java (add) hadoop-yarn-project/hadoop-yarn/hadoop-yarn-server/hadoop-yarn-server-timelineservice-hbase/src/main/java/org/apache/hadoop/yarn/server/timelineservice/storage/application/ApplicationColumn.java (add) hadoop-yarn-project/hadoop-yarn/hadoop-yarn-server/hadoop-yarn-server-timelineservice-hbase/src/main/java/org/apache/hadoop/yarn/server/timelineservice/storage/application/ApplicationColumnPrefix.java (delete) hadoop-yarn-project/hadoop-yarn/hadoop-yarn-server/hadoop-yarn-server-timelineservice/src/main/java/org/apache/hadoop/yarn/server/timelineservice/storage/common/RowKeyPrefix.java (add) hadoop-yarn-project/hadoop-yarn/hadoop-yarn-server/hadoop-yarn-server-timelineservice-hbase/src/main/java/org/apache/hadoop/yarn/server/timelineservice/storage/common/Column.java (add) hadoop-yarn-project/hadoop-yarn/hadoop-yarn-server/hadoop-yarn-server-timelineservice-hbase/src/main/java/org/apache/hadoop/yarn/server/timelineservice/storage/flow/AggregationOperation.java (add) hadoop-yarn-project/hadoop-yarn/hadoop-yarn-server/hadoop-yarn-server-timelineservice-hbase/src/main/java/org/apache/hadoop/yarn/server/timelineservice/storage/flow/FlowRunColumn.java (add) hadoop-yarn-project/hadoop-yarn/hadoop-yarn-server/hadoop-yarn-server-timelineservice-hbase/src/main/java/org/apache/hadoop/yarn/server/timelineservice/storage/common/HBaseTimelineStorageUtils.java (add) hadoop-yarn-project/hadoop-yarn/hadoop-yarn-server/hadoop-yarn-server-timelineservice-hbase/src/main/java/org/apache/hadoop/yarn/server/timelineservice/storage/application/ApplicationRowKey.java (add) hadoop-yarn-project/hadoop-yarn/hadoop-yarn-server/hadoop-yarn-server-timelineservice-hbase/src/main/java/org/apache/hadoop/yarn/server/timelineservice/storage/application/ApplicationColumnFamily.java (delete) hadoop-yarn-project/hadoop-yarn/hadoop-yarn-server/hadoop-yarn-server-timelineservice/src/main/java/org/apache/hadoop/yarn/server/timelineservice/storage/HBaseTimelineReaderImpl.java (delete) hadoop-yarn-project/hadoop-yarn/hadoop-yarn-server/hadoop-yarn-server-timelineservice/src/main/java/org/apache/hadoop/yarn/server/timelineservice/storage/common/HBaseTimelineStorageUtils.java (delete) hadoop-yarn-project/hadoop-yarn/hadoop-yarn-server/hadoop-yarn-server-timelineservice/src/main/java/org/apache/hadoop/yarn/server/timelineservice/storage/flow/FlowScannerOperation.java (add) hadoop-yarn-project/hadoop-yarn/hadoop-yarn-server/hadoop-yarn-server-timelineservice-hbase/src/main/java/org/apache/hadoop/yarn/server/timelineservice/storage/HBaseTimelineReaderImpl.java (add) hadoop-yarn-project/hadoop-yarn/hadoop-yarn-server/hadoop-yarn-server-timelineservice-hbase/src/main/java/org/apache/hadoop/yarn/server/timelineservice/storage/flow/FlowScannerOperation.java (add) hadoop-yarn-project/hadoop-yarn/hadoop-yarn-server/hadoop-yarn-server-timelineservice-hbase/pom.xml (add) hadoop-yarn-project/hadoop-yarn/hadoop-yarn-server/hadoop-yarn-server-timelineservice-hbase/src/main/java/org/apache/hadoop/yarn/server/timelineservice/storage/entity/package-info.java (delete) hadoop-yarn-project/hadoop-yarn/hadoop-yarn-server/hadoop-yarn-server-timelineservice/src/main/java/org/apache/hadoop/yarn/server/timelineservice/storage/entity/EntityTable.java (delete) hadoop-yarn-project/hadoop-yarn/hadoop-yarn-server/hadoop-yarn-server-timelineservice/src/main/java/org/apache/hadoop/yarn/server/timelineservice/storage/common/NumericValueConverter.java (delete) hadoop-yarn-project/hadoop-yarn/hadoop-yarn-server/hadoop-yarn-server-timelineservice/src/main/java/org/apache/hadoop/yarn/server/timelineservice/storage/apptoflow/AppToFlowTable.java (delete) hadoop-yarn-project/hadoop-yarn/hadoop-yarn-server/hadoop-yarn-server-timelineservice/src/main/java/org/apache/hadoop/yarn/server/timelineservice/storage/application/package-info.java (delete) hadoop-yarn-project/hadoop-yarn/hadoop-yarn-server/hadoop-yarn-server-timelineservice/src/main/java/org/apache/hadoop/yarn/server/timelineservice/storage/common/TimestampGenerator.java (delete) hadoop-yarn-project/hadoop-yarn/hadoop-yarn-server/hadoop-yarn-server-timelineservice/src/main/java/org/apache/hadoop/yarn/server/timelineservice/storage/common/EventColumnName.java (add) hadoop-yarn-project/hadoop-yarn/hadoop-yarn-server/hadoop-yarn-server-timelineservice-hbase/src/main/java/org/apache/hadoop/yarn/server/timelineservice/storage/common/BufferedMutatorDelegator.java (add) hadoop-yarn-project/hadoop-yarn/hadoop-yarn-server/hadoop-yarn-server-timelineservice-hbase/src/main/java/org/apache/hadoop/yarn/server/timelineservice/storage/application/ApplicationTable.java (delete) hadoop-yarn-project/hadoop-yarn/hadoop-yarn-server/hadoop-yarn-server-timelineservice/src/main/java/org/apache/hadoop/yarn/server/timelineservice/storage/application/ApplicationColumnFamily.java (add) hadoop-yarn-project/hadoop-yarn/hadoop-yarn-server/hadoop-yarn-server-timelineservice-hbase/src/main/java/org/apache/hadoop/yarn/server/timelineservice/storage/flow/FlowActivityRowKey.java (delete) hadoop-yarn-project/hadoop-yarn/hadoop-yarn-server/hadoop-yarn-server-timelineservice/src/test/java/org/apache/hadoop/yarn/server/timelineservice/storage/common/TestSeparator.java (edit) hadoop-yarn-project/hadoop-yarn/hadoop-yarn-server/hadoop-yarn-server-resourcemanager/src/test/java/org/apache/hadoop/yarn/server/resourcemanager/TestResourceTrackerService.java (delete) hadoop-yarn-project/hadoop-yarn/hadoop-yarn-server/hadoop-yarn-server-timelineservice/src/main/java/org/apache/hadoop/yarn/server/timelineservice/reader/filter/TimelineFilterUtils.java (add) hadoop-yarn-project/hadoop-yarn/hadoop-yarn-server/hadoop-yarn-server-timelineservice-hbase/src/main/java/org/apache/hadoop/yarn/server/timelineservice/storage/common/LongKeyConverter.java (delete) hadoop-yarn-project/hadoop-yarn/hadoop-yarn-server/hadoop-yarn-server-timelineservice/src/main/java/org/apache/hadoop/yarn/server/timelineservice/storage/flow/package-info.java (delete) hadoop-yarn-project/hadoop-yarn/hadoop-yarn-server/hadoop-yarn-server-timelineservice/src/test/java/org/apache/hadoop/yarn/server/timelineservice/storage/common/TestRowKeys.java (add) hadoop-yarn-project/hadoop-yarn/hadoop-yarn-server/hadoop-yarn-server-timelineservice-hbase/src/main/java/org/apache/hadoop/yarn/server/timelineservice/storage/apptoflow/package-info.java (add) hadoop-yarn-project/hadoop-yarn/hadoop-yarn-server/hadoop-yarn-server-timelineservice-hbase/src/main/java/org/apache/hadoop/yarn/server/timelineservice/storage/common/ColumnHelper.java (delete) hadoop-yarn-project/hadoop-yarn/hadoop-yarn-server/hadoop-yarn-server-timelineservice/src/main/java/org/apache/hadoop/yarn/server/timelineservice/storage/reader/FlowRunEntityReader.java (delete) hadoop-yarn-project/hadoop-yarn/hadoop-yarn-server/hadoop-yarn-server-timelineservice/src/main/java/org/apache/hadoop/yarn/server/timelineservice/storage/application/ApplicationRowKeyPrefix.java (add) hadoop-yarn-project/hadoop-yarn/hadoop-yarn-server/hadoop-yarn-server-timelineservice-hbase/src/main/java/org/apache/hadoop/yarn/server/timelineservice/storage/common/EventColumnName.java (add) hadoop-yarn-project/hadoop-yarn/hadoop-yarn-server/hadoop-yarn-server-timelineservice-hbase/src/main/java/org/apache/hadoop/yarn/server/timelineservice/storage/apptoflow/AppToFlowColumn.java (add) hadoop-yarn-project/hadoop-yarn/hadoop-yarn-server/hadoop-yarn-server-timelineservice-hbase/src/main/java/org/apache/hadoop/yarn/server/timelineservice/storage/common/LongConverter.java (delete) hadoop-yarn-project/hadoop-yarn/hadoop-yarn-server/hadoop-yarn-server-timelineservice/src/main/java/org/apache/hadoop/yarn/server/timelineservice/storage/flow/Attribute.java (delete) hadoop-yarn-project/hadoop-yarn/hadoop-yarn-server/hadoop-yarn-server-timelineservice/src/main/java/org/apache/hadoop/yarn/server/timelineservice/storage/entity/EntityColumnPrefix.java (delete) hadoop-yarn-project/hadoop-yarn/hadoop-yarn-server/hadoop-yarn-server-timelineservice/src/main/java/org/apache/hadoop/yarn/server/timelineservice/storage/flow/FlowActivityColumnFamily.java (add) hadoop-yarn-project/hadoop-yarn/hadoop-yarn-server/hadoop-yarn-server-timelineservice-hbase/src/main/java/org/apache/hadoop/yarn/server/timelineservice/storage/common/package-info.java (add) hadoop-yarn-project/hadoop-yarn/hadoop-yarn-server/hadoop-yarn-server-timelineservice-hbase/src/main/java/org/apache/hadoop/yarn/server/timelineservice/storage/reader/FlowRunEntityReader.java (add) hadoop-yarn-project/hadoop-yarn/hadoop-yarn-server/hadoop-yarn-server-timelineservice-hbase/src/main/java/org/apache/hadoop/yarn/server/timelineservice/storage/common/KeyConverter.java (add) hadoop-yarn-project/hadoop-yarn/hadoop-yarn-server/hadoop-yarn-server-timelineservice-hbase/src/main/java/org/apache/hadoop/yarn/server/timelineservice/storage/entity/EntityColumnPrefix.java (add) hadoop-yarn-project/hadoop-yarn/hadoop-yarn-server/hadoop-yarn-server-timelineservice-hbase/src/main/java/org/apache/hadoop/yarn/server/timelineservice/storage/entity/EntityRowKeyPrefix.java (delete) hadoop-yarn-project/hadoop-yarn/hadoop-yarn-server/hadoop-yarn-server-timelineservice/src/main/java/org/apache/hadoop/yarn/server/timelineservice/storage/flow/FlowRunRowKey.java (add) hadoop-yarn-project/hadoop-yarn/hadoop-yarn-server/hadoop-yarn-server-timelineservice-hbase/src/main/java/org/apache/hadoop/yarn/server/timelineservice/storage/flow/FlowActivityColumnFamily.java (delete) hadoop-yarn-project/hadoop-yarn/hadoop-yarn-server/hadoop-yarn-server-timelineservice/src/test/java/org/apache/hadoop/yarn/server/timelineservice/storage/common/TestKeyConverters.java (delete) hadoop-yarn-project/hadoop-yarn/hadoop-yarn-server/hadoop-yarn-server-timelineservice/src/main/java/org/apache/hadoop/yarn/server/timelineservice/storage/common/Range.java (add) hadoop-yarn-project/hadoop-yarn/hadoop-yarn-server/hadoop-yarn-server-timelineservice-hbase/src/main/java/org/apache/hadoop/yarn/server/timelineservice/storage/flow/Attribute.java (add) hadoop-yarn-project/hadoop-yarn/hadoop-yarn-server/hadoop-yarn-server-timelineservice-hbase/src/main/java/org/apache/hadoop/yarn/server/timelineservice/storage/flow/FlowActivityColumnPrefix.java (delete) hadoop-yarn-project/hadoop-yarn/hadoop-yarn-server/hadoop-yarn-server-timelineservice/src/main/java/org/apache/hadoop/yarn/server/timelineservice/storage/flow/FlowRunCoprocessor.java (delete) hadoop-yarn-project/hadoop-yarn/hadoop-yarn-server/hadoop-yarn-server-timelineservice/src/main/java/org/apache/hadoop/yarn/server/timelineservice/storage/common/ColumnFamily.java (add) hadoop-yarn-project/hadoop-yarn/hadoop-yarn-server/hadoop-yarn-server-timelineservice-hbase/src/main/java/org/apache/hadoop/yarn/server/timelineservice/storage/reader/FlowActivityEntityReader.java (delete) hadoop-yarn-project/hadoop-yarn/hadoop-yarn-server/hadoop-yarn-server-timelineservice/src/main/java/org/apache/hadoop/yarn/server/timelineservice/storage/flow/FlowRunColumnFamily.java (delete) hadoop-yarn-project/hadoop-yarn/hadoop-yarn-server/hadoop-yarn-server-timelineservice/src/main/java/org/apache/hadoop/yarn/server/timelineservice/storage/common/LongConverter.java (delete) hadoop-yarn-project/hadoop-yarn/hadoop-yarn-server/hadoop-yarn-server-timelineservice/src/main/java/org/apache/hadoop/yarn/server/timelineservice/storage/reader/TimelineEntityReader.java (edit) hadoop-project/pom.xml (add) hadoop-yarn-project/hadoop-yarn/hadoop-yarn-server/hadoop-yarn-server-timelineservice-hbase/src/main/java/org/apache/hadoop/yarn/server/timelineservice/reader/filter/package-info.java (delete) hadoop-yarn-project/hadoop-yarn/hadoop-yarn-server/hadoop-yarn-server-timelineservice/src/main/java/org/apache/hadoop/yarn/server/timelineservice/storage/common/BufferedMutatorDelegator.java (delete) hadoop-yarn-project/hadoop-yarn/hadoop-yarn-server/hadoop-yarn-server-timelineservice/src/main/java/org/apache/hadoop/yarn/server/timelineservice/storage/flow/FlowRunTable.java (edit) hadoop-yarn-project/hadoop-yarn/hadoop-yarn-site/src/site/markdown/TimelineServiceV2.md (delete) hadoop-yarn-project/hadoop-yarn/hadoop-yarn-server/hadoop-yarn-server-timelineservice/src/main/java/org/apache/hadoop/yarn/server/timelineservice/storage/entity/EntityRowKey.java (delete) hadoop-yarn-project/hadoop-yarn/hadoop-yarn-server/hadoop-yarn-server-timelineservice/src/main/java/org/apache/hadoop/yarn/server/timelineservice/storage/entity/EntityRowKeyPrefix.java (add) hadoop-yarn-project/hadoop-yarn/hadoop-yarn-server/hadoop-yarn-server-timelineservice-hbase/src/main/java/org/apache/hadoop/yarn/server/timelineservice/storage/application/ApplicationRowKeyPrefix.java (add) hadoop-yarn-project/hadoop-yarn/hadoop-yarn-server/hadoop-yarn-server-timelineservice-hbase/src/test/java/org/apache/hadoop/yarn/server/timelineservice/storage/common/TestSeparator.java (add) hadoop-yarn-project/hadoop-yarn/hadoop-yarn-server/hadoop-yarn-server-timelineservice-hbase/src/main/java/org/apache/hadoop/yarn/server/timelineservice/storage/common/Range.java (add) hadoop-yarn-project/hadoop-yarn/hadoop-yarn-server/hadoop-yarn-server-timelineservice-hbase/src/main/java/org/apache/hadoop/yarn/server/timelineservice/storage/flow/FlowScanner.java (delete) hadoop-yarn-project/hadoop-yarn/hadoop-yarn-server/hadoop-yarn-server-timelineservice/src/main/java/org/apache/hadoop/yarn/server/timelineservice/storage/flow/AggregationOperation.java (add) hadoop-yarn-project/hadoop-yarn/hadoop-yarn-server/hadoop-yarn-server-timelineservice-hbase/src/main/java/org/apache/hadoop/yarn/server/timelineservice/storage/flow/FlowRunCoprocessor.java (delete) hadoop-yarn-project/hadoop-yarn/hadoop-yarn-server/hadoop-yarn-server-timelineservice/src/main/java/org/apache/hadoop/yarn/server/timelineservice/storage/entity/EntityColumn.java (delete) hadoop-yarn-project/hadoop-yarn/hadoop-yarn-server/hadoop-yarn-server-timelineservice/src/main/java/org/apache/hadoop/yarn/server/timelineservice/storage/entity/package-info.java (delete) hadoop-yarn-project/hadoop-yarn/hadoop-yarn-server/hadoop-yarn-server-timelineservice/src/main/java/org/apache/hadoop/yarn/server/timelineservice/storage/common/Column.java (delete) hadoop-yarn-project/hadoop-yarn/hadoop-yarn-server/hadoop-yarn-server-timelineservice/src/main/java/org/apache/hadoop/yarn/server/timelineservice/storage/flow/FlowRunColumnPrefix.java (delete) hadoop-yarn-project/hadoop-yarn/hadoop-yarn-server/hadoop-yarn-server-timelineservice/src/main/java/org/apache/hadoop/yarn/server/timelineservice/storage/apptoflow/AppToFlowColumnFamily.java (delete) hadoop-yarn-project/hadoop-yarn/hadoop-yarn-server/hadoop-yarn-server-timelineservice/src/main/java/org/apache/hadoop/yarn/server/timelineservice/storage/common/GenericConverter.java (add) hadoop-yarn-project/hadoop-yarn/hadoop-yarn-server/hadoop-yarn-server-timelineservice-hbase/src/main/java/org/apache/hadoop/yarn/server/timelineservice/storage/common/RowKeyPrefix.java (delete) hadoop-yarn-project/hadoop-yarn/hadoop-yarn-server/hadoop-yarn-server-timelineservice/src/main/java/org/apache/hadoop/yarn/server/timelineservice/storage/flow/FlowActivityTable.java (delete) hadoop-yarn-project/hadoop-yarn/hadoop-yarn-server/hadoop-yarn-server-timelineservice/src/main/java/org/apache/hadoop/yarn/server/timelineservice/storage/common/KeyConverter.java (add) hadoop-yarn-project/hadoop-yarn/hadoop-yarn-server/hadoop-yarn-server-timelineservice-hbase/src/main/java/org/apache/hadoop/yarn/server/timelineservice/storage/flow/FlowActivityTable.java (add) hadoop-yarn-project/hadoop-yarn/hadoop-yarn-server/hadoop-yarn-server-timelineservice-hbase/src/main/java/org/apache/hadoop/yarn/server/timelineservice/storage/reader/GenericEntityReader.java (add) hadoop-yarn-project/hadoop-yarn/hadoop-yarn-server/hadoop-yarn-server-timelineservice-hbase/src/main/java/org/apache/hadoop/yarn/server/timelineservice/storage/HBaseTimelineWriterImpl.java (delete) hadoop-yarn-project/hadoop-yarn/hadoop-yarn-server/hadoop-yarn-server-timelineservice/src/main/java/org/apache/hadoop/yarn/server/timelineservice/storage/application/ApplicationRowKey.java (delete) hadoop-yarn-project/hadoop-yarn/hadoop-yarn-server/hadoop-yarn-server-timelineservice/src/main/java/org/apache/hadoop/yarn/server/timelineservice/storage/apptoflow/package-info.java (add) hadoop-yarn-project/hadoop-yarn/hadoop-yarn-server/hadoop-yarn-server-timelineservice-hbase/src/main/java/org/apache/hadoop/yarn/server/timelineservice/storage/common/AppIdKeyConverter.java (add) hadoop-yarn-project/hadoop-yarn/hadoop-yarn-server/hadoop-yarn-server-timelineservice-hbase/src/main/java/org/apache/hadoop/yarn/server/timelineservice/storage/flow/FlowRunTable.java (add) hadoop-yarn-project/hadoop-yarn/hadoop-yarn-server/hadoop-yarn-server-timelineservice-hbase/src/main/java/org/apache/hadoop/yarn/server/timelineservice/storage/common/StringKeyConverter.java (delete) hadoop-yarn-project/hadoop-yarn/hadoop-yarn-server/hadoop-yarn-server-timelineservice/src/main/java/org/apache/hadoop/yarn/server/timelineservice/storage/common/package-info.java (add) hadoop-yarn-project/hadoop-yarn/hadoop-yarn-server/hadoop-yarn-server-timelineservice-hbase/src/main/java/org/apache/hadoop/yarn/server/timelineservice/storage/entity/EntityRowKey.java (add) hadoop-yarn-project/hadoop-yarn/hadoop-yarn-server/hadoop-yarn-server-timelineservice-hbase/src/test/java/org/apache/hadoop/yarn/server/timelineservice/storage/common/TestRowKeys.java (delete) hadoop-yarn-project/hadoop-yarn/hadoop-yarn-server/hadoop-yarn-server-timelineservice/src/main/java/org/apache/hadoop/yarn/server/timelineservice/storage/common/ValueConverter.java (delete) hadoop-yarn-project/hadoop-yarn/hadoop-yarn-server/hadoop-yarn-server-timelineservice/src/main/java/org/apache/hadoop/yarn/server/timelineservice/storage/common/AppIdKeyConverter.java (add) hadoop-yarn-project/hadoop-yarn/hadoop-yarn-server/hadoop-yarn-server-timelineservice-hbase/src/main/java/org/apache/hadoop/yarn/server/timelineservice/storage/common/NumericValueConverter.java (edit) hadoop-yarn-project/hadoop-yarn/hadoop-yarn-server/hadoop-yarn-server-resourcemanager/src/test/java/org/apache/hadoop/yarn/server/resourcemanager/TestRMRestart.java
        Hide
        sjlee0 Sangjin Lee added a comment -

        Committed the change to trunk and branch-3.0.0-alpha2, and YARN-5355 and YARN-5355-branch-2.

        I adjusted the version in the new pom.xml to match the right version in each case. I also fixed the doc change for the YARN-5355 branch.

        Thanks Haibo Chen for your contribution!

        Show
        sjlee0 Sangjin Lee added a comment - Committed the change to trunk and branch-3.0.0-alpha2, and YARN-5355 and YARN-5355 -branch-2. I adjusted the version in the new pom.xml to match the right version in each case. I also fixed the doc change for the YARN-5355 branch. Thanks Haibo Chen for your contribution!
        Hide
        haibochen Haibo Chen added a comment -

        Thanks Sangjin Lee for your reviews!

        Show
        haibochen Haibo Chen added a comment - Thanks Sangjin Lee for your reviews!
        Hide
        andrew.wang Andrew Wang added a comment -

        Perfect, thanks all!

        Show
        andrew.wang Andrew Wang added a comment - Perfect, thanks all!
        Hide
        hudson Hudson added a comment -

        SUCCESS: Integrated in Jenkins build Hadoop-trunk-Commit #12271 (See https://builds.apache.org/job/Hadoop-trunk-Commit/12271/)
        YARN-5928. Move ATSv2 HBase backend code into a new module that is only (varunsaxena: rev ccb38c19919d197ac751852717d4cac76518c211)

        • (edit) hadoop-yarn-project/hadoop-yarn/hadoop-yarn-server/hadoop-yarn-server-timelineservice-hbase/src/main/java/org/apache/hadoop/yarn/server/timelineservice/storage/package-info.java
        • (edit) hadoop-yarn-project/hadoop-yarn/hadoop-yarn-server/hadoop-yarn-server-resourcemanager/src/test/java/org/apache/hadoop/yarn/server/resourcemanager/TestRMHATimelineCollectors.java
        • (edit) hadoop-yarn-project/hadoop-yarn/hadoop-yarn-site/src/site/markdown/TimelineServiceV2.md
        Show
        hudson Hudson added a comment - SUCCESS: Integrated in Jenkins build Hadoop-trunk-Commit #12271 (See https://builds.apache.org/job/Hadoop-trunk-Commit/12271/ ) YARN-5928 . Move ATSv2 HBase backend code into a new module that is only (varunsaxena: rev ccb38c19919d197ac751852717d4cac76518c211) (edit) hadoop-yarn-project/hadoop-yarn/hadoop-yarn-server/hadoop-yarn-server-timelineservice-hbase/src/main/java/org/apache/hadoop/yarn/server/timelineservice/storage/package-info.java (edit) hadoop-yarn-project/hadoop-yarn/hadoop-yarn-server/hadoop-yarn-server-resourcemanager/src/test/java/org/apache/hadoop/yarn/server/resourcemanager/TestRMHATimelineCollectors.java (edit) hadoop-yarn-project/hadoop-yarn/hadoop-yarn-site/src/site/markdown/TimelineServiceV2.md

          People

          • Assignee:
            haibochen Haibo Chen
            Reporter:
            haibochen Haibo Chen
          • Votes:
            0 Vote for this issue
            Watchers:
            7 Start watching this issue

            Dates

            • Created:
              Updated:
              Resolved:

              Development