XMLWordPrintableJSON

    Details

    • Type: Bug
    • Status: Resolved
    • Priority: Major
    • Resolution: Fixed
    • Affects Version/s: 1.5.0
    • Fix Version/s: 1.5.0
    • Component/s: None
    • Labels:
      None

      Description

      The (my) new ImageTest introduced in FINERACT-1218 seems to fail on Travis - but only sometimes:

      > Task :fineract-client:test FAILED
      
      (...)
      
      ImageTest > getSmallerSize() FAILED
      
          org.apache.fineract.client.util.CallFailedRuntimeException at ImageTest.java:69
      
      ImageTest > getBiggerSize() FAILED
      
          org.apache.fineract.client.util.CallFailedRuntimeException at ImageTest.java:76
      
      ImageTest > getInlineOctetOutput() FAILED
      
          org.apache.fineract.client.util.CallFailedRuntimeException at ImageTest.java:84
      
      ImageTest > getOctetOutput() FAILED
      
          org.apache.fineract.client.util.CallFailedRuntimeException at ImageTest.java:93
      
      ImageTest > getAnotherOutput() FAILED
      
          org.apache.fineract.client.util.CallFailedRuntimeException at ImageTest.java:102
      
      ImageTest > getText() FAILED
      
          org.apache.fineract.client.util.CallFailedRuntimeException at ImageTest.java:110
      
      ImageTest > getBytes() FAILED
      
          org.apache.fineract.client.util.CallFailedRuntimeException at ImageTest.java:118
      
      31 tests completed, 7 failed, 2 skipped

      This MAY be due to some intermittent problem on https://www.fineract.dev, which those tests currently run against? (But the error logs there don't show anything.)

        Attachments

          Issue Links

            Activity

              People

              • Assignee:
                vorburger Michael Vorburger
                Reporter:
                vorburger Michael Vorburger
              • Votes:
                0 Vote for this issue
                Watchers:
                1 Start watching this issue

                Dates

                • Created:
                  Updated:
                  Resolved: