Uploaded image for project: 'Hadoop YARN'
  1. Hadoop YARN
  2. YARN-9743

[JDK11] TestTimelineWebServices.testContextFactory fails

    XMLWordPrintableJSON

    Details

    • Type: Bug
    • Status: Open
    • Priority: Major
    • Resolution: Unresolved
    • Affects Version/s: 3.2.0
    • Fix Version/s: None
    • Component/s: timelineservice
    • Labels:
      None
    • Target Version/s:

      Description

      Tested on OpenJDK 11.0.2 on a Mac.

      Stack trace:

      [ERROR] Tests run: 29, Failures: 0, Errors: 3, Skipped: 0, Time elapsed: 36.016 s <<< FAILURE! - in org.apache.hadoop.yarn.server.timeline.webapp.TestTimelineWebServices
      [ERROR] testContextFactory(org.apache.hadoop.yarn.server.timeline.webapp.TestTimelineWebServices)  Time elapsed: 1.031 s  <<< ERROR!
      java.lang.ClassNotFoundException: com.sun.xml.internal.bind.v2.ContextFactory
      	at java.base/jdk.internal.loader.BuiltinClassLoader.loadClass(BuiltinClassLoader.java:583)
      	at java.base/jdk.internal.loader.ClassLoaders$AppClassLoader.loadClass(ClassLoaders.java:178)
      	at java.base/java.lang.ClassLoader.loadClass(ClassLoader.java:521)
      	at java.base/java.lang.Class.forName0(Native Method)
      	at java.base/java.lang.Class.forName(Class.java:315)
      	at org.apache.hadoop.yarn.server.applicationhistoryservice.webapp.ContextFactory.newContext(ContextFactory.java:85)
      	at org.apache.hadoop.yarn.server.applicationhistoryservice.webapp.ContextFactory.createContext(ContextFactory.java:112)
      	at org.apache.hadoop.yarn.server.timeline.webapp.TestTimelineWebServices.testContextFactory(TestTimelineWebServices.java:1039)
      	at java.base/jdk.internal.reflect.NativeMethodAccessorImpl.invoke0(Native Method)
      	at java.base/jdk.internal.reflect.NativeMethodAccessorImpl.invoke(NativeMethodAccessorImpl.java:62)
      	at java.base/jdk.internal.reflect.DelegatingMethodAccessorImpl.invoke(DelegatingMethodAccessorImpl.java:43)
      	at java.base/java.lang.reflect.Method.invoke(Method.java:566)
      	at org.junit.runners.model.FrameworkMethod$1.runReflectiveCall(FrameworkMethod.java:50)
      	at org.junit.internal.runners.model.ReflectiveCallable.run(ReflectiveCallable.java:12)
      	at org.junit.runners.model.FrameworkMethod.invokeExplosively(FrameworkMethod.java:47)
      	at org.junit.internal.runners.statements.InvokeMethod.evaluate(InvokeMethod.java:17)
      	at org.junit.internal.runners.statements.RunBefores.evaluate(RunBefores.java:26)
      	at org.junit.internal.runners.statements.RunAfters.evaluate(RunAfters.java:27)
      	at org.junit.runners.ParentRunner.runLeaf(ParentRunner.java:325)
      	at org.junit.runners.BlockJUnit4ClassRunner.runChild(BlockJUnit4ClassRunner.java:78)
      	at org.junit.runners.BlockJUnit4ClassRunner.runChild(BlockJUnit4ClassRunner.java:57)
      	at org.junit.runners.ParentRunner$3.run(ParentRunner.java:290)
      	at org.junit.runners.ParentRunner$1.schedule(ParentRunner.java:71)
      	at org.junit.runners.ParentRunner.runChildren(ParentRunner.java:288)
      	at org.junit.runners.ParentRunner.access$000(ParentRunner.java:58)
      	at org.junit.runners.ParentRunner$2.evaluate(ParentRunner.java:268)
      	at org.junit.runners.ParentRunner.run(ParentRunner.java:363)
      	at org.apache.maven.surefire.junit4.JUnit4Provider.execute(JUnit4Provider.java:365)
      	at org.apache.maven.surefire.junit4.JUnit4Provider.executeWithRerun(JUnit4Provider.java:273)
      	at org.apache.maven.surefire.junit4.JUnit4Provider.executeTestSet(JUnit4Provider.java:238)
      	at org.apache.maven.surefire.junit4.JUnit4Provider.invoke(JUnit4Provider.java:159)
      	at org.apache.maven.surefire.booter.ForkedBooter.invokeProviderInSameClassLoader(ForkedBooter.java:384)
      	at org.apache.maven.surefire.booter.ForkedBooter.runSuitesInProcess(ForkedBooter.java:345)
      	at org.apache.maven.surefire.booter.ForkedBooter.execute(ForkedBooter.java:126)
      	at org.apache.maven.surefire.booter.ForkedBooter.main(ForkedBooter.java:418)
      

        Attachments

          Issue Links

            Activity

              People

              • Assignee:
                kmarton Kinga Marton
                Reporter:
                adam.antal Adam Antal
              • Votes:
                0 Vote for this issue
                Watchers:
                3 Start watching this issue

                Dates

                • Created:
                  Updated: