Uploaded image for project: 'Hadoop YARN'
  1. Hadoop YARN
  2. YARN-4379

TestWebApp failing in trunk

    XMLWordPrintableJSON

    Details

    • Type: Bug
    • Status: Resolved
    • Priority: Major
    • Resolution: Not A Problem
    • Affects Version/s: 2.7.1
    • Fix Version/s: None
    • Component/s: None
    • Labels:
      None

      Description

      Tests run: 9, Failures: 0, Errors: 1, Skipped: 0, Time elapsed: 4.917 sec <<< FAILURE! - in org.apache.hadoop.yarn.webapp.TestWebApp
      testYARNWebAppContext(org.apache.hadoop.yarn.webapp.TestWebApp)  Time elapsed: 1.828 sec  <<< ERROR!
      java.lang.RuntimeException: java.io.IOException: Server returned HTTP response code: 403 for URL: http://localhost:57512/static/
      	at sun.net.www.protocol.http.HttpURLConnection.getInputStream(HttpURLConnection.java:1628)
      	at org.apache.hadoop.yarn.webapp.TestWebApp.getContent(TestWebApp.java:293)
      	at org.apache.hadoop.yarn.webapp.TestWebApp.testYARNWebAppContext(TestWebApp.java:276)
      

        Attachments

        1. YARN-4379.01.patch
          1 kB
          Varun Saxena

          Issue Links

            Activity

              People

              • Assignee:
                Unassigned
                Reporter:
                varun_saxena Varun Saxena
              • Votes:
                0 Vote for this issue
                Watchers:
                6 Start watching this issue

                Dates

                • Created:
                  Updated:
                  Resolved: