XMLWordPrintableJSON

    Details

    • Type: Sub-task
    • Status: Resolved
    • Priority: Major
    • Resolution: Fixed
    • Affects Version/s: 4.14.0
    • Fix Version/s: 4.14.0, 5.0.0
    • Component/s: None
    • Labels:

      Description

      [ERROR] Tests run: 46, Failures: 1, Errors: 0, Skipped: 0, Time elapsed: 117.444 s <<< FAILURE! - in org.apache.phoenix.end2end.RowValueConstructorIT
      [ERROR] testRVCLastPkIsTable1stPkIndex(org.apache.phoenix.end2end.RowValueConstructorIT)  Time elapsed: 4.516 s  <<< FAILURE!
      java.lang.AssertionError
              at org.apache.phoenix.end2end.RowValueConstructorIT.testRVCLastPkIsTable1stPkIndex(RowValueConstructorIT.java:1584)
      
      ERROR] Tests run: 14, Failures: 1, Errors: 0, Skipped: 0, Time elapsed: 79.381 s <<< FAILURE! - in org.apache.phoenix.end2end.index.IndexMetadataIT
      [ERROR] testMutableTableOnlyHasPrimaryKeyIndex(org.apache.phoenix.end2end.index.IndexMetadataIT)  Time elapsed: 4.504 s  <<< FAILURE!
      java.lang.AssertionError
              at org.apache.phoenix.end2end.index.IndexMetadataIT.helpTestTableOnlyHasPrimaryKeyIndex(IndexMetadataIT.java:662)
              at org.apache.phoenix.end2end.index.IndexMetadataIT.testMutableTableOnlyHasPrimaryKeyIndex(IndexMetadataIT.java:623)
      

        Attachments

        1. PHOENIX-4496.patch
          1 kB
          Ankit Singhal

          Issue Links

            Activity

              People

              • Assignee:
                ankit@apache.org Ankit Singhal
                Reporter:
                rajeshbabu Rajeshbabu Chintaguntla
              • Votes:
                0 Vote for this issue
                Watchers:
                5 Start watching this issue

                Dates

                • Created:
                  Updated:
                  Resolved: