Details

    • Type: Bug
    • Status: Closed
    • Priority: Minor
    • Resolution: Fixed
    • Affects Version/s: 2.5
    • Fix Version/s: 2.9
    • Component/s: dependencies
    • Labels:
      None

      Description

      It appears that MPIR-158 has regressed. I'm seeing the same exact issue in 2.5 with Maven 3.0.4:

      [INFO] Generating "Dependencies" report    --- maven-project-info-reports-plugin:2.5
      [ERROR] Artifact: com.sun:tools:jar:1.5.0 has no file.
      [ERROR] Artifact: com.thoughtworks.xstream:xstream:jar:1.3 has no file.
      [ERROR] Artifact: commons-beanutils:commons-beanutils:jar:1.8.0 has no file.
      [ERROR] Artifact: commons-cli:commons-cli:jar:1.1 has no file.
      [ERROR] Artifact: commons-codec:commons-codec:jar:1.3 has no file.
      [ERROR] Artifact: commons-collections:commons-collections:jar:3.2.1 has no file.
      [ERROR] Artifact: commons-digester:commons-digester:jar:2.0 has no file.
      [ERROR] Artifact: commons-fileupload:commons-fileupload:jar:1.2.2 has no file.
      ...
      1. pom.xml
        2 kB
        Myron
      2. pom.xml
        1 kB
        Dojcsák Sándor
      3. MPIR-251-artifact-has-no-file.zip
        3 kB
        Hervé Boutemy

        Issue Links

          Activity

          Show
          ian@ianbrandt.com Ian Brandt added a comment - The original fix: http://svn.apache.org/viewvc?diff_format=h&view=revision&revision=1036825
          Hide
          myron Myron added a comment -

          FYI
          I'm seeing the same with version 2.4
          But NOT with 2.3!
          (mvn 3.0.4)

          Show
          myron Myron added a comment - FYI I'm seeing the same with version 2.4 But NOT with 2.3! (mvn 3.0.4)
          Hide
          hboutemy Hervé Boutemy added a comment -

          do you have a reproducible test case?

          Show
          hboutemy Hervé Boutemy added a comment - do you have a reproducible test case?
          Hide
          myron Myron added a comment -

          I reduced my POM to the minimum... and it only happens when i include my uploaded oracle ojdbc driver and use PIR v2.4+

          (Has been uploaded to our local Nexus 1.8.x months ago and has only the generated POM)

          Removing that doesn't display the "errors"...

          Show
          myron Myron added a comment - I reduced my POM to the minimum... and it only happens when i include my uploaded oracle ojdbc driver and use PIR v2.4+ (Has been uploaded to our local Nexus 1.8.x months ago and has only the generated POM) Removing that doesn't display the "errors"...
          Hide
          hboutemy Hervé Boutemy added a comment - - edited

          IIUC, you have an artifact in your repository that has no file, then the message would be consistent for this one
          but the problem would be that when one artifact is found without any file, every artifact is reported as having no file

          I'll try to reproduce such conditions

          Show
          hboutemy Hervé Boutemy added a comment - - edited IIUC, you have an artifact in your repository that has no file, then the message would be consistent for this one but the problem would be that when one artifact is found without any file, every artifact is reported as having no file I'll try to reproduce such conditions
          Hide
          hboutemy Hervé Boutemy added a comment -

          I tried but cannot reproduce the issue
          sorry, can't help...

          Show
          hboutemy Hervé Boutemy added a comment - I tried but cannot reproduce the issue sorry, can't help...
          Hide
          myron Myron added a comment -

          Thanks Hervé for looking into this.

          What exactly does "has no file" mean?
          It's a regular upload, with jar, javadooc, pom, ....

          Just an addendum
          With the uploaded ojdbc driver it complains about the following:

          [INFO] Generating "Dependencies" report — maven-project-info-reports-plugin:2.4
          [ERROR] Artifact: dom4j:dom4j:jar:1.6.1 has no file.
          [ERROR] Artifact: javax.transaction:jta:jar:1.1 has no file.
          [ERROR] Artifact: stax:stax-api:jar:1.0.1 has no file.
          [ERROR] Artifact: xml-apis:xml-apis:jar:1.0.b2 has no file.
          [WARNING] The repository url 'http://mycompany.com/nexus/content/groups/public' is invalid - Repository 'nexus' will be blacklisted.

          Note that the ojdbc is NOT included?!?
          Without the ojdbc, the errors are gone.

          Could the temporary nexus-offline warning be a culprit?
          Dunno why Maven sees this as offline; it works for everything else so far...

          Show
          myron Myron added a comment - Thanks Hervé for looking into this. What exactly does "has no file" mean? It's a regular upload, with jar, javadooc, pom, .... Just an addendum With the uploaded ojdbc driver it complains about the following: [INFO] Generating "Dependencies" report — maven-project-info-reports-plugin:2.4 [ERROR] Artifact: dom4j:dom4j:jar:1.6.1 has no file. [ERROR] Artifact: javax.transaction:jta:jar:1.1 has no file. [ERROR] Artifact: stax:stax-api:jar:1.0.1 has no file. [ERROR] Artifact: xml-apis:xml-apis:jar:1.0.b2 has no file. [WARNING] The repository url 'http://mycompany.com/nexus/content/groups/public' is invalid - Repository 'nexus' will be blacklisted. Note that the ojdbc is NOT included?!? Without the ojdbc, the errors are gone. Could the temporary nexus-offline warning be a culprit? Dunno why Maven sees this as offline; it works for everything else so far...
          Hide
          fredcooke Fred Cooke added a comment -

          I also get this with Maven 3.0.4, maven-project-info-reports-plugin 2.6 and oracle artifacts in the dependency tree. Additionally, I noticed that my CPU usage went low for a while while Dependencies report just hung waiting for something. Through the rest of the build it hogged a core (which is fine). If I can help by testing snapshots of the plugin, I'll gladly do so.

          Show
          fredcooke Fred Cooke added a comment - I also get this with Maven 3.0.4, maven-project-info-reports-plugin 2.6 and oracle artifacts in the dependency tree. Additionally, I noticed that my CPU usage went low for a while while Dependencies report just hung waiting for something. Through the rest of the build it hogged a core (which is fine). If I can help by testing snapshots of the plugin, I'll gladly do so.
          Hide
          ntshko Hannes Kogler added a comment - - edited

          I got the same error messages too. (Maven version 3.0.4; Plugin versions: maven-site-plugin3.2 & maven-project-info-reports-plugin 2.6)

          Hoping that there is anybody who creates a bugfix for it!

          A suitable workaround if waiting for a bugfix is not a eal option, just try to config the maven-project-info-reports-plugin with less message details:

          Bar.java
                  <reporting>
          		<plugins> ...
          			<plugin>
          				<groupId>org.apache.maven.plugins</groupId>
          				<artifactId>maven-project-info-reports-plugin</artifactId>
          				<version>2.6</version>
          				<configuration>
          					<dependencyDetailsEnabled>false</dependencyDetailsEnabled>
          					<dependencyLocationsEnabled>false</dependencyLocationsEnabled>
          				</configuration>
          			</plugin>
                                  ...
          		</plugins>
          	</reporting>
          

          it works for me!

          Show
          ntshko Hannes Kogler added a comment - - edited I got the same error messages too. (Maven version 3.0.4; Plugin versions: maven-site-plugin3.2 & maven-project-info-reports-plugin 2.6) Hoping that there is anybody who creates a bugfix for it! A suitable workaround if waiting for a bugfix is not a eal option, just try to config the maven-project-info-reports-plugin with less message details: Bar.java <reporting> <plugins> ... <plugin> <groupId>org.apache.maven.plugins</groupId> <artifactId>maven-project-info-reports-plugin</artifactId> <version>2.6</version> <configuration> <dependencyDetailsEnabled> false </dependencyDetailsEnabled> <dependencyLocationsEnabled> false </dependencyLocationsEnabled> </configuration> </plugin> ... </plugins> </reporting> it works for me!
          Hide
          fredcooke Fred Cooke added a comment -

          One additional note which may help, the oracle jars do not appear to have manifests in them, output from one-jar:

          JarClassLoader: Warning: Null manifest from input stream associated with: lib/xmlcomp-1.0.jar
          JarClassLoader: Warning: Null manifest from input stream associated with: lib/xdb-1.0.jar
          JarClassLoader: Warning: Null manifest from input stream associated with: lib/xmlparserv2-1.0.jar
          

          Which doesn't appear to be true, but could be related:

          fred@:~/.m2/repository/com/oracle/xmlcomp/1.0$ cat META-INF/MANIFEST.MF
          Manifest-Version: 1.0
          Sealed: true
          Created-By: 1.4.2_08 (Sun Microsystems Inc.)
          
          Name: oracle/xml/async/
          Sealed: false
          
          Name: oracle/xml/transviewer/
          Sealed: false
          
          Name: oracle/xml/schemavalidator/
          Sealed: false
          
          Name: oracle/xml/differ/
          Sealed: false
          
          Name: oracle/xml/dbaccess/
          Sealed: false
          
          Show
          fredcooke Fred Cooke added a comment - One additional note which may help, the oracle jars do not appear to have manifests in them, output from one-jar: JarClassLoader: Warning: Null manifest from input stream associated with: lib/xmlcomp-1.0.jar JarClassLoader: Warning: Null manifest from input stream associated with: lib/xdb-1.0.jar JarClassLoader: Warning: Null manifest from input stream associated with: lib/xmlparserv2-1.0.jar Which doesn't appear to be true, but could be related: fred@:~/.m2/repository/com/oracle/xmlcomp/1.0$ cat META-INF/MANIFEST.MF Manifest-Version: 1.0 Sealed: true Created-By: 1.4.2_08 (Sun Microsystems Inc.) Name: oracle/xml/async/ Sealed: false Name: oracle/xml/transviewer/ Sealed: false Name: oracle/xml/schemavalidator/ Sealed: false Name: oracle/xml/differ/ Sealed: false Name: oracle/xml/dbaccess/ Sealed: false
          Hide
          tepichrow Steve Brown added a comment -

          This issue affects version 2.7 running on Maven 3.0.4. I have reproduced the behaviour of a project with Oracle jar file dependencies. The issue occurs only when there are Oracle jar files (e.g. ojdbc16.jar) in the dependencies.

          Show
          tepichrow Steve Brown added a comment - This issue affects version 2.7 running on Maven 3.0.4. I have reproduced the behaviour of a project with Oracle jar file dependencies. The issue occurs only when there are Oracle jar files (e.g. ojdbc16.jar) in the dependencies.
          Hide
          michael-o Michael Osipov added a comment -

          Is this issue still valid?

          Show
          michael-o Michael Osipov added a comment - Is this issue still valid?
          Hide
          armbrust Dan Armbrust added a comment - - edited

          Yes, this issue still happens.

          <groupId>org.apache.maven.plugins</groupId>
          <artifactId>maven-project-info-reports-plugin</artifactId>
          <version>2.7</version>

          Apache Maven 3.2.5 (12a6b3acb947671f09b81f49094c53f426d8cea1; 2014-12-14T11:29:23-06:00)

          [ERROR] Artifact: org.apache.felix:org.osgi.core:jar:1.4.0 has no file.
          [ERROR] Artifact: org.apache.geronimo.specs:geronimo-stax-api_1.0_spec:jar:1.0 has no file.
          [ERROR] Artifact: org.apache.httpcomponents:httpclient:jar:4.1.3 has no file.
          [ERROR] Artifact: org.apache.httpcomponents:httpcore:jar:4.1.4 has no file.
          [ERROR] Artifact: org.apache.lucene:lucene-analyzers-common:jar:4.3.1 has no file.
          [ERROR] Artifact: org.apache.lucene:lucene-core:jar:4.3.1 has no file.
          [ERROR] Artifact: org.apache.lucene:lucene-queries:jar:4.3.1 has no file.
          [ERROR] Artifact: org.apache.lucene:lucene-queryparser:jar:4.3.1 has no file.
          [ERROR] Artifact: org.apache.lucene:lucene-sandbox:jar:4.3.1 has no file.
          [ERROR] Artifact: org.apache.mahout:mahout-collections:jar:1.0 has no file.
          [ERROR] Artifact: org.apache.mahout:mahout-math:jar:0.7 has no file.
          [ERROR] Artifact: org.apache.maven:maven-aether-provider:jar:3.0.5 has no file.
          [ERROR] Artifact: org.apache.maven:maven-artifact:jar:3.0.5 has no file.
          [ERROR] Artifact: org.apache.maven:maven-compat:jar:3.0.5 has no file.
          .....
          Show
          armbrust Dan Armbrust added a comment - - edited Yes, this issue still happens. <groupId> org.apache.maven.plugins </groupId> <artifactId> maven-project-info-reports-plugin </artifactId> <version> 2.7 </version> Apache Maven 3.2.5 (12a6b3acb947671f09b81f49094c53f426d8cea1; 2014-12-14T11:29:23-06:00) [ERROR] Artifact: org.apache.felix:org.osgi.core:jar:1.4.0 has no file. [ERROR] Artifact: org.apache.geronimo.specs:geronimo-stax-api_1.0_spec:jar:1.0 has no file. [ERROR] Artifact: org.apache.httpcomponents:httpclient:jar:4.1.3 has no file. [ERROR] Artifact: org.apache.httpcomponents:httpcore:jar:4.1.4 has no file. [ERROR] Artifact: org.apache.lucene:lucene-analyzers-common:jar:4.3.1 has no file. [ERROR] Artifact: org.apache.lucene:lucene-core:jar:4.3.1 has no file. [ERROR] Artifact: org.apache.lucene:lucene-queries:jar:4.3.1 has no file. [ERROR] Artifact: org.apache.lucene:lucene-queryparser:jar:4.3.1 has no file. [ERROR] Artifact: org.apache.lucene:lucene-sandbox:jar:4.3.1 has no file. [ERROR] Artifact: org.apache.mahout:mahout-collections:jar:1.0 has no file. [ERROR] Artifact: org.apache.mahout:mahout-math:jar:0.7 has no file. [ERROR] Artifact: org.apache.maven:maven-aether-provider:jar:3.0.5 has no file. [ERROR] Artifact: org.apache.maven:maven-artifact:jar:3.0.5 has no file. [ERROR] Artifact: org.apache.maven:maven-compat:jar:3.0.5 has no file. .....
          Hide
          michael-o Michael Osipov added a comment -

          Version 2.8 has been released recently, can you retry?

          Show
          michael-o Michael Osipov added a comment - Version 2.8 has been released recently, can you retry?
          Hide
          armbrust Dan Armbrust added a comment -

          [INFO] Rendering site with org.apache.maven.skins:maven-default-skin:jar:1.0 skin.
          [INFO] Generating "About" report — maven-project-info-reports-plugin:2.8:index
          [INFO] Generating "Project License" report — maven-project-info-reports-plugin:2.8:license
          [INFO] Generating "Dependencies" report — maven-project-info-reports-plugin:2.8:dependencies
          [ERROR] Artifact: org.apache.felix:org.osgi.core:jar:1.4.0 has no file.
          [ERROR] Artifact: org.apache.geronimo.specs:geronimo-stax-api_1.0_spec:jar:1.0 has no file.
          [ERROR] Artifact: org.apache.httpcomponents:httpclient:jar:4.1.3 has no file.
          [ERROR] Artifact: org.apache.httpcomponents:httpcore:jar:4.1.4 has no file.
          [ERROR] Artifact: org.apache.lucene:lucene-analyzers-common:jar:4.3.1 has no file.
          [ERROR] Artifact: org.apache.lucene:lucene-core:jar:4.3.1 has no file.
          [ERROR] Artifact: org.apache.lucene:lucene-queries:jar:4.3.1 has no file.
          [ERROR] Artifact: org.apache.lucene:lucene-queryparser:jar:4.3.1 has no file.
          [ERROR] Artifact: org.apache.lucene:lucene-sandbox:jar:4.3.1 has no file.
          [ERROR] Artifact: org.apache.mahout:mahout-collections:jar:1.0 has no file.
          [ERROR] Artifact: org.apache.mahout:mahout-math:jar:0.7 has no file.

          It only happens for some of my sub-projects - so I suspect it only happens when the dependency chain includes some jar file that is broken in a way that sets off this chain of (harmless?) errors.

          Show
          armbrust Dan Armbrust added a comment - [INFO] Rendering site with org.apache.maven.skins:maven-default-skin:jar:1.0 skin. [INFO] Generating "About" report — maven-project-info-reports-plugin:2.8:index [INFO] Generating "Project License" report — maven-project-info-reports-plugin:2.8:license [INFO] Generating "Dependencies" report — maven-project-info-reports-plugin:2.8:dependencies [ERROR] Artifact: org.apache.felix:org.osgi.core:jar:1.4.0 has no file. [ERROR] Artifact: org.apache.geronimo.specs:geronimo-stax-api_1.0_spec:jar:1.0 has no file. [ERROR] Artifact: org.apache.httpcomponents:httpclient:jar:4.1.3 has no file. [ERROR] Artifact: org.apache.httpcomponents:httpcore:jar:4.1.4 has no file. [ERROR] Artifact: org.apache.lucene:lucene-analyzers-common:jar:4.3.1 has no file. [ERROR] Artifact: org.apache.lucene:lucene-core:jar:4.3.1 has no file. [ERROR] Artifact: org.apache.lucene:lucene-queries:jar:4.3.1 has no file. [ERROR] Artifact: org.apache.lucene:lucene-queryparser:jar:4.3.1 has no file. [ERROR] Artifact: org.apache.lucene:lucene-sandbox:jar:4.3.1 has no file. [ERROR] Artifact: org.apache.mahout:mahout-collections:jar:1.0 has no file. [ERROR] Artifact: org.apache.mahout:mahout-math:jar:0.7 has no file. It only happens for some of my sub-projects - so I suspect it only happens when the dependency chain includes some jar file that is broken in a way that sets off this chain of (harmless?) errors.
          Hide
          hboutemy Hervé Boutemy added a comment -

          can you try to run with debug trace and attach log file, please?
          perhaps there will be some information on what's causing the mysterious failure

          Show
          hboutemy Hervé Boutemy added a comment - can you try to run with debug trace and attach log file, please? perhaps there will be some information on what's causing the mysterious failure
          Hide
          armbrust Dan Armbrust added a comment - - edited

          Hmm, log file is huge... but I don't see anything of interest.

          It goes straight into the errors with no extra info - I've cut a few pieces of surrounding log:

          [INFO] <<< jdepend-maven-plugin:2.0:generate < compile @ app <<<
          [DEBUG] building maven31 dependency graph for gov.va.isaac.isaac-pa.modules:app:pom:Sprint_18-SNAPSHOT with Maven31DependencyGraphBuilder
          [DEBUG] Using mirror maestro (https://va.maestrodev.com/archiva/repository/all/) for central (https://repo.maven.apache.org/maven2).
          ...
          [DEBUG] Dependency collection stats: {ConflictMarker.analyzeTime=0, ConflictMarker.markTime=0, ConflictMarker.nodeCount=670, ConflictIdSorter.graphTime=1, ConflictIdSorter.topsortTime=0, ConflictIdSorter.conflictIdCount=203, ConflictIdSorter.conflictIdCycleCount=0, ConflictResolver.totalTime=4, ConflictResolver.conflictItemCount=500, DefaultDependencyCollector.collectTime=24, DefaultDependencyCollector.transformTime=5}
          [DEBUG] gov.va.isaac.isaac-pa.modules:app:pom:Sprint_18-SNAPSHOT
          [DEBUG]    gov.va.isaac.isaac-pa.modules:config:jar:Sprint_18-SNAPSHOT:compile
          [DEBUG]    gov.va.isaac.modules:isaac-app:jar:Sprint_18-SNAPSHOT:compile
          [DEBUG]       gov.va.isaac.modules:otf-util:jar:Sprint_18-SNAPSHOT:compile
          [DEBUG]          gov.va.isaac.modules:isaac-constants:jar:Sprint_18-SNAPSHOT:compile
          [DEBUG]       ch.qos.logback:logback-classic:jar:1.1.2:compile
          [DEBUG]          ch.qos.logback:logback-core:jar:1.1.2:compile
          [DEBUG]       org.slf4j:jul-to-slf4j:jar:1.7.7:compile
          [DEBUG]       org.slf4j:log4j-over-slf4j:jar:1.7.7:compile
          [DEBUG]       net.lingala.zip4j:zip4j:jar:1.3.2:compile
          [DEBUG]       org.glassfish.hk2:hk2:jar:2.3.0:compile
          [DEBUG]          org.glassfish.hk2:hk2-utils:jar:2.3.0:compile
          [DEBUG]             javax.inject:javax.inject:jar:1:compile
          [DEBUG]          org.glassfish.hk2:hk2-api:jar:2.3.0:compile
          [DEBUG]             org.glassfish.hk2.external:aopalliance-repackaged:jar:2.3.0:compile
          [DEBUG]          org.glassfish.hk2:config-types:jar:2.3.0:compile
          [DEBUG]          org.glassfish.hk2:core:jar:2.3.0:compile
          [DEBUG]          org.glassfish.hk2:hk2-config:jar:2.3.0:compile
          [DEBUG]             org.jvnet:tiger-types:jar:1.4:compile
          [DEBUG]             org.glassfish.hk2.external:bean-validator:jar:2.3.0:compile
          [DEBUG]          org.glassfish.hk2:hk2-locator:jar:2.3.0:compile
          [DEBUG]             org.glassfish.hk2.external:javax.inject:jar:2.3.0:compile
          [DEBUG]             org.javassist:javassist:jar:3.18.1-GA:compile
          [DEBUG]          org.glassfish.hk2:hk2-runlevel:jar:2.3.0:compile
          [DEBUG]          org.glassfish.hk2:class-model:jar:2.3.0:compile
          [DEBUG]             org.glassfish.hk2.external:asm-all-repackaged:jar:2.3.0:compile
          [DEBUG]       org.slf4j:slf4j-api:jar:1.7.7:compile
          [DEBUG]    gov.va.isaac.modules:import-export:jar:Sprint_18-SNAPSHOT:compile
          [DEBUG]       gov.va.isaac.modules:gui-util:jar:Sprint_18-SNAPSHOT:compile
          [DEBUG]          org.apache.commons:commons-lang3:jar:3.3:compile
          [DEBUG]       gov.va.isaac.modules:data-model:jar:Sprint_18-SNAPSHOT:compile
          [DEBUG]       org.ihtsdo.otf:tcc-datastore:jar:1.1-va-1.11-SNAPSHOT:compile
          [DEBUG]          com.sleepycat:je:jar:5.0.97:compile
          [DEBUG]          org.apache.mahout:mahout-collections:jar:1.0:compile
          [DEBUG]          org.apache.mahout:mahout-math:jar:0.7:compile
          [DEBUG]             org.apache.commons:commons-math:jar:2.2:compile
          [DEBUG]             org.uncommons.maths:uncommons-maths:jar:1.2.2:compile
          [DEBUG]                jfree:jcommon:jar:1.0.12:compile
          [DEBUG]             com.google.guava:guava:jar:r09:compile
          [DEBUG]          commons-lang:commons-lang:jar:2.6:compile
          [DEBUG]          org.ihtsdo.otf:tcc-model-impl:jar:1.1-va-1.11-SNAPSHOT:compile
          [DEBUG]             org.ihtsdo.otf:tcc-lookup:jar:1.1-va-1.11-SNAPSHOT:compile
          [DEBUG]                org.netbeans.api:org-openide-util-lookup:jar:RELEASE73:compile
          [DEBUG]          org.apache.lucene:lucene-core:jar:4.3.1:compile
          [DEBUG]       org.eclipse.uml2.uml:resources:jar:4.1.0-v20130902-0826:compile
          [DEBUG]          org.eclipse.uml2:uml:jar:4.1.2-v20140202-2055:compile
          [DEBUG]             org.eclipse.uml2:common:jar:1.8.2-v20140202-2055:compile
          [DEBUG]             org.eclipse.uml2:types:jar:1.1.0-v20140202-2055:compile
          [DEBUG]          org.eclipse.uml2.uml.profile:l2:jar:1.1.0-v20140202-2055:compile
          [DEBUG]          org.eclipse.uml2.uml.profile:l3:jar:1.1.0-v20140202-2055:compile
          [DEBUG]          org.eclipse.core:runtime:jar:3.10.0-v20140318-2214:compile
          [DEBUG]             org.eclipse:osgi:jar:3.10.0-v20140606-1445:compile
          [DEBUG]             org.eclipse.core:jobs:jar:3.6.0-v20140424-0053:compile
          [DEBUG]             org.eclipse.equinox:preferences:jar:3.5.200-v20140224-1527:compile
          [DEBUG]             org.eclipse.core:contenttype:jar:3.4.200-v20140207-1251:compile
          [DEBUG]       org.eclipse.emf.mapping:ecore2xml:jar:2.7.0-v20120917-0436:compile
          [DEBUG]       org.eclipse.emf:org.eclipse.emf.ecore:jar:2.9.1-v20130827-0309:compile
          [DEBUG]       org.eclipse.emf:org.eclipse.emf.ecore.xmi:jar:2.9.1-v20130827-0309:compile
          [DEBUG]       org.eclipse.emf:org.eclipse.emf.common:jar:2.9.1-v20130827-0309:compile
          [DEBUG]       net.sourceforge.owlapi:owlapi-distribution:jar:3.5.0:compile
          [DEBUG]          net.sourceforge.owlapi:owlapi-apibinding:jar:3.5.0:compile
          [DEBUG]             org.apache.felix:org.osgi.core:jar:1.4.0:compile
          [DEBUG]          net.sourceforge.owlapi:owlapi-api:jar:3.5.0:compile
          [DEBUG]          net.sourceforge.owlapi:owlapi-tools:jar:3.5.0:compile
          [DEBUG]          net.sourceforge.owlapi:owlapi-impl:jar:3.5.0:compile
          [DEBUG]          net.sourceforge.owlapi:owlapi-parsers:jar:3.5.0:compile
          [DEBUG]          net.sourceforge.owlapi:owlapi-oboformat:jar:3.5.0:compile
          [DEBUG]          net.sourceforge.owlapi:owlapi-contract:jar:3.5.0:compile
          [DEBUG]       org.eclipse.equinox:app:jar:1.0.0-v20070606:compile
          [DEBUG]          org.eclipse.equinox:registry:jar:3.5.400-v20140428-1507:compile
          [DEBUG]          org.eclipse.equinox:common:jar:3.6.200-v20130402-1505:compile
          [DEBUG]    gov.va.isaac.modules:content-request:jar:Sprint_18-SNAPSHOT:compile
          [DEBUG]       org.apache.poi:poi:jar:3.7:compile
          [DEBUG]       org.apache.poi:poi-ooxml:jar:3.7:compile
          [DEBUG]          org.apache.poi:poi-ooxml-schemas:jar:3.7:compile
          [DEBUG]             org.apache.xmlbeans:xmlbeans:jar:2.3.0:compile
          [DEBUG]                stax:stax-api:jar:1.0.1:compile
          [DEBUG]             org.apache.geronimo.specs:geronimo-stax-api_1.0_spec:jar:1.0:compile
          [DEBUG]          dom4j:dom4j:jar:1.6.1:compile
          [DEBUG]             xml-apis:xml-apis:jar:1.0.b2:compile
          [DEBUG]    gov.va.isaac.modules:taxonomy-view:jar:Sprint_18-SNAPSHOT:compile
          [DEBUG]       gov.va.isaac.modules:refex-view:jar:Sprint_18-SNAPSHOT:compile
          [DEBUG]          gov.va.isaac.modules:isaac-drools:jar:Sprint_18-SNAPSHOT:compile
          [DEBUG]             org.drools:drools-compiler:jar:6.0.1.Final:compile
          [DEBUG]                org.eclipse.jdt.core.compiler:ecj:jar:3.7.2:compile
          [DEBUG]                com.thoughtworks.xstream:xstream:jar:1.4.3:compile
          [DEBUG]                   xmlpull:xmlpull:jar:1.1.3.1:compile
          [DEBUG]                   xpp3:xpp3_min:jar:1.1.4c:compile
          [DEBUG]                com.google.protobuf:protobuf-java:jar:2.5.0:compile
          [DEBUG]    gov.va.isaac.modules:search-view:jar:Sprint_18-SNAPSHOT:compile
          [DEBUG]    gov.va.isaac.modules:lego-view:jar:Sprint_18-SNAPSHOT:compile
          [DEBUG]       net.sf.jtidy:jtidy:jar:r938:compile
          [DEBUG]       gov.va.isaac.modules:isaac-app-interfaces:jar:Sprint_18-SNAPSHOT:compile
          [DEBUG]          gov.va.oia:HK2Utilities:jar:1.3:compile
          [DEBUG]             eu.infomas:annotation-detector:jar:3.0.4:compile
          [DEBUG]    gov.va.isaac.modules:info-model-view:jar:Sprint_18-SNAPSHOT:compile
          [DEBUG]       org.ihtsdo.otf:query-implementation:jar:1.1-va-1.11-SNAPSHOT:compile
          [DEBUG]          org.ihtsdo.otf:query-lucene:jar:1.1-va-1.11-SNAPSHOT:compile
          [DEBUG]             org.apache.lucene:lucene-analyzers-common:jar:4.3.1:compile
          [DEBUG]             org.apache.lucene:lucene-queryparser:jar:4.3.1:compile
          [DEBUG]                org.apache.lucene:lucene-queries:jar:4.3.1:compile
          [DEBUG]                org.apache.lucene:lucene-sandbox:jar:4.3.1:compile
          [DEBUG]                   jakarta-regexp:jakarta-regexp:jar:1.4:compile
          [DEBUG]          org.ihtsdo.otf:tcc-api:jar:1.1-va-1.11-SNAPSHOT:compile
          [DEBUG]          org.ihtsdo.otf:tcc-dto-ddo:jar:1.1-va-1.11-SNAPSHOT:compile
          [DEBUG]    gov.va.isaac.modules:list-view:jar:Sprint_18-SNAPSHOT:compile
          [DEBUG]       net.sf.opencsv:opencsv:jar:2.3:compile
          [DEBUG]       org.controlsfx:controlsfx:jar:8.0.5:compile
          [DEBUG]    gov.va.isaac.modules:isaac-workflow:jar:Sprint_18-SNAPSHOT:compile
          [DEBUG]       org.kie.remote:kie-services-client:jar:6.0.1.Final:compile
          [DEBUG]          org.kie:kie-api:jar:6.0.1.Final:compile
          [DEBUG]          org.kie:kie-internal:jar:6.0.1.Final:compile
          [DEBUG]          org.drools:drools-core:jar:6.0.1.Final:compile
          [DEBUG]             org.mvel:mvel2:jar:2.1.8.Final:compile
          [DEBUG]          org.jbpm:jbpm-human-task-core:jar:6.0.1.Final:compile
          [DEBUG]             org.jbpm:jbpm-flow:jar:6.0.1.Final:compile
          [DEBUG]                joda-time:joda-time:jar:1.6.2:compile
          [DEBUG]             javax.activation:activation:jar:1.1.1:compile
          [DEBUG]             javax.annotation:jsr250-api:jar:1.0:compile
          [DEBUG]             org.drools:drools-persistence-jpa:jar:6.0.1.Final:compile
          [DEBUG]                javax.transaction:jta:jar:1.1:compile
          [DEBUG]             org.hibernate.javax.persistence:hibernate-jpa-2.0-api:jar:1.0.1.Final:compile
          [DEBUG]             javax.mail:mail:jar:1.4.5:compile
          [DEBUG]          org.jbpm:jbpm-audit:jar:6.0.1.Final:compile
          [DEBUG]          javax.jms:jms:jar:1.1:compile
          [DEBUG]          org.jboss.spec.javax.servlet:jboss-servlet-api_3.0_spec:jar:1.0.2.Final:compile
          [DEBUG]          org.jboss.resteasy:jaxrs-api:jar:2.3.6.Final:compile
          [DEBUG]          org.jboss.resteasy:resteasy-jaxrs:jar:2.3.6.Final:compile
          [DEBUG]             org.scannotation:scannotation:jar:1.0.3:compile
          [DEBUG]                javassist:javassist:jar:3.12.1.GA:compile
          [DEBUG]             commons-io:commons-io:jar:1.4:compile
          [DEBUG]             net.jcip:jcip-annotations:jar:1.0:compile
          [DEBUG]          commons-logging:commons-logging:jar:1.1.1:compile
          [DEBUG]          org.jboss.resteasy:resteasy-jaxb-provider:jar:2.3.6.Final:compile
          [DEBUG]          com.sun.xml.bind:jaxb-impl:jar:2.2.5:compile
          [DEBUG]          org.jboss.resteasy:resteasy-jackson-provider:jar:2.3.6.Final:compile
          [DEBUG]             org.codehaus.jackson:jackson-core-asl:jar:1.9.9:compile
          [DEBUG]             org.codehaus.jackson:jackson-mapper-asl:jar:1.9.9:compile
          [DEBUG]             org.codehaus.jackson:jackson-jaxrs:jar:1.9.9:compile
          [DEBUG]             org.codehaus.jackson:jackson-xc:jar:1.9.9:compile
          [DEBUG]          org.kie:kie-ci:jar:6.0.1.Final:compile
          [DEBUG]             org.apache.maven:maven-core:jar:3.0.5:compile
          [DEBUG]                org.apache.maven:maven-settings:jar:3.0.5:compile
          [DEBUG]                org.apache.maven:maven-settings-builder:jar:3.0.5:compile
          [DEBUG]                org.apache.maven:maven-repository-metadata:jar:3.0.5:compile
          [DEBUG]                org.apache.maven:maven-artifact:jar:3.0.5:compile
          [DEBUG]                org.apache.maven:maven-plugin-api:jar:3.0.5:compile
          [DEBUG]                org.apache.maven:maven-model-builder:jar:3.0.5:compile
          [DEBUG]                org.apache.maven:maven-aether-provider:jar:3.0.5:compile
          [DEBUG]                org.sonatype.sisu:sisu-inject-plexus:jar:2.3.0:compile
          [DEBUG]                   org.sonatype.sisu:sisu-inject-bean:jar:2.3.0:compile
          [DEBUG]                      org.sonatype.sisu:sisu-guice:jar:no_aop:3.1.0:compile
          [DEBUG]                         org.sonatype.sisu:sisu-guava:jar:0.9.9:compile
          [DEBUG]                org.codehaus.plexus:plexus-interpolation:jar:1.14:compile
          [DEBUG]                org.codehaus.plexus:plexus-utils:jar:2.0.6:compile
          [DEBUG]                org.codehaus.plexus:plexus-classworlds:jar:2.4:compile
          [DEBUG]                org.codehaus.plexus:plexus-component-annotations:jar:1.5.5:compile
          [DEBUG]                org.sonatype.plexus:plexus-sec-dispatcher:jar:1.3:compile
          [DEBUG]                   org.sonatype.plexus:plexus-cipher:jar:1.4:compile
          [DEBUG]             org.apache.maven:maven-model:jar:3.0.5:compile
          [DEBUG]             org.apache.maven:maven-compat:jar:3.0.5:compile
          [DEBUG]                org.apache.maven.wagon:wagon-provider-api:jar:2.4:compile
          [DEBUG]             org.sonatype.aether:aether-api:jar:1.13.1:compile
          [DEBUG]             org.sonatype.aether:aether-util:jar:1.13.1:compile
          [DEBUG]             org.sonatype.aether:aether-impl:jar:1.13.1:compile
          [DEBUG]                org.sonatype.aether:aether-spi:jar:1.13.1:compile
          [DEBUG]             org.sonatype.aether:aether-connector-wagon:jar:1.13.1:compile
          [DEBUG]             org.sonatype.aether:aether-connector-file:jar:1.13.1:compile
          [DEBUG]             org.sonatype.maven:wagon-ahc:jar:1.2.1:compile
          [DEBUG]                com.ning:async-http-client:jar:1.6.5:compile
          [DEBUG]                   org.jboss.netty:netty:jar:3.2.5.Final:compile
          [DEBUG]             org.apache.ant:ant:jar:1.8.2:compile
          [DEBUG]                org.apache.ant:ant-launcher:jar:1.8.2:compile
          [DEBUG]       org.apache.derby:derby:jar:10.10.1.1:compile
          [DEBUG]       com.mchange:c3p0:jar:0.9.5-pre8:compile
          [DEBUG]          com.mchange:mchange-commons-java:jar:0.2.7:compile
          [DEBUG]    gov.va.isaac.modules:sync-view:jar:Sprint_18-SNAPSHOT:compile
          [DEBUG]    gov.va.isaac.modules:sync-git:jar:Sprint_18-SNAPSHOT:compile
          [DEBUG]       org.eclipse.jgit:org.eclipse.jgit:jar:3.5.1.201410131835-r:compile
          [DEBUG]          com.jcraft:jsch:jar:0.1.50:compile
          [DEBUG]          com.googlecode.javaewah:JavaEWAH:jar:0.7.9:compile
          [DEBUG]          org.apache.httpcomponents:httpclient:jar:4.1.3:compile
          [DEBUG]             org.apache.httpcomponents:httpcore:jar:4.1.4:compile
          [DEBUG]             commons-codec:commons-codec:jar:1.4:compile
          [DEBUG]    gov.va.isaac.modules:sync-svn:jar:Sprint_18-SNAPSHOT:compile
          [DEBUG]       org.tmatesoft.svnkit:svnkit:jar:1.8.5:compile
          [DEBUG]          com.jcraft:jsch.agentproxy.svnkit-trilead-ssh2:jar:0.0.7:compile
          [DEBUG]             com.jcraft:jsch.agentproxy.core:jar:0.0.7:compile
          [DEBUG]          net.java.dev.jna:jna:jar:3.5.2:compile
          [DEBUG]          org.tmatesoft.sqljet:sqljet:jar:1.1.10:compile
          [DEBUG]             org.antlr:antlr-runtime:jar:3.4:compile
          [DEBUG]          net.java.dev.jna:platform:jar:3.5.2:compile
          [DEBUG]          com.jcraft:jsch.agentproxy.connector-factory:jar:0.0.7:compile
          [DEBUG]             com.jcraft:jsch.agentproxy.usocket-jna:jar:0.0.7:compile
          [DEBUG]             com.jcraft:jsch.agentproxy.usocket-nc:jar:0.0.7:compile
          [DEBUG]             com.jcraft:jsch.agentproxy.sshagent:jar:0.0.7:compile
          [DEBUG]             com.jcraft:jsch.agentproxy.pageant:jar:0.0.7:compile
          [DEBUG]          de.regnis.q.sequence:sequence-library:jar:1.0.2:compile
          [DEBUG]          com.trilead:trilead-ssh2:jar:1.0.0-build217:compile
          [DEBUG]    gov.va.isaac.modules:concept-wizard-view:jar:Sprint_18-SNAPSHOT:compile
          [DEBUG] Using mirror maestro (https://va.maestrodev.com/archiva/repository/all/) for central (https://repo.maven.apache.org/maven2).
          ....
          [DEBUG] Using mirror maestro (https://va.maestrodev.com/archiva/repository/all/) for sonatype-nexus-snapshots (https://oss.sonatype.org/content/repositories/snapshots).
          [DEBUG] Using mirror maestro (https://va.maestrodev.com/archiva/repository/all/) for sonatype-nexus-snapshots (https://oss.sonatype.org/content/repositories/snapshots).
          [DEBUG] Using mirror maestro (https://va.maestrodev.com/archiva/repository/all/) for central (https://repo.maven.apache.org/maven2).
          [ERROR] Artifact: org.apache.felix:org.osgi.core:jar:1.4.0 has no file.
          [ERROR] Artifact: org.apache.geronimo.specs:geronimo-stax-api_1.0_spec:jar:1.0 has no file.
          [ERROR] Artifact: org.apache.httpcomponents:httpclient:jar:4.1.3 has no file.
          [ERROR] Artifact: org.apache.httpcomponents:httpcore:jar:4.1.4 has no file.
          [ERROR] Artifact: org.apache.lucene:lucene-analyzers-common:jar:4.3.1 has no file.
          [ERROR] Artifact: org.apache.lucene:lucene-core:jar:4.3.1 has no file.
          [ERROR] Artifact: org.apache.lucene:lucene-queries:jar:4.3.1 has no file.
          [ERROR] Artifact: org.apache.lucene:lucene-queryparser:jar:4.3.1 has no file.
          [ERROR] Artifact: org.apache.lucene:lucene-sandbox:jar:4.3.1 has no file.
          [ERROR] Artifact: org.apache.mahout:mahout-collections:jar:1.0 has no file.
          [ERROR] Artifact: org.apache.mahout:mahout-math:jar:0.7 has no file.
          ....
          [ERROR] Artifact: stax:stax-api:jar:1.0.1 has no file.
          [ERROR] Artifact: xml-apis:xml-apis:jar:1.0.b2 has no file.
          [ERROR] Artifact: xmlpull:xmlpull:jar:1.1.3.1 has no file.
          [ERROR] Artifact: xpp3:xpp3_min:jar:1.1.4c has no file.
          [DEBUG] Using mirror maestro (https://va.maestrodev.com/archiva/repository/all/) for central (https://repo.maven.apache.org/maven2).
          [DEBUG] Using mirror maestro (https://va.maestrodev.com/archiva/repository/all/) for central (https://repo.maven.apache.org/maven2).
          [DEBUG] Using mirror maestro (https://va.maestrodev.com/archiva/repository/all/) for central (https://repo.maven.apache.org/maven2).
          [DEBUG] Using mirror maestro (https://va.maestrodev.com/archiva/repository/all/) for central (https://repo.maven.apache.org/maven2).
          [DEBUG] Using mirror maestro (https://va.maestrodev.com/archiva/repository/all/) for central (https://repo.maven.apache.org/maven2).
          [DEBUG] Using mirror maestro (https://va.maestrodev.com/archiva/repository/all/) for central (https://repo.maven.apache.org/maven2).
          Show
          armbrust Dan Armbrust added a comment - - edited Hmm, log file is huge... but I don't see anything of interest. It goes straight into the errors with no extra info - I've cut a few pieces of surrounding log: [INFO] <<< jdepend-maven-plugin:2.0:generate < compile @ app <<< [DEBUG] building maven31 dependency graph for gov.va.isaac.isaac-pa.modules:app:pom:Sprint_18-SNAPSHOT with Maven31DependencyGraphBuilder [DEBUG] Using mirror maestro (https://va.maestrodev.com/archiva/repository/all/) for central (https://repo.maven.apache.org/maven2). ... [DEBUG] Dependency collection stats: {ConflictMarker.analyzeTime=0, ConflictMarker.markTime=0, ConflictMarker.nodeCount=670, ConflictIdSorter.graphTime=1, ConflictIdSorter.topsortTime=0, ConflictIdSorter.conflictIdCount=203, ConflictIdSorter.conflictIdCycleCount=0, ConflictResolver.totalTime=4, ConflictResolver.conflictItemCount=500, DefaultDependencyCollector.collectTime=24, DefaultDependencyCollector.transformTime=5} [DEBUG] gov.va.isaac.isaac-pa.modules:app:pom:Sprint_18-SNAPSHOT [DEBUG] gov.va.isaac.isaac-pa.modules:config:jar:Sprint_18-SNAPSHOT:compile [DEBUG] gov.va.isaac.modules:isaac-app:jar:Sprint_18-SNAPSHOT:compile [DEBUG] gov.va.isaac.modules:otf-util:jar:Sprint_18-SNAPSHOT:compile [DEBUG] gov.va.isaac.modules:isaac-constants:jar:Sprint_18-SNAPSHOT:compile [DEBUG] ch.qos.logback:logback-classic:jar:1.1.2:compile [DEBUG] ch.qos.logback:logback-core:jar:1.1.2:compile [DEBUG] org.slf4j:jul-to-slf4j:jar:1.7.7:compile [DEBUG] org.slf4j:log4j-over-slf4j:jar:1.7.7:compile [DEBUG] net.lingala.zip4j:zip4j:jar:1.3.2:compile [DEBUG] org.glassfish.hk2:hk2:jar:2.3.0:compile [DEBUG] org.glassfish.hk2:hk2-utils:jar:2.3.0:compile [DEBUG] javax.inject:javax.inject:jar:1:compile [DEBUG] org.glassfish.hk2:hk2-api:jar:2.3.0:compile [DEBUG] org.glassfish.hk2.external:aopalliance-repackaged:jar:2.3.0:compile [DEBUG] org.glassfish.hk2:config-types:jar:2.3.0:compile [DEBUG] org.glassfish.hk2:core:jar:2.3.0:compile [DEBUG] org.glassfish.hk2:hk2-config:jar:2.3.0:compile [DEBUG] org.jvnet:tiger-types:jar:1.4:compile [DEBUG] org.glassfish.hk2.external:bean-validator:jar:2.3.0:compile [DEBUG] org.glassfish.hk2:hk2-locator:jar:2.3.0:compile [DEBUG] org.glassfish.hk2.external:javax.inject:jar:2.3.0:compile [DEBUG] org.javassist:javassist:jar:3.18.1-GA:compile [DEBUG] org.glassfish.hk2:hk2-runlevel:jar:2.3.0:compile [DEBUG] org.glassfish.hk2:class-model:jar:2.3.0:compile [DEBUG] org.glassfish.hk2.external:asm-all-repackaged:jar:2.3.0:compile [DEBUG] org.slf4j:slf4j-api:jar:1.7.7:compile [DEBUG] gov.va.isaac.modules:import-export:jar:Sprint_18-SNAPSHOT:compile [DEBUG] gov.va.isaac.modules:gui-util:jar:Sprint_18-SNAPSHOT:compile [DEBUG] org.apache.commons:commons-lang3:jar:3.3:compile [DEBUG] gov.va.isaac.modules:data-model:jar:Sprint_18-SNAPSHOT:compile [DEBUG] org.ihtsdo.otf:tcc-datastore:jar:1.1-va-1.11-SNAPSHOT:compile [DEBUG] com.sleepycat:je:jar:5.0.97:compile [DEBUG] org.apache.mahout:mahout-collections:jar:1.0:compile [DEBUG] org.apache.mahout:mahout-math:jar:0.7:compile [DEBUG] org.apache.commons:commons-math:jar:2.2:compile [DEBUG] org.uncommons.maths:uncommons-maths:jar:1.2.2:compile [DEBUG] jfree:jcommon:jar:1.0.12:compile [DEBUG] com.google.guava:guava:jar:r09:compile [DEBUG] commons-lang:commons-lang:jar:2.6:compile [DEBUG] org.ihtsdo.otf:tcc-model-impl:jar:1.1-va-1.11-SNAPSHOT:compile [DEBUG] org.ihtsdo.otf:tcc-lookup:jar:1.1-va-1.11-SNAPSHOT:compile [DEBUG] org.netbeans.api:org-openide-util-lookup:jar:RELEASE73:compile [DEBUG] org.apache.lucene:lucene-core:jar:4.3.1:compile [DEBUG] org.eclipse.uml2.uml:resources:jar:4.1.0-v20130902-0826:compile [DEBUG] org.eclipse.uml2:uml:jar:4.1.2-v20140202-2055:compile [DEBUG] org.eclipse.uml2:common:jar:1.8.2-v20140202-2055:compile [DEBUG] org.eclipse.uml2:types:jar:1.1.0-v20140202-2055:compile [DEBUG] org.eclipse.uml2.uml.profile:l2:jar:1.1.0-v20140202-2055:compile [DEBUG] org.eclipse.uml2.uml.profile:l3:jar:1.1.0-v20140202-2055:compile [DEBUG] org.eclipse.core:runtime:jar:3.10.0-v20140318-2214:compile [DEBUG] org.eclipse:osgi:jar:3.10.0-v20140606-1445:compile [DEBUG] org.eclipse.core:jobs:jar:3.6.0-v20140424-0053:compile [DEBUG] org.eclipse.equinox:preferences:jar:3.5.200-v20140224-1527:compile [DEBUG] org.eclipse.core:contenttype:jar:3.4.200-v20140207-1251:compile [DEBUG] org.eclipse.emf.mapping:ecore2xml:jar:2.7.0-v20120917-0436:compile [DEBUG] org.eclipse.emf:org.eclipse.emf.ecore:jar:2.9.1-v20130827-0309:compile [DEBUG] org.eclipse.emf:org.eclipse.emf.ecore.xmi:jar:2.9.1-v20130827-0309:compile [DEBUG] org.eclipse.emf:org.eclipse.emf.common:jar:2.9.1-v20130827-0309:compile [DEBUG] net.sourceforge.owlapi:owlapi-distribution:jar:3.5.0:compile [DEBUG] net.sourceforge.owlapi:owlapi-apibinding:jar:3.5.0:compile [DEBUG] org.apache.felix:org.osgi.core:jar:1.4.0:compile [DEBUG] net.sourceforge.owlapi:owlapi-api:jar:3.5.0:compile [DEBUG] net.sourceforge.owlapi:owlapi-tools:jar:3.5.0:compile [DEBUG] net.sourceforge.owlapi:owlapi-impl:jar:3.5.0:compile [DEBUG] net.sourceforge.owlapi:owlapi-parsers:jar:3.5.0:compile [DEBUG] net.sourceforge.owlapi:owlapi-oboformat:jar:3.5.0:compile [DEBUG] net.sourceforge.owlapi:owlapi-contract:jar:3.5.0:compile [DEBUG] org.eclipse.equinox:app:jar:1.0.0-v20070606:compile [DEBUG] org.eclipse.equinox:registry:jar:3.5.400-v20140428-1507:compile [DEBUG] org.eclipse.equinox:common:jar:3.6.200-v20130402-1505:compile [DEBUG] gov.va.isaac.modules:content-request:jar:Sprint_18-SNAPSHOT:compile [DEBUG] org.apache.poi:poi:jar:3.7:compile [DEBUG] org.apache.poi:poi-ooxml:jar:3.7:compile [DEBUG] org.apache.poi:poi-ooxml-schemas:jar:3.7:compile [DEBUG] org.apache.xmlbeans:xmlbeans:jar:2.3.0:compile [DEBUG] stax:stax-api:jar:1.0.1:compile [DEBUG] org.apache.geronimo.specs:geronimo-stax-api_1.0_spec:jar:1.0:compile [DEBUG] dom4j:dom4j:jar:1.6.1:compile [DEBUG] xml-apis:xml-apis:jar:1.0.b2:compile [DEBUG] gov.va.isaac.modules:taxonomy-view:jar:Sprint_18-SNAPSHOT:compile [DEBUG] gov.va.isaac.modules:refex-view:jar:Sprint_18-SNAPSHOT:compile [DEBUG] gov.va.isaac.modules:isaac-drools:jar:Sprint_18-SNAPSHOT:compile [DEBUG] org.drools:drools-compiler:jar:6.0.1.Final:compile [DEBUG] org.eclipse.jdt.core.compiler:ecj:jar:3.7.2:compile [DEBUG] com.thoughtworks.xstream:xstream:jar:1.4.3:compile [DEBUG] xmlpull:xmlpull:jar:1.1.3.1:compile [DEBUG] xpp3:xpp3_min:jar:1.1.4c:compile [DEBUG] com.google.protobuf:protobuf-java:jar:2.5.0:compile [DEBUG] gov.va.isaac.modules:search-view:jar:Sprint_18-SNAPSHOT:compile [DEBUG] gov.va.isaac.modules:lego-view:jar:Sprint_18-SNAPSHOT:compile [DEBUG] net.sf.jtidy:jtidy:jar:r938:compile [DEBUG] gov.va.isaac.modules:isaac-app-interfaces:jar:Sprint_18-SNAPSHOT:compile [DEBUG] gov.va.oia:HK2Utilities:jar:1.3:compile [DEBUG] eu.infomas:annotation-detector:jar:3.0.4:compile [DEBUG] gov.va.isaac.modules:info-model-view:jar:Sprint_18-SNAPSHOT:compile [DEBUG] org.ihtsdo.otf:query-implementation:jar:1.1-va-1.11-SNAPSHOT:compile [DEBUG] org.ihtsdo.otf:query-lucene:jar:1.1-va-1.11-SNAPSHOT:compile [DEBUG] org.apache.lucene:lucene-analyzers-common:jar:4.3.1:compile [DEBUG] org.apache.lucene:lucene-queryparser:jar:4.3.1:compile [DEBUG] org.apache.lucene:lucene-queries:jar:4.3.1:compile [DEBUG] org.apache.lucene:lucene-sandbox:jar:4.3.1:compile [DEBUG] jakarta-regexp:jakarta-regexp:jar:1.4:compile [DEBUG] org.ihtsdo.otf:tcc-api:jar:1.1-va-1.11-SNAPSHOT:compile [DEBUG] org.ihtsdo.otf:tcc-dto-ddo:jar:1.1-va-1.11-SNAPSHOT:compile [DEBUG] gov.va.isaac.modules:list-view:jar:Sprint_18-SNAPSHOT:compile [DEBUG] net.sf.opencsv:opencsv:jar:2.3:compile [DEBUG] org.controlsfx:controlsfx:jar:8.0.5:compile [DEBUG] gov.va.isaac.modules:isaac-workflow:jar:Sprint_18-SNAPSHOT:compile [DEBUG] org.kie.remote:kie-services-client:jar:6.0.1.Final:compile [DEBUG] org.kie:kie-api:jar:6.0.1.Final:compile [DEBUG] org.kie:kie-internal:jar:6.0.1.Final:compile [DEBUG] org.drools:drools-core:jar:6.0.1.Final:compile [DEBUG] org.mvel:mvel2:jar:2.1.8.Final:compile [DEBUG] org.jbpm:jbpm-human-task-core:jar:6.0.1.Final:compile [DEBUG] org.jbpm:jbpm-flow:jar:6.0.1.Final:compile [DEBUG] joda-time:joda-time:jar:1.6.2:compile [DEBUG] javax.activation:activation:jar:1.1.1:compile [DEBUG] javax.annotation:jsr250-api:jar:1.0:compile [DEBUG] org.drools:drools-persistence-jpa:jar:6.0.1.Final:compile [DEBUG] javax.transaction:jta:jar:1.1:compile [DEBUG] org.hibernate.javax.persistence:hibernate-jpa-2.0-api:jar:1.0.1.Final:compile [DEBUG] javax.mail:mail:jar:1.4.5:compile [DEBUG] org.jbpm:jbpm-audit:jar:6.0.1.Final:compile [DEBUG] javax.jms:jms:jar:1.1:compile [DEBUG] org.jboss.spec.javax.servlet:jboss-servlet-api_3.0_spec:jar:1.0.2.Final:compile [DEBUG] org.jboss.resteasy:jaxrs-api:jar:2.3.6.Final:compile [DEBUG] org.jboss.resteasy:resteasy-jaxrs:jar:2.3.6.Final:compile [DEBUG] org.scannotation:scannotation:jar:1.0.3:compile [DEBUG] javassist:javassist:jar:3.12.1.GA:compile [DEBUG] commons-io:commons-io:jar:1.4:compile [DEBUG] net.jcip:jcip-annotations:jar:1.0:compile [DEBUG] commons-logging:commons-logging:jar:1.1.1:compile [DEBUG] org.jboss.resteasy:resteasy-jaxb-provider:jar:2.3.6.Final:compile [DEBUG] com.sun.xml.bind:jaxb-impl:jar:2.2.5:compile [DEBUG] org.jboss.resteasy:resteasy-jackson-provider:jar:2.3.6.Final:compile [DEBUG] org.codehaus.jackson:jackson-core-asl:jar:1.9.9:compile [DEBUG] org.codehaus.jackson:jackson-mapper-asl:jar:1.9.9:compile [DEBUG] org.codehaus.jackson:jackson-jaxrs:jar:1.9.9:compile [DEBUG] org.codehaus.jackson:jackson-xc:jar:1.9.9:compile [DEBUG] org.kie:kie-ci:jar:6.0.1.Final:compile [DEBUG] org.apache.maven:maven-core:jar:3.0.5:compile [DEBUG] org.apache.maven:maven-settings:jar:3.0.5:compile [DEBUG] org.apache.maven:maven-settings-builder:jar:3.0.5:compile [DEBUG] org.apache.maven:maven-repository-metadata:jar:3.0.5:compile [DEBUG] org.apache.maven:maven-artifact:jar:3.0.5:compile [DEBUG] org.apache.maven:maven-plugin-api:jar:3.0.5:compile [DEBUG] org.apache.maven:maven-model-builder:jar:3.0.5:compile [DEBUG] org.apache.maven:maven-aether-provider:jar:3.0.5:compile [DEBUG] org.sonatype.sisu:sisu-inject-plexus:jar:2.3.0:compile [DEBUG] org.sonatype.sisu:sisu-inject-bean:jar:2.3.0:compile [DEBUG] org.sonatype.sisu:sisu-guice:jar:no_aop:3.1.0:compile [DEBUG] org.sonatype.sisu:sisu-guava:jar:0.9.9:compile [DEBUG] org.codehaus.plexus:plexus-interpolation:jar:1.14:compile [DEBUG] org.codehaus.plexus:plexus-utils:jar:2.0.6:compile [DEBUG] org.codehaus.plexus:plexus-classworlds:jar:2.4:compile [DEBUG] org.codehaus.plexus:plexus-component-annotations:jar:1.5.5:compile [DEBUG] org.sonatype.plexus:plexus-sec-dispatcher:jar:1.3:compile [DEBUG] org.sonatype.plexus:plexus-cipher:jar:1.4:compile [DEBUG] org.apache.maven:maven-model:jar:3.0.5:compile [DEBUG] org.apache.maven:maven-compat:jar:3.0.5:compile [DEBUG] org.apache.maven.wagon:wagon-provider-api:jar:2.4:compile [DEBUG] org.sonatype.aether:aether-api:jar:1.13.1:compile [DEBUG] org.sonatype.aether:aether-util:jar:1.13.1:compile [DEBUG] org.sonatype.aether:aether-impl:jar:1.13.1:compile [DEBUG] org.sonatype.aether:aether-spi:jar:1.13.1:compile [DEBUG] org.sonatype.aether:aether-connector-wagon:jar:1.13.1:compile [DEBUG] org.sonatype.aether:aether-connector-file:jar:1.13.1:compile [DEBUG] org.sonatype.maven:wagon-ahc:jar:1.2.1:compile [DEBUG] com.ning:async-http-client:jar:1.6.5:compile [DEBUG] org.jboss.netty:netty:jar:3.2.5.Final:compile [DEBUG] org.apache.ant:ant:jar:1.8.2:compile [DEBUG] org.apache.ant:ant-launcher:jar:1.8.2:compile [DEBUG] org.apache.derby:derby:jar:10.10.1.1:compile [DEBUG] com.mchange:c3p0:jar:0.9.5-pre8:compile [DEBUG] com.mchange:mchange-commons-java:jar:0.2.7:compile [DEBUG] gov.va.isaac.modules:sync-view:jar:Sprint_18-SNAPSHOT:compile [DEBUG] gov.va.isaac.modules:sync-git:jar:Sprint_18-SNAPSHOT:compile [DEBUG] org.eclipse.jgit:org.eclipse.jgit:jar:3.5.1.201410131835-r:compile [DEBUG] com.jcraft:jsch:jar:0.1.50:compile [DEBUG] com.googlecode.javaewah:JavaEWAH:jar:0.7.9:compile [DEBUG] org.apache.httpcomponents:httpclient:jar:4.1.3:compile [DEBUG] org.apache.httpcomponents:httpcore:jar:4.1.4:compile [DEBUG] commons-codec:commons-codec:jar:1.4:compile [DEBUG] gov.va.isaac.modules:sync-svn:jar:Sprint_18-SNAPSHOT:compile [DEBUG] org.tmatesoft.svnkit:svnkit:jar:1.8.5:compile [DEBUG] com.jcraft:jsch.agentproxy.svnkit-trilead-ssh2:jar:0.0.7:compile [DEBUG] com.jcraft:jsch.agentproxy.core:jar:0.0.7:compile [DEBUG] net.java.dev.jna:jna:jar:3.5.2:compile [DEBUG] org.tmatesoft.sqljet:sqljet:jar:1.1.10:compile [DEBUG] org.antlr:antlr-runtime:jar:3.4:compile [DEBUG] net.java.dev.jna:platform:jar:3.5.2:compile [DEBUG] com.jcraft:jsch.agentproxy.connector-factory:jar:0.0.7:compile [DEBUG] com.jcraft:jsch.agentproxy.usocket-jna:jar:0.0.7:compile [DEBUG] com.jcraft:jsch.agentproxy.usocket-nc:jar:0.0.7:compile [DEBUG] com.jcraft:jsch.agentproxy.sshagent:jar:0.0.7:compile [DEBUG] com.jcraft:jsch.agentproxy.pageant:jar:0.0.7:compile [DEBUG] de.regnis.q.sequence:sequence-library:jar:1.0.2:compile [DEBUG] com.trilead:trilead-ssh2:jar:1.0.0-build217:compile [DEBUG] gov.va.isaac.modules:concept-wizard-view:jar:Sprint_18-SNAPSHOT:compile [DEBUG] Using mirror maestro (https://va.maestrodev.com/archiva/repository/all/) for central (https://repo.maven.apache.org/maven2). .... [DEBUG] Using mirror maestro (https://va.maestrodev.com/archiva/repository/all/) for sonatype-nexus-snapshots (https://oss.sonatype.org/content/repositories/snapshots). [DEBUG] Using mirror maestro (https://va.maestrodev.com/archiva/repository/all/) for sonatype-nexus-snapshots (https://oss.sonatype.org/content/repositories/snapshots). [DEBUG] Using mirror maestro (https://va.maestrodev.com/archiva/repository/all/) for central (https://repo.maven.apache.org/maven2). [ERROR] Artifact: org.apache.felix:org.osgi.core:jar:1.4.0 has no file. [ERROR] Artifact: org.apache.geronimo.specs:geronimo-stax-api_1.0_spec:jar:1.0 has no file. [ERROR] Artifact: org.apache.httpcomponents:httpclient:jar:4.1.3 has no file. [ERROR] Artifact: org.apache.httpcomponents:httpcore:jar:4.1.4 has no file. [ERROR] Artifact: org.apache.lucene:lucene-analyzers-common:jar:4.3.1 has no file. [ERROR] Artifact: org.apache.lucene:lucene-core:jar:4.3.1 has no file. [ERROR] Artifact: org.apache.lucene:lucene-queries:jar:4.3.1 has no file. [ERROR] Artifact: org.apache.lucene:lucene-queryparser:jar:4.3.1 has no file. [ERROR] Artifact: org.apache.lucene:lucene-sandbox:jar:4.3.1 has no file. [ERROR] Artifact: org.apache.mahout:mahout-collections:jar:1.0 has no file. [ERROR] Artifact: org.apache.mahout:mahout-math:jar:0.7 has no file. .... [ERROR] Artifact: stax:stax-api:jar:1.0.1 has no file. [ERROR] Artifact: xml-apis:xml-apis:jar:1.0.b2 has no file. [ERROR] Artifact: xmlpull:xmlpull:jar:1.1.3.1 has no file. [ERROR] Artifact: xpp3:xpp3_min:jar:1.1.4c has no file. [DEBUG] Using mirror maestro (https://va.maestrodev.com/archiva/repository/all/) for central (https://repo.maven.apache.org/maven2). [DEBUG] Using mirror maestro (https://va.maestrodev.com/archiva/repository/all/) for central (https://repo.maven.apache.org/maven2). [DEBUG] Using mirror maestro (https://va.maestrodev.com/archiva/repository/all/) for central (https://repo.maven.apache.org/maven2). [DEBUG] Using mirror maestro (https://va.maestrodev.com/archiva/repository/all/) for central (https://repo.maven.apache.org/maven2). [DEBUG] Using mirror maestro (https://va.maestrodev.com/archiva/repository/all/) for central (https://repo.maven.apache.org/maven2). [DEBUG] Using mirror maestro (https://va.maestrodev.com/archiva/repository/all/) for central (https://repo.maven.apache.org/maven2).
          Hide
          kravin Aleksey Nesterenko added a comment - - edited

          I have the same problem.

          Example: https://travis-ci.org/checkstyle/checkstyle/jobs/50069087#L3586
          (if link won't redirect to corresponding line immediately - scroll page to the end and then refresh or just look at line #3586)

          Steps to reproduce:

          1) git clone git@github.com:checkstyle/checkstyle.git && cd checkstyle/ && git checkout checkstyle-6.3
          2) mvn clean verify -Dlinkcheck.skip=true -Dmaven.javadoc.skip=true -Dpmd.skip=true -Dfindbugs.skip=true

          Show
          kravin Aleksey Nesterenko added a comment - - edited I have the same problem. Example: https://travis-ci.org/checkstyle/checkstyle/jobs/50069087#L3586 (if link won't redirect to corresponding line immediately - scroll page to the end and then refresh or just look at line #3586) Steps to reproduce: 1) git clone git@github.com:checkstyle/checkstyle.git && cd checkstyle/ && git checkout checkstyle-6.3 2) mvn clean verify -Dlinkcheck.skip=true -Dmaven.javadoc.skip=true -Dpmd.skip=true -Dfindbugs.skip=true
          Hide
          nachteil Jędrzej Dąbrowa added a comment - - edited

          Just got the same error:

          [INFO] Generating "Dependencies" report         --- maven-project-info-reports-plugin:2.7:dependencies
          [ERROR] Artifact: com.rsa:kmsclient:jar:2.1.3.2 has no file.
          [ERROR] Artifact: // bunch of artifacts from our company's Nexus repository
          [ERROR] Artifact: com.tibco:tibjms:jar:4.4.3 has no file.
          [ERROR] Artifact: commons-codec:commons-codec:jar:1.6 has no file.
          [ERROR] Artifact: commons-io:commons-io:jar:2.4 has no file.
          [ERROR] Artifact: commons-logging:commons-logging:jar:1.1 has no file.
          [ERROR] Artifact: concurrent:concurrent:jar:1.3.2 has no file.
          [ERROR] Artifact: dom4j:dom4j:jar:1.6.1 has no file.
          [ERROR] Artifact: javax.jms:jms:jar:1.1 has no file.
          [ERROR] Artifact: javax.resource:connector:jar:1.0 has no file.
          [ERROR] Artifact: javax.transaction:jta:jar:1.1 has no file.
          [ERROR] Artifact: junit:junit:jar:4.12 has no file.
          [ERROR] Artifact: log4j:log4j:jar:1.2.17 has no file.
          [ERROR] Artifact: logkit:logkit:jar:1.2 has no file.
          [ERROR] Artifact: org.antlr:antlr-runtime:jar:3.3 has no file.
          [ERROR] Artifact: org.antlr:stringtemplate:jar:4.0 has no file.
          [ERROR] Artifact: org.apache.commons:commons-lang3:jar:3.3.2 has no file.
          [ERROR] Artifact: org.apache.jcs:jcs:jar:1.3 has no file.
          [ERROR] Artifact: org.hamcrest:hamcrest-core:jar:1.3 has no file.
          [ERROR] Artifact: org.jacorb:jacorb:jar:P6:2.3.0 has no file.
          [ERROR] Artifact: org.javassist:javassist:jar:3.19.0-GA has no file.
          [ERROR] Artifact: org.mockito:mockito-all:jar:1.10.19 has no file.
          [ERROR] Artifact: org.objenesis:objenesis:jar:2.1 has no file.
          [ERROR] Artifact: org.osgi:osgi_R4_core:jar:1.0 has no file.
          [ERROR] Artifact: org.powermock:powermock-api-mockito:jar:1.6.2 has no file.
          [ERROR] Artifact: org.powermock:powermock-api-support:jar:1.6.2 has no file.
          [ERROR] Artifact: org.powermock:powermock-core:jar:1.6.2 has no file.
          [ERROR] Artifact: org.powermock:powermock-module-junit4:jar:1.6.2 has no file.
          [ERROR] Artifact: org.powermock:powermock-module-junit4-common:jar:1.6.2 has no file.
          [ERROR] Artifact: org.powermock:powermock-reflect:jar:1.6.2 has no file.
          [ERROR] Artifact: org.projectlombok:lombok:jar:1.16.2 has no file.
          [ERROR] Artifact: xerces:xercesImpl:jar:2.11.0 has no file.
          [ERROR] Artifact: xml-apis:xml-apis:jar:1.4.01 has no file.

          We use dedicated build machine for release activities. Yesterday I got above errors when I chcked out new version from SVN and executed "mvn clean package deploy site". I tried adding -U to the command, with no effect. When I executed with -X switch, I got:

          [DEBUG] Using mirror mirrorId (http://maven.company.com/content/repositories/central) for central (https://repo.maven.apache.org/maven2). // repeated couple times
          [INFO] ------------------------------------------------------------------------
          [INFO] BUILD FAILURE
          [INFO] ------------------------------------------------------------------------
          [INFO] Total time: 01:40 min
          [INFO] Finished at: 2015-07-06T04:49:29-05:00
          [INFO] Final Memory: 72M/675M
          [INFO] ------------------------------------------------------------------------
          [ERROR] Failed to execute goal org.apache.maven.plugins:maven-site-plugin:3.4:site (default-site) on project <<project>>: Execution default-site of goal org.apache.maven.plugins:maven-site-plugin:3.4:site failed. NullPointerException -> [Help 1]
          org.apache.maven.lifecycle.LifecycleExecutionException: Failed to execute goal org.apache.maven.plugins:maven-site-plugin:3.4:site (default-site) on project <<project>>: Execution default-site of goal org.apache.maven.plugins:maven-site-plugin:3.4:site failed.
                  at org.apache.maven.lifecycle.internal.MojoExecutor.execute(MojoExecutor.java:224)
                  at org.apache.maven.lifecycle.internal.MojoExecutor.execute(MojoExecutor.java:153)
                  at org.apache.maven.lifecycle.internal.MojoExecutor.execute(MojoExecutor.java:145)
                  at org.apache.maven.lifecycle.internal.LifecycleModuleBuilder.buildProject(LifecycleModuleBuilder.java:116)
                  at org.apache.maven.lifecycle.internal.LifecycleModuleBuilder.buildProject(LifecycleModuleBuilder.java:80)
                  at org.apache.maven.lifecycle.internal.builder.singlethreaded.SingleThreadedBuilder.build(SingleThreadedBuilder.java:51)
                  at org.apache.maven.lifecycle.internal.LifecycleStarter.execute(LifecycleStarter.java:120)
                  at org.apache.maven.DefaultMaven.doExecute(DefaultMaven.java:347)
                  at org.apache.maven.DefaultMaven.execute(DefaultMaven.java:154)
                  at org.apache.maven.cli.MavenCli.execute(MavenCli.java:582)
                  at org.apache.maven.cli.MavenCli.doMain(MavenCli.java:214)
                  at org.apache.maven.cli.MavenCli.main(MavenCli.java:158)
                  at sun.reflect.NativeMethodAccessorImpl.invoke0(Native Method)
                  at sun.reflect.NativeMethodAccessorImpl.invoke(NativeMethodAccessorImpl.java:62)
                  at sun.reflect.DelegatingMethodAccessorImpl.invoke(DelegatingMethodAccessorImpl.java:43)
                  at java.lang.reflect.Method.invoke(Method.java:497)
                  at org.codehaus.plexus.classworlds.launcher.Launcher.launchEnhanced(Launcher.java:289)
                  at org.codehaus.plexus.classworlds.launcher.Launcher.launch(Launcher.java:229)
                  at org.codehaus.plexus.classworlds.launcher.Launcher.mainWithExitCode(Launcher.java:415)
                  at org.codehaus.plexus.classworlds.launcher.Launcher.main(Launcher.java:356)
          Caused by: org.apache.maven.plugin.PluginExecutionException: Execution default-site of goal org.apache.maven.plugins:maven-site-plugin:3.4:site failed.
                  at org.apache.maven.plugin.DefaultBuildPluginManager.executeMojo(DefaultBuildPluginManager.java:143)
                  at org.apache.maven.lifecycle.internal.MojoExecutor.execute(MojoExecutor.java:208)
                  ... 19 more
          Caused by: java.lang.NullPointerException
                  at com.sun.security.ntlm.Client.type3(Client.java:161)
                  at sun.net.www.protocol.http.ntlm.NTLMAuthentication.buildType3Msg(NTLMAuthentication.java:241)
                  at sun.net.www.protocol.http.ntlm.NTLMAuthentication.setHeaders(NTLMAuthentication.java:216)
                  at sun.net.www.protocol.http.HttpURLConnection.getInputStream0(HttpURLConnection.java:1606)
                  at sun.net.www.protocol.http.HttpURLConnection.getInputStream(HttpURLConnection.java:1440)
                  at org.apache.maven.report.projectinfo.ProjectInfoReportUtils.getContent(ProjectInfoReportUtils.java:189)
                  at org.apache.maven.report.projectinfo.ProjectInfoReportUtils.getContent(ProjectInfoReportUtils.java:105)
                  at org.apache.maven.report.projectinfo.ProjectInfoReportUtils.getContent(ProjectInfoReportUtils.java:90)
                  at org.apache.maven.report.projectinfo.dependencies.renderer.DependenciesRenderer.blacklistRepositoryMap(DependenciesRenderer.java:701)
                  at org.apache.maven.report.projectinfo.dependencies.renderer.DependenciesRenderer.renderSectionDependencyRepositoryLocations(DependenciesRenderer.java:748)
                  at org.apache.maven.report.projectinfo.dependencies.renderer.DependenciesRenderer.renderBody(DependenciesRenderer.java:269)
                  at org.apache.maven.reporting.AbstractMavenReportRenderer.render(AbstractMavenReportRenderer.java:79)
                  at org.apache.maven.report.projectinfo.DependenciesReport.executeReport(DependenciesReport.java:186)
                  at org.apache.maven.reporting.AbstractMavenReport.generate(AbstractMavenReport.java:190)
                  at org.apache.maven.plugins.site.render.ReportDocumentRenderer.renderDocument(ReportDocumentRenderer.java:224)
                  at org.apache.maven.doxia.siterenderer.DefaultSiteRenderer.renderModule(DefaultSiteRenderer.java:311)
                  at org.apache.maven.doxia.siterenderer.DefaultSiteRenderer.render(DefaultSiteRenderer.java:129)
                  at org.apache.maven.plugins.site.render.SiteMojo.renderLocale(SiteMojo.java:182)
                  at org.apache.maven.plugins.site.render.SiteMojo.execute(SiteMojo.java:141)
                  at org.apache.maven.plugin.DefaultBuildPluginManager.executeMojo(DefaultBuildPluginManager.java:132)
                  ... 20 more

          I moved to the directory which contained sources of preceding release, which was deployed without any issues using standard command ({{mvn clean package deploy site}). This build failed as well (and sources, POM including, were frozen since previous successful build).
          I've been executing failing builds with JDK 1.8.0_u45. I tried with 1.8.0_u40, but it also failed. After switching to 1.7.0_u45 the build passed. This machine runs on 64 bit RedHat linux.
          The same build passes on my local machine on Win7, JDK 1.8.0_u11.

          Show
          nachteil Jędrzej Dąbrowa added a comment - - edited Just got the same error: [INFO] Generating "Dependencies" report --- maven-project-info-reports-plugin:2.7:dependencies [ERROR] Artifact: com.rsa:kmsclient:jar:2.1.3.2 has no file. [ERROR] Artifact: // bunch of artifacts from our company's Nexus repository [ERROR] Artifact: com.tibco:tibjms:jar:4.4.3 has no file. [ERROR] Artifact: commons-codec:commons-codec:jar:1.6 has no file. [ERROR] Artifact: commons-io:commons-io:jar:2.4 has no file. [ERROR] Artifact: commons-logging:commons-logging:jar:1.1 has no file. [ERROR] Artifact: concurrent:concurrent:jar:1.3.2 has no file. [ERROR] Artifact: dom4j:dom4j:jar:1.6.1 has no file. [ERROR] Artifact: javax.jms:jms:jar:1.1 has no file. [ERROR] Artifact: javax.resource:connector:jar:1.0 has no file. [ERROR] Artifact: javax.transaction:jta:jar:1.1 has no file. [ERROR] Artifact: junit:junit:jar:4.12 has no file. [ERROR] Artifact: log4j:log4j:jar:1.2.17 has no file. [ERROR] Artifact: logkit:logkit:jar:1.2 has no file. [ERROR] Artifact: org.antlr:antlr-runtime:jar:3.3 has no file. [ERROR] Artifact: org.antlr:stringtemplate:jar:4.0 has no file. [ERROR] Artifact: org.apache.commons:commons-lang3:jar:3.3.2 has no file. [ERROR] Artifact: org.apache.jcs:jcs:jar:1.3 has no file. [ERROR] Artifact: org.hamcrest:hamcrest-core:jar:1.3 has no file. [ERROR] Artifact: org.jacorb:jacorb:jar:P6:2.3.0 has no file. [ERROR] Artifact: org.javassist:javassist:jar:3.19.0-GA has no file. [ERROR] Artifact: org.mockito:mockito-all:jar:1.10.19 has no file. [ERROR] Artifact: org.objenesis:objenesis:jar:2.1 has no file. [ERROR] Artifact: org.osgi:osgi_R4_core:jar:1.0 has no file. [ERROR] Artifact: org.powermock:powermock-api-mockito:jar:1.6.2 has no file. [ERROR] Artifact: org.powermock:powermock-api-support:jar:1.6.2 has no file. [ERROR] Artifact: org.powermock:powermock-core:jar:1.6.2 has no file. [ERROR] Artifact: org.powermock:powermock-module-junit4:jar:1.6.2 has no file. [ERROR] Artifact: org.powermock:powermock-module-junit4-common:jar:1.6.2 has no file. [ERROR] Artifact: org.powermock:powermock-reflect:jar:1.6.2 has no file. [ERROR] Artifact: org.projectlombok:lombok:jar:1.16.2 has no file. [ERROR] Artifact: xerces:xercesImpl:jar:2.11.0 has no file. [ERROR] Artifact: xml-apis:xml-apis:jar:1.4.01 has no file. We use dedicated build machine for release activities. Yesterday I got above errors when I chcked out new version from SVN and executed " mvn clean package deploy site ". I tried adding -U to the command, with no effect. When I executed with -X switch, I got: [DEBUG] Using mirror mirrorId (http://maven.company.com/content/repositories/central) for central (https://repo.maven.apache.org/maven2). // repeated couple times [INFO] ------------------------------------------------------------------------ [INFO] BUILD FAILURE [INFO] ------------------------------------------------------------------------ [INFO] Total time: 01:40 min [INFO] Finished at: 2015-07-06T04:49:29-05:00 [INFO] Final Memory: 72M/675M [INFO] ------------------------------------------------------------------------ [ERROR] Failed to execute goal org.apache.maven.plugins:maven-site-plugin:3.4:site (default-site) on project <<project>>: Execution default-site of goal org.apache.maven.plugins:maven-site-plugin:3.4:site failed. NullPointerException -> [Help 1] org.apache.maven.lifecycle.LifecycleExecutionException: Failed to execute goal org.apache.maven.plugins:maven-site-plugin:3.4:site (default-site) on project <<project>>: Execution default-site of goal org.apache.maven.plugins:maven-site-plugin:3.4:site failed. at org.apache.maven.lifecycle.internal.MojoExecutor.execute(MojoExecutor.java:224) at org.apache.maven.lifecycle.internal.MojoExecutor.execute(MojoExecutor.java:153) at org.apache.maven.lifecycle.internal.MojoExecutor.execute(MojoExecutor.java:145) at org.apache.maven.lifecycle.internal.LifecycleModuleBuilder.buildProject(LifecycleModuleBuilder.java:116) at org.apache.maven.lifecycle.internal.LifecycleModuleBuilder.buildProject(LifecycleModuleBuilder.java:80) at org.apache.maven.lifecycle.internal.builder.singlethreaded.SingleThreadedBuilder.build(SingleThreadedBuilder.java:51) at org.apache.maven.lifecycle.internal.LifecycleStarter.execute(LifecycleStarter.java:120) at org.apache.maven.DefaultMaven.doExecute(DefaultMaven.java:347) at org.apache.maven.DefaultMaven.execute(DefaultMaven.java:154) at org.apache.maven.cli.MavenCli.execute(MavenCli.java:582) at org.apache.maven.cli.MavenCli.doMain(MavenCli.java:214) at org.apache.maven.cli.MavenCli.main(MavenCli.java:158) at sun.reflect.NativeMethodAccessorImpl.invoke0(Native Method) at sun.reflect.NativeMethodAccessorImpl.invoke(NativeMethodAccessorImpl.java:62) at sun.reflect.DelegatingMethodAccessorImpl.invoke(DelegatingMethodAccessorImpl.java:43) at java.lang.reflect.Method.invoke(Method.java:497) at org.codehaus.plexus.classworlds.launcher.Launcher.launchEnhanced(Launcher.java:289) at org.codehaus.plexus.classworlds.launcher.Launcher.launch(Launcher.java:229) at org.codehaus.plexus.classworlds.launcher.Launcher.mainWithExitCode(Launcher.java:415) at org.codehaus.plexus.classworlds.launcher.Launcher.main(Launcher.java:356) Caused by: org.apache.maven.plugin.PluginExecutionException: Execution default-site of goal org.apache.maven.plugins:maven-site-plugin:3.4:site failed. at org.apache.maven.plugin.DefaultBuildPluginManager.executeMojo(DefaultBuildPluginManager.java:143) at org.apache.maven.lifecycle.internal.MojoExecutor.execute(MojoExecutor.java:208) ... 19 more Caused by: java.lang.NullPointerException at com.sun.security.ntlm.Client.type3(Client.java:161) at sun.net.www.protocol.http.ntlm.NTLMAuthentication.buildType3Msg(NTLMAuthentication.java:241) at sun.net.www.protocol.http.ntlm.NTLMAuthentication.setHeaders(NTLMAuthentication.java:216) at sun.net.www.protocol.http.HttpURLConnection.getInputStream0(HttpURLConnection.java:1606) at sun.net.www.protocol.http.HttpURLConnection.getInputStream(HttpURLConnection.java:1440) at org.apache.maven.report.projectinfo.ProjectInfoReportUtils.getContent(ProjectInfoReportUtils.java:189) at org.apache.maven.report.projectinfo.ProjectInfoReportUtils.getContent(ProjectInfoReportUtils.java:105) at org.apache.maven.report.projectinfo.ProjectInfoReportUtils.getContent(ProjectInfoReportUtils.java:90) at org.apache.maven.report.projectinfo.dependencies.renderer.DependenciesRenderer.blacklistRepositoryMap(DependenciesRenderer.java:701) at org.apache.maven.report.projectinfo.dependencies.renderer.DependenciesRenderer.renderSectionDependencyRepositoryLocations(DependenciesRenderer.java:748) at org.apache.maven.report.projectinfo.dependencies.renderer.DependenciesRenderer.renderBody(DependenciesRenderer.java:269) at org.apache.maven.reporting.AbstractMavenReportRenderer.render(AbstractMavenReportRenderer.java:79) at org.apache.maven.report.projectinfo.DependenciesReport.executeReport(DependenciesReport.java:186) at org.apache.maven.reporting.AbstractMavenReport.generate(AbstractMavenReport.java:190) at org.apache.maven.plugins.site.render.ReportDocumentRenderer.renderDocument(ReportDocumentRenderer.java:224) at org.apache.maven.doxia.siterenderer.DefaultSiteRenderer.renderModule(DefaultSiteRenderer.java:311) at org.apache.maven.doxia.siterenderer.DefaultSiteRenderer.render(DefaultSiteRenderer.java:129) at org.apache.maven.plugins.site.render.SiteMojo.renderLocale(SiteMojo.java:182) at org.apache.maven.plugins.site.render.SiteMojo.execute(SiteMojo.java:141) at org.apache.maven.plugin.DefaultBuildPluginManager.executeMojo(DefaultBuildPluginManager.java:132) ... 20 more I moved to the directory which contained sources of preceding release, which was deployed without any issues using standard command ({{mvn clean package deploy site}). This build failed as well (and sources, POM including, were frozen since previous successful build). I've been executing failing builds with JDK 1.8.0_u45. I tried with 1.8.0_u40, but it also failed. After switching to 1.7.0_u45 the build passed. This machine runs on 64 bit RedHat linux. The same build passes on my local machine on Win7, JDK 1.8.0_u11.
          Hide
          dojcsak Dojcsák Sándor added a comment -

          I get the error message if I add junit and ojdbc dependency in the same time. Please see attached pom.xml.

          If I change the „sealed: true” line to "sealed: false" in ojdbc6.jar’s META-INF\MANIFEST.MF the error message will disappear.

          Manifest-Version: 1.0
          Ant-Version: Apache Ant 1.6.5
          Created-By: 1.5.0_51-b10 (Sun Microsystems Inc.)
          Implementation-Vendor: Oracle Corporation
          Implementation-Title: JDBC
          Implementation-Version: 11.2.0.4.0
          Repository-Id: JAVAVM_11.2.0.4.0_LINUX.X64_RELEASE
          Specification-Vendor: Sun Microsystems Inc.
          Specification-Title: JDBC
          Specification-Version: 4.0
          Main-Class: oracle.jdbc.OracleDriver
          sealed: false
          
          Name: oracle/sql/converter/
          Sealed: false
          
          Name: oracle/sql/
          Sealed: false
          
          Name: oracle/sql/converter_xcharset/
          Sealed: false
          
          Name: oracle/replay/driver/
          Sealed: false
          
          Show
          dojcsak Dojcsák Sándor added a comment - I get the error message if I add junit and ojdbc dependency in the same time. Please see attached pom.xml . If I change the „sealed: true” line to "sealed: false" in ojdbc6.jar ’s META-INF\MANIFEST.MF the error message will disappear. Manifest-Version: 1.0 Ant-Version: Apache Ant 1.6.5 Created-By: 1.5.0_51-b10 (Sun Microsystems Inc.) Implementation-Vendor: Oracle Corporation Implementation-Title: JDBC Implementation-Version: 11.2.0.4.0 Repository-Id: JAVAVM_11.2.0.4.0_LINUX.X64_RELEASE Specification-Vendor: Sun Microsystems Inc. Specification-Title: JDBC Specification-Version: 4.0 Main- Class : oracle.jdbc.OracleDriver sealed: false Name: oracle/sql/converter/ Sealed: false Name: oracle/sql/ Sealed: false Name: oracle/sql/converter_xcharset/ Sealed: false Name: oracle/replay/driver/ Sealed: false
          Hide
          michael-o Michael Osipov added a comment -

          Guys, is it just because of the sealing? The error with the tools.jar is that sealing too?
          Jędrzej Dąbrowa Your NPE comes from a Sun internal class. Can you reproduce the real problem without the NPE?

          Show
          michael-o Michael Osipov added a comment - Guys, is it just because of the sealing? The error with the tools.jar is that sealing too? Jędrzej Dąbrowa Your NPE comes from a Sun internal class. Can you reproduce the real problem without the NPE?
          Hide
          michael-o Michael Osipov added a comment -

          Guys, I think I have found the bug here. The DepenenciesRenderer has a method hasSealed which instruct the RepositoryUtils to resolve entire dependency tree down to Files. At the first file having a sealed information that resolution is stopped. This means that the remeining have no Files attached. I will break up that method in two, resolve and a dumb hasSealed.

          Show
          michael-o Michael Osipov added a comment - Guys, I think I have found the bug here. The DepenenciesRenderer has a method hasSealed which instruct the RepositoryUtils to resolve entire dependency tree down to Files . At the first file having a sealed information that resolution is stopped. This means that the remeining have no Files attached. I will break up that method in two, resolve and a dumb hasSealed .
          Hide
          michael-o Michael Osipov added a comment - - edited

          Here is a branch which fixes the issue. Please test that with your projects and share your results. If that works, I will merge to trunk.

          Show
          michael-o Michael Osipov added a comment - - edited Here is a branch which fixes the issue. Please test that with your projects and share your results. If that works, I will merge to trunk.
          Hide
          hboutemy Hervé Boutemy added a comment -

          nice catch: when intend is not well defined, there can be unexpected and hard to find side effects...

          I don't know if this is sufficient to fix the issue (since we still can't provide an easy to reproduce test case to integrate as plugin IT), but for sure, this is a nice improvement: cleaner code

          +1 to merge to trunk

          Show
          hboutemy Hervé Boutemy added a comment - nice catch: when intend is not well defined, there can be unexpected and hard to find side effects... I don't know if this is sufficient to fix the issue (since we still can't provide an easy to reproduce test case to integrate as plugin IT), but for sure, this is a nice improvement: cleaner code +1 to merge to trunk
          Hide
          hboutemy Hervé Boutemy added a comment -

          here is an IT to show the (now perfectly identified) failure, then can be used to check that it is fixed

          Show
          hboutemy Hervé Boutemy added a comment - here is an IT to show the (now perfectly identified) failure, then can be used to check that it is fixed
          Hide
          michael-o Michael Osipov added a comment -

          Great, thank you for the IT. I was about to search for a sealed JAR in Central. We can finally fix this after three years

          Show
          michael-o Michael Osipov added a comment - Great, thank you for the IT. I was about to search for a sealed JAR in Central. We can finally fix this after three years
          Hide
          michael-o Michael Osipov added a comment -

          Just committed an improved version of the IT to the branch. If I hear no negative voices against the change, I will merge in a couple of days.

          Show
          michael-o Michael Osipov added a comment - Just committed an improved version of the IT to the branch. If I hear no negative voices against the change, I will merge in a couple of days.
          Hide
          hboutemy Hervé Boutemy added a comment -

          no need to wait: we have an IT and a fix, just merge

          Show
          hboutemy Hervé Boutemy added a comment - no need to wait: we have an IT and a fix, just merge
          Hide
          michael-o Michael Osipov added a comment -

          Fixed with r1722021.

          Show
          michael-o Michael Osipov added a comment - Fixed with r1722021 .
          Hide
          hudson Hudson added a comment -

          FAILURE: Integrated in maven-plugins #4942 (See https://builds.apache.org/job/maven-plugins/4942/)
          MPIR-251 Artifact ###### has no file error regression

          DependenciesRederer#hasSealed() implicitly resolved artifact to files and stopped at the first sealed artifact. Subsequent artifacts had no files attached. hasSealed() has been reduced to test for sealed only and a new method resolveArtifacts() has been extracted from the previous source.
          Added an IT with a sealed JAR dependency from Maven Central which verifies that all dependencies are properly resolved.

          IT contributed by: Hervé Boutemy <hboutemy@apache.org> (michaelo: http://svn.apache.org/viewvc/?view=rev&rev=1722021)

          • maven-project-info-reports-plugin
          • maven-project-info-reports-plugin/src/it/MPIR-251
          • maven-project-info-reports-plugin/src/main/java/org/apache/maven/report/projectinfo/dependencies/renderer/DependenciesRenderer.java
          Show
          hudson Hudson added a comment - FAILURE: Integrated in maven-plugins #4942 (See https://builds.apache.org/job/maven-plugins/4942/ ) MPIR-251 Artifact ###### has no file error regression DependenciesRederer#hasSealed() implicitly resolved artifact to files and stopped at the first sealed artifact. Subsequent artifacts had no files attached. hasSealed() has been reduced to test for sealed only and a new method resolveArtifacts() has been extracted from the previous source. Added an IT with a sealed JAR dependency from Maven Central which verifies that all dependencies are properly resolved. IT contributed by: Hervé Boutemy <hboutemy@apache.org> (michaelo: http://svn.apache.org/viewvc/?view=rev&rev=1722021 ) maven-project-info-reports-plugin maven-project-info-reports-plugin/src/it/ MPIR-251 maven-project-info-reports-plugin/src/main/java/org/apache/maven/report/projectinfo/dependencies/renderer/DependenciesRenderer.java

            People

            • Assignee:
              michael-o Michael Osipov
              Reporter:
              ian@ianbrandt.com Ian Brandt
            • Votes:
              4 Vote for this issue
              Watchers:
              14 Start watching this issue

              Dates

              • Created:
                Updated:
                Resolved:

                Development