Details

    • Type: Sub-task Sub-task
    • Status: Closed
    • Priority: Major Major
    • Resolution: Fixed
    • Affects Version/s: 0.13.1
    • Fix Version/s: 0.14.0
    • Component/s: Query Processor
    • Labels:
      None

      Description

      In order to support Update/Delete we need to read rowId from AcidInputFormat and pass that along through the operator pipeline (built from the WHERE clause of the SQL Statement) so that it can be written to the delta file by the update/delete (sink) operators.

      The parser will add this column to the projection list to make sure it's passed along.

      1. HIVE-7513.codeOnly.txt
        32 kB
        Eugene Koifman
      2. HIVE-7513.9.patch
        32 kB
        Navis
      3. HIVE-7513.8.patch
        32 kB
        Eugene Koifman
      4. HIVE-7513.5.patch
        38 kB
        Eugene Koifman
      5. HIVE-7513.4.patch
        34 kB
        Eugene Koifman
      6. HIVE-7513.3.patch
        31 kB
        Eugene Koifman
      7. HIVE-7513.14.patch
        1.14 MB
        Eugene Koifman
      8. HIVE-7513.13.patch
        1.14 MB
        Eugene Koifman
      9. HIVE-7513.12.patch
        1.14 MB
        Eugene Koifman
      10. HIVE-7513.11.patch
        816 kB
        Eugene Koifman
      11. HIVE-7513.10.patch
        31 kB
        Eugene Koifman

        Issue Links

          Activity

          Hide
          Navis added a comment -

          Can we extend this to make a public interface for SerDe to provide virtual columns? I have no idea on this but seemed to good to have it.

          Show
          Navis added a comment - Can we extend this to make a public interface for SerDe to provide virtual columns? I have no idea on this but seemed to good to have it.
          Hide
          Eugene Koifman added a comment -

          HIVE-7513.3.patch has 1st stab

          Show
          Eugene Koifman added a comment - HIVE-7513 .3.patch has 1st stab
          Hide
          Hive QA added a comment -

          Overall: -1 at least one tests failed

          Here are the results of testing the latest attachment:
          https://issues.apache.org/jira/secure/attachment/12659591/HIVE-7513.3.patch

          ERROR: -1 due to 277 failed/errored test(s), 5862 tests executed
          Failed tests:

          org.apache.hadoop.hive.cli.TestCliDriver.testCliDriver_allcolref_in_udf
          org.apache.hadoop.hive.cli.TestCliDriver.testCliDriver_annotate_stats_join
          org.apache.hadoop.hive.cli.TestCliDriver.testCliDriver_auto_join1
          org.apache.hadoop.hive.cli.TestCliDriver.testCliDriver_auto_join14
          org.apache.hadoop.hive.cli.TestCliDriver.testCliDriver_auto_join15
          org.apache.hadoop.hive.cli.TestCliDriver.testCliDriver_auto_join17
          org.apache.hadoop.hive.cli.TestCliDriver.testCliDriver_auto_join19
          org.apache.hadoop.hive.cli.TestCliDriver.testCliDriver_auto_join2
          org.apache.hadoop.hive.cli.TestCliDriver.testCliDriver_auto_join20
          org.apache.hadoop.hive.cli.TestCliDriver.testCliDriver_auto_join21
          org.apache.hadoop.hive.cli.TestCliDriver.testCliDriver_auto_join22
          org.apache.hadoop.hive.cli.TestCliDriver.testCliDriver_auto_join23
          org.apache.hadoop.hive.cli.TestCliDriver.testCliDriver_auto_join28
          org.apache.hadoop.hive.cli.TestCliDriver.testCliDriver_auto_join29
          org.apache.hadoop.hive.cli.TestCliDriver.testCliDriver_auto_join3
          org.apache.hadoop.hive.cli.TestCliDriver.testCliDriver_auto_join32
          org.apache.hadoop.hive.cli.TestCliDriver.testCliDriver_auto_join9
          org.apache.hadoop.hive.cli.TestCliDriver.testCliDriver_auto_join_reordering_values
          org.apache.hadoop.hive.cli.TestCliDriver.testCliDriver_auto_smb_mapjoin_14
          org.apache.hadoop.hive.cli.TestCliDriver.testCliDriver_auto_sortmerge_join_13
          org.apache.hadoop.hive.cli.TestCliDriver.testCliDriver_bucketmapjoin1
          org.apache.hadoop.hive.cli.TestCliDriver.testCliDriver_bucketmapjoin2
          org.apache.hadoop.hive.cli.TestCliDriver.testCliDriver_bucketmapjoin3
          org.apache.hadoop.hive.cli.TestCliDriver.testCliDriver_bucketmapjoin4
          org.apache.hadoop.hive.cli.TestCliDriver.testCliDriver_bucketmapjoin5
          org.apache.hadoop.hive.cli.TestCliDriver.testCliDriver_bucketmapjoin_negative
          org.apache.hadoop.hive.cli.TestCliDriver.testCliDriver_bucketmapjoin_negative2
          org.apache.hadoop.hive.cli.TestCliDriver.testCliDriver_bucketmapjoin_negative3
          org.apache.hadoop.hive.cli.TestCliDriver.testCliDriver_bucketsortoptimize_insert_2
          org.apache.hadoop.hive.cli.TestCliDriver.testCliDriver_bucketsortoptimize_insert_4
          org.apache.hadoop.hive.cli.TestCliDriver.testCliDriver_bucketsortoptimize_insert_5
          org.apache.hadoop.hive.cli.TestCliDriver.testCliDriver_bucketsortoptimize_insert_6
          org.apache.hadoop.hive.cli.TestCliDriver.testCliDriver_bucketsortoptimize_insert_7
          org.apache.hadoop.hive.cli.TestCliDriver.testCliDriver_bucketsortoptimize_insert_8
          org.apache.hadoop.hive.cli.TestCliDriver.testCliDriver_cluster
          org.apache.hadoop.hive.cli.TestCliDriver.testCliDriver_column_access_stats
          org.apache.hadoop.hive.cli.TestCliDriver.testCliDriver_constprog2
          org.apache.hadoop.hive.cli.TestCliDriver.testCliDriver_correlationoptimizer1
          org.apache.hadoop.hive.cli.TestCliDriver.testCliDriver_correlationoptimizer4
          org.apache.hadoop.hive.cli.TestCliDriver.testCliDriver_correlationoptimizer5
          org.apache.hadoop.hive.cli.TestCliDriver.testCliDriver_correlationoptimizer6
          org.apache.hadoop.hive.cli.TestCliDriver.testCliDriver_cross_product_check_1
          org.apache.hadoop.hive.cli.TestCliDriver.testCliDriver_cross_product_check_2
          org.apache.hadoop.hive.cli.TestCliDriver.testCliDriver_explain_logical
          org.apache.hadoop.hive.cli.TestCliDriver.testCliDriver_filter_join_breaktask
          org.apache.hadoop.hive.cli.TestCliDriver.testCliDriver_index_auto_self_join
          org.apache.hadoop.hive.cli.TestCliDriver.testCliDriver_innerjoin
          org.apache.hadoop.hive.cli.TestCliDriver.testCliDriver_input23
          org.apache.hadoop.hive.cli.TestCliDriver.testCliDriver_join14
          org.apache.hadoop.hive.cli.TestCliDriver.testCliDriver_join15
          org.apache.hadoop.hive.cli.TestCliDriver.testCliDriver_join17
          org.apache.hadoop.hive.cli.TestCliDriver.testCliDriver_join2
          org.apache.hadoop.hive.cli.TestCliDriver.testCliDriver_join20
          org.apache.hadoop.hive.cli.TestCliDriver.testCliDriver_join21
          org.apache.hadoop.hive.cli.TestCliDriver.testCliDriver_join22
          org.apache.hadoop.hive.cli.TestCliDriver.testCliDriver_join23
          org.apache.hadoop.hive.cli.TestCliDriver.testCliDriver_join25
          org.apache.hadoop.hive.cli.TestCliDriver.testCliDriver_join26
          org.apache.hadoop.hive.cli.TestCliDriver.testCliDriver_join27
          org.apache.hadoop.hive.cli.TestCliDriver.testCliDriver_join3
          org.apache.hadoop.hive.cli.TestCliDriver.testCliDriver_join32
          org.apache.hadoop.hive.cli.TestCliDriver.testCliDriver_join32_lessSize
          org.apache.hadoop.hive.cli.TestCliDriver.testCliDriver_join33
          org.apache.hadoop.hive.cli.TestCliDriver.testCliDriver_join36
          org.apache.hadoop.hive.cli.TestCliDriver.testCliDriver_join37
          org.apache.hadoop.hive.cli.TestCliDriver.testCliDriver_join38
          org.apache.hadoop.hive.cli.TestCliDriver.testCliDriver_join39
          org.apache.hadoop.hive.cli.TestCliDriver.testCliDriver_join40
          org.apache.hadoop.hive.cli.TestCliDriver.testCliDriver_join41
          org.apache.hadoop.hive.cli.TestCliDriver.testCliDriver_join9
          org.apache.hadoop.hive.cli.TestCliDriver.testCliDriver_join_alt_syntax
          org.apache.hadoop.hive.cli.TestCliDriver.testCliDriver_join_cond_pushdown_1
          org.apache.hadoop.hive.cli.TestCliDriver.testCliDriver_join_cond_pushdown_2
          org.apache.hadoop.hive.cli.TestCliDriver.testCliDriver_join_cond_pushdown_3
          org.apache.hadoop.hive.cli.TestCliDriver.testCliDriver_join_cond_pushdown_4
          org.apache.hadoop.hive.cli.TestCliDriver.testCliDriver_join_cond_pushdown_unqual1
          org.apache.hadoop.hive.cli.TestCliDriver.testCliDriver_join_cond_pushdown_unqual2
          org.apache.hadoop.hive.cli.TestCliDriver.testCliDriver_join_cond_pushdown_unqual3
          org.apache.hadoop.hive.cli.TestCliDriver.testCliDriver_join_cond_pushdown_unqual4
          org.apache.hadoop.hive.cli.TestCliDriver.testCliDriver_join_filters_overlap
          org.apache.hadoop.hive.cli.TestCliDriver.testCliDriver_join_hive_626
          org.apache.hadoop.hive.cli.TestCliDriver.testCliDriver_join_map_ppr
          org.apache.hadoop.hive.cli.TestCliDriver.testCliDriver_join_merging
          org.apache.hadoop.hive.cli.TestCliDriver.testCliDriver_join_nullsafe
          org.apache.hadoop.hive.cli.TestCliDriver.testCliDriver_join_rc
          org.apache.hadoop.hive.cli.TestCliDriver.testCliDriver_join_reorder
          org.apache.hadoop.hive.cli.TestCliDriver.testCliDriver_join_reorder2
          org.apache.hadoop.hive.cli.TestCliDriver.testCliDriver_join_reorder3
          org.apache.hadoop.hive.cli.TestCliDriver.testCliDriver_join_reorder4
          org.apache.hadoop.hive.cli.TestCliDriver.testCliDriver_join_star
          org.apache.hadoop.hive.cli.TestCliDriver.testCliDriver_join_thrift
          org.apache.hadoop.hive.cli.TestCliDriver.testCliDriver_join_vc
          org.apache.hadoop.hive.cli.TestCliDriver.testCliDriver_join_view
          org.apache.hadoop.hive.cli.TestCliDriver.testCliDriver_lateral_view
          org.apache.hadoop.hive.cli.TestCliDriver.testCliDriver_lateral_view_cp
          org.apache.hadoop.hive.cli.TestCliDriver.testCliDriver_lateral_view_noalias
          org.apache.hadoop.hive.cli.TestCliDriver.testCliDriver_lateral_view_outer
          org.apache.hadoop.hive.cli.TestCliDriver.testCliDriver_lateral_view_ppd
          org.apache.hadoop.hive.cli.TestCliDriver.testCliDriver_limit_pushdown_negative
          org.apache.hadoop.hive.cli.TestCliDriver.testCliDriver_lineage1
          org.apache.hadoop.hive.cli.TestCliDriver.testCliDriver_louter_join_ppr
          org.apache.hadoop.hive.cli.TestCliDriver.testCliDriver_mapjoin1
          org.apache.hadoop.hive.cli.TestCliDriver.testCliDriver_mapjoin_filter_on_outerjoin
          org.apache.hadoop.hive.cli.TestCliDriver.testCliDriver_mapjoin_memcheck
          org.apache.hadoop.hive.cli.TestCliDriver.testCliDriver_mapjoin_subquery2
          org.apache.hadoop.hive.cli.TestCliDriver.testCliDriver_mapjoin_test_outer
          org.apache.hadoop.hive.cli.TestCliDriver.testCliDriver_mergejoins
          org.apache.hadoop.hive.cli.TestCliDriver.testCliDriver_mergejoins_mixed
          org.apache.hadoop.hive.cli.TestCliDriver.testCliDriver_multiMapJoin1
          org.apache.hadoop.hive.cli.TestCliDriver.testCliDriver_multi_insert_lateral_view
          org.apache.hadoop.hive.cli.TestCliDriver.testCliDriver_multi_join_union
          org.apache.hadoop.hive.cli.TestCliDriver.testCliDriver_no_hooks
          org.apache.hadoop.hive.cli.TestCliDriver.testCliDriver_nonmr_fetch
          org.apache.hadoop.hive.cli.TestCliDriver.testCliDriver_optional_outer
          org.apache.hadoop.hive.cli.TestCliDriver.testCliDriver_outer_join_ppr
          org.apache.hadoop.hive.cli.TestCliDriver.testCliDriver_pcr
          org.apache.hadoop.hive.cli.TestCliDriver.testCliDriver_ppd_join5
          org.apache.hadoop.hive.cli.TestCliDriver.testCliDriver_ppd_join_filter
          org.apache.hadoop.hive.cli.TestCliDriver.testCliDriver_ppd_outer_join1
          org.apache.hadoop.hive.cli.TestCliDriver.testCliDriver_ppd_outer_join2
          org.apache.hadoop.hive.cli.TestCliDriver.testCliDriver_ppd_outer_join3
          org.apache.hadoop.hive.cli.TestCliDriver.testCliDriver_ppd_outer_join4
          org.apache.hadoop.hive.cli.TestCliDriver.testCliDriver_ppd_outer_join5
          org.apache.hadoop.hive.cli.TestCliDriver.testCliDriver_ppd_repeated_alias
          org.apache.hadoop.hive.cli.TestCliDriver.testCliDriver_ppd_udf_case
          org.apache.hadoop.hive.cli.TestCliDriver.testCliDriver_ppd_union_view
          org.apache.hadoop.hive.cli.TestCliDriver.testCliDriver_ppd_vc
          org.apache.hadoop.hive.cli.TestCliDriver.testCliDriver_ptf
          org.apache.hadoop.hive.cli.TestCliDriver.testCliDriver_quotedid_skew
          org.apache.hadoop.hive.cli.TestCliDriver.testCliDriver_regex_col
          org.apache.hadoop.hive.cli.TestCliDriver.testCliDriver_router_join_ppr
          org.apache.hadoop.hive.cli.TestCliDriver.testCliDriver_sample8
          org.apache.hadoop.hive.cli.TestCliDriver.testCliDriver_semijoin
          org.apache.hadoop.hive.cli.TestCliDriver.testCliDriver_skewjoin
          org.apache.hadoop.hive.cli.TestCliDriver.testCliDriver_skewjoin_union_remove_1
          org.apache.hadoop.hive.cli.TestCliDriver.testCliDriver_skewjoin_union_remove_2
          org.apache.hadoop.hive.cli.TestCliDriver.testCliDriver_skewjoinopt1
          org.apache.hadoop.hive.cli.TestCliDriver.testCliDriver_skewjoinopt10
          org.apache.hadoop.hive.cli.TestCliDriver.testCliDriver_skewjoinopt11
          org.apache.hadoop.hive.cli.TestCliDriver.testCliDriver_skewjoinopt12
          org.apache.hadoop.hive.cli.TestCliDriver.testCliDriver_skewjoinopt13
          org.apache.hadoop.hive.cli.TestCliDriver.testCliDriver_skewjoinopt14
          org.apache.hadoop.hive.cli.TestCliDriver.testCliDriver_skewjoinopt15
          org.apache.hadoop.hive.cli.TestCliDriver.testCliDriver_skewjoinopt16
          org.apache.hadoop.hive.cli.TestCliDriver.testCliDriver_skewjoinopt17
          org.apache.hadoop.hive.cli.TestCliDriver.testCliDriver_skewjoinopt18
          org.apache.hadoop.hive.cli.TestCliDriver.testCliDriver_skewjoinopt19
          org.apache.hadoop.hive.cli.TestCliDriver.testCliDriver_skewjoinopt2
          org.apache.hadoop.hive.cli.TestCliDriver.testCliDriver_skewjoinopt20
          org.apache.hadoop.hive.cli.TestCliDriver.testCliDriver_skewjoinopt3
          org.apache.hadoop.hive.cli.TestCliDriver.testCliDriver_skewjoinopt4
          org.apache.hadoop.hive.cli.TestCliDriver.testCliDriver_skewjoinopt5
          org.apache.hadoop.hive.cli.TestCliDriver.testCliDriver_skewjoinopt6
          org.apache.hadoop.hive.cli.TestCliDriver.testCliDriver_skewjoinopt7
          org.apache.hadoop.hive.cli.TestCliDriver.testCliDriver_skewjoinopt8
          org.apache.hadoop.hive.cli.TestCliDriver.testCliDriver_smb_mapjoin9
          org.apache.hadoop.hive.cli.TestCliDriver.testCliDriver_smb_mapjoin_1
          org.apache.hadoop.hive.cli.TestCliDriver.testCliDriver_smb_mapjoin_10
          org.apache.hadoop.hive.cli.TestCliDriver.testCliDriver_smb_mapjoin_11
          org.apache.hadoop.hive.cli.TestCliDriver.testCliDriver_smb_mapjoin_12
          org.apache.hadoop.hive.cli.TestCliDriver.testCliDriver_smb_mapjoin_13
          org.apache.hadoop.hive.cli.TestCliDriver.testCliDriver_smb_mapjoin_15
          org.apache.hadoop.hive.cli.TestCliDriver.testCliDriver_smb_mapjoin_2
          org.apache.hadoop.hive.cli.TestCliDriver.testCliDriver_smb_mapjoin_3
          org.apache.hadoop.hive.cli.TestCliDriver.testCliDriver_smb_mapjoin_4
          org.apache.hadoop.hive.cli.TestCliDriver.testCliDriver_smb_mapjoin_5
          org.apache.hadoop.hive.cli.TestCliDriver.testCliDriver_smb_mapjoin_6
          org.apache.hadoop.hive.cli.TestCliDriver.testCliDriver_smb_mapjoin_7
          org.apache.hadoop.hive.cli.TestCliDriver.testCliDriver_stats11
          org.apache.hadoop.hive.cli.TestCliDriver.testCliDriver_subquery_multiinsert
          org.apache.hadoop.hive.cli.TestCliDriver.testCliDriver_subquery_notexists
          org.apache.hadoop.hive.cli.TestCliDriver.testCliDriver_subquery_notin
          org.apache.hadoop.hive.cli.TestCliDriver.testCliDriver_subquery_unqualcolumnrefs
          org.apache.hadoop.hive.cli.TestCliDriver.testCliDriver_subquery_views
          org.apache.hadoop.hive.cli.TestCliDriver.testCliDriver_temp_table_join1
          org.apache.hadoop.hive.cli.TestCliDriver.testCliDriver_temp_table_windowing_expressions
          org.apache.hadoop.hive.cli.TestCliDriver.testCliDriver_udtf_json_tuple
          org.apache.hadoop.hive.cli.TestCliDriver.testCliDriver_udtf_parse_url_tuple
          org.apache.hadoop.hive.cli.TestCliDriver.testCliDriver_udtf_stack
          org.apache.hadoop.hive.cli.TestCliDriver.testCliDriver_union22
          org.apache.hadoop.hive.cli.TestCliDriver.testCliDriver_union24
          org.apache.hadoop.hive.cli.TestCliDriver.testCliDriver_union26
          org.apache.hadoop.hive.cli.TestCliDriver.testCliDriver_union27
          org.apache.hadoop.hive.cli.TestCliDriver.testCliDriver_union32
          org.apache.hadoop.hive.cli.TestCliDriver.testCliDriver_union_remove_12
          org.apache.hadoop.hive.cli.TestCliDriver.testCliDriver_union_remove_13
          org.apache.hadoop.hive.cli.TestCliDriver.testCliDriver_union_remove_14
          org.apache.hadoop.hive.cli.TestCliDriver.testCliDriver_union_top_level
          org.apache.hadoop.hive.cli.TestCliDriver.testCliDriver_vector_decimal_mapjoin
          org.apache.hadoop.hive.cli.TestCliDriver.testCliDriver_vectorized_bucketmapjoin1
          org.apache.hadoop.hive.cli.TestCliDriver.testCliDriver_vectorized_context
          org.apache.hadoop.hive.cli.TestCliDriver.testCliDriver_vectorized_mapjoin
          org.apache.hadoop.hive.cli.TestCliDriver.testCliDriver_vectorized_nested_mapjoin
          org.apache.hadoop.hive.cli.TestCliDriver.testCliDriver_vectorized_ptf
          org.apache.hadoop.hive.cli.TestCliDriver.testCliDriver_vectorized_shufflejoin
          org.apache.hadoop.hive.cli.TestCliDriver.testCliDriver_windowing
          org.apache.hadoop.hive.cli.TestCliDriver.testCliDriver_windowing_expressions
          org.apache.hadoop.hive.cli.TestMiniTezCliDriver.testCliDriver_auto_join1
          org.apache.hadoop.hive.cli.TestMiniTezCliDriver.testCliDriver_bucket_map_join_tez1
          org.apache.hadoop.hive.cli.TestMiniTezCliDriver.testCliDriver_bucket_map_join_tez2
          org.apache.hadoop.hive.cli.TestMiniTezCliDriver.testCliDriver_cross_product_check_1
          org.apache.hadoop.hive.cli.TestMiniTezCliDriver.testCliDriver_cross_product_check_2
          org.apache.hadoop.hive.cli.TestMiniTezCliDriver.testCliDriver_filter_join_breaktask
          org.apache.hadoop.hive.cli.TestMiniTezCliDriver.testCliDriver_join1
          org.apache.hadoop.hive.cli.TestMiniTezCliDriver.testCliDriver_mapjoin_decimal
          org.apache.hadoop.hive.cli.TestMiniTezCliDriver.testCliDriver_mrr
          org.apache.hadoop.hive.cli.TestMiniTezCliDriver.testCliDriver_ptf
          org.apache.hadoop.hive.cli.TestMiniTezCliDriver.testCliDriver_tez_join_hash
          org.apache.hadoop.hive.cli.TestMiniTezCliDriver.testCliDriver_tez_join_tests
          org.apache.hadoop.hive.cli.TestMiniTezCliDriver.testCliDriver_tez_joins_explain
          org.apache.hadoop.hive.cli.TestMiniTezCliDriver.testCliDriver_tez_union
          org.apache.hadoop.hive.cli.TestMiniTezCliDriver.testCliDriver_vectorized_ptf
          org.apache.hadoop.hive.cli.TestMinimrCliDriver.testCliDriver_bucketmapjoin7
          org.apache.hadoop.hive.cli.TestMinimrCliDriver.testCliDriver_infer_bucket_sort_map_operators
          org.apache.hadoop.hive.cli.TestMinimrCliDriver.testCliDriver_join1
          org.apache.hadoop.hive.cli.TestMinimrCliDriver.testCliDriver_ql_rewrite_gbtoidx
          org.apache.hadoop.hive.cli.TestNegativeCliDriver.testNegativeCliDriver_bucket_mapjoin_mismatch1
          org.apache.hadoop.hive.cli.TestNegativeCliDriver.testNegativeCliDriver_sortmerge_mapjoin_mismatch_1
          org.apache.hadoop.hive.cli.TestNegativeCliDriver.testNegativeCliDriver_udf_assert_true
          org.apache.hadoop.hive.cli.TestNegativeCliDriver.testNegativeCliDriver_udf_assert_true2
          org.apache.hadoop.hive.ql.TestMTQueries.testMTQueries1
          org.apache.hadoop.hive.ql.io.orc.TestInputOutputFormat.testInOutFormat
          org.apache.hadoop.hive.ql.io.orc.TestInputOutputFormat.testVectorizationWithAcid
          org.apache.hadoop.hive.ql.io.orc.TestOrcRawRecordMerger.testRecordReaderDelta
          org.apache.hadoop.hive.ql.io.orc.TestOrcRawRecordMerger.testRecordReaderIncompleteDelta
          org.apache.hadoop.hive.ql.io.orc.TestOrcRawRecordMerger.testRecordReaderNewBaseAndDelta
          org.apache.hadoop.hive.ql.io.orc.TestOrcRawRecordMerger.testRecordReaderOldBaseAndDelta
          org.apache.hadoop.hive.ql.parse.TestParse.testParse_case_sensitivity
          org.apache.hadoop.hive.ql.parse.TestParse.testParse_cast1
          org.apache.hadoop.hive.ql.parse.TestParse.testParse_groupby1
          org.apache.hadoop.hive.ql.parse.TestParse.testParse_groupby2
          org.apache.hadoop.hive.ql.parse.TestParse.testParse_groupby3
          org.apache.hadoop.hive.ql.parse.TestParse.testParse_groupby4
          org.apache.hadoop.hive.ql.parse.TestParse.testParse_groupby5
          org.apache.hadoop.hive.ql.parse.TestParse.testParse_groupby6
          org.apache.hadoop.hive.ql.parse.TestParse.testParse_input1
          org.apache.hadoop.hive.ql.parse.TestParse.testParse_input2
          org.apache.hadoop.hive.ql.parse.TestParse.testParse_input20
          org.apache.hadoop.hive.ql.parse.TestParse.testParse_input3
          org.apache.hadoop.hive.ql.parse.TestParse.testParse_input4
          org.apache.hadoop.hive.ql.parse.TestParse.testParse_input5
          org.apache.hadoop.hive.ql.parse.TestParse.testParse_input6
          org.apache.hadoop.hive.ql.parse.TestParse.testParse_input7
          org.apache.hadoop.hive.ql.parse.TestParse.testParse_input8
          org.apache.hadoop.hive.ql.parse.TestParse.testParse_input9
          org.apache.hadoop.hive.ql.parse.TestParse.testParse_input_part1
          org.apache.hadoop.hive.ql.parse.TestParse.testParse_input_testsequencefile
          org.apache.hadoop.hive.ql.parse.TestParse.testParse_input_testxpath
          org.apache.hadoop.hive.ql.parse.TestParse.testParse_input_testxpath2
          org.apache.hadoop.hive.ql.parse.TestParse.testParse_join1
          org.apache.hadoop.hive.ql.parse.TestParse.testParse_join2
          org.apache.hadoop.hive.ql.parse.TestParse.testParse_join3
          org.apache.hadoop.hive.ql.parse.TestParse.testParse_join4
          org.apache.hadoop.hive.ql.parse.TestParse.testParse_join5
          org.apache.hadoop.hive.ql.parse.TestParse.testParse_join6
          org.apache.hadoop.hive.ql.parse.TestParse.testParse_join7
          org.apache.hadoop.hive.ql.parse.TestParse.testParse_join8
          org.apache.hadoop.hive.ql.parse.TestParse.testParse_sample1
          org.apache.hadoop.hive.ql.parse.TestParse.testParse_sample2
          org.apache.hadoop.hive.ql.parse.TestParse.testParse_sample3
          org.apache.hadoop.hive.ql.parse.TestParse.testParse_sample4
          org.apache.hadoop.hive.ql.parse.TestParse.testParse_sample5
          org.apache.hadoop.hive.ql.parse.TestParse.testParse_sample6
          org.apache.hadoop.hive.ql.parse.TestParse.testParse_sample7
          org.apache.hadoop.hive.ql.parse.TestParse.testParse_subq
          org.apache.hadoop.hive.ql.parse.TestParse.testParse_udf1
          org.apache.hadoop.hive.ql.parse.TestParse.testParse_udf4
          org.apache.hadoop.hive.ql.parse.TestParse.testParse_udf6
          org.apache.hadoop.hive.ql.parse.TestParse.testParse_udf_case
          org.apache.hadoop.hive.ql.parse.TestParse.testParse_udf_when
          org.apache.hadoop.hive.ql.parse.TestParse.testParse_union
          org.apache.hive.hcatalog.streaming.TestStreaming.testInterleavedTransactionBatchCommits
          org.apache.hive.hcatalog.streaming.TestStreaming.testMultipleTransactionBatchCommits
          org.apache.hive.hcatalog.streaming.TestStreaming.testTransactionBatchAbortAndCommit
          org.apache.hive.hcatalog.streaming.TestStreaming.testTransactionBatchCommit_Delimited
          org.apache.hive.hcatalog.streaming.TestStreaming.testTransactionBatchCommit_Json
          org.apache.hive.jdbc.miniHS2.TestHiveServer2.testConnection
          

          Test results: http://ec2-174-129-184-35.compute-1.amazonaws.com/jenkins/job/PreCommit-HIVE-TRUNK-Build/156/testReport
          Console output: http://ec2-174-129-184-35.compute-1.amazonaws.com/jenkins/job/PreCommit-HIVE-TRUNK-Build/156/console
          Test logs: http://ec2-174-129-184-35.compute-1.amazonaws.com/logs/PreCommit-HIVE-TRUNK-Build-156/

          Messages:

          Executing org.apache.hive.ptest.execution.PrepPhase
          Executing org.apache.hive.ptest.execution.ExecutionPhase
          Executing org.apache.hive.ptest.execution.ReportingPhase
          Tests exited with: TestsFailedException: 277 tests failed
          

          This message is automatically generated.

          ATTACHMENT ID: 12659591

          Show
          Hive QA added a comment - Overall : -1 at least one tests failed Here are the results of testing the latest attachment: https://issues.apache.org/jira/secure/attachment/12659591/HIVE-7513.3.patch ERROR: -1 due to 277 failed/errored test(s), 5862 tests executed Failed tests: org.apache.hadoop.hive.cli.TestCliDriver.testCliDriver_allcolref_in_udf org.apache.hadoop.hive.cli.TestCliDriver.testCliDriver_annotate_stats_join org.apache.hadoop.hive.cli.TestCliDriver.testCliDriver_auto_join1 org.apache.hadoop.hive.cli.TestCliDriver.testCliDriver_auto_join14 org.apache.hadoop.hive.cli.TestCliDriver.testCliDriver_auto_join15 org.apache.hadoop.hive.cli.TestCliDriver.testCliDriver_auto_join17 org.apache.hadoop.hive.cli.TestCliDriver.testCliDriver_auto_join19 org.apache.hadoop.hive.cli.TestCliDriver.testCliDriver_auto_join2 org.apache.hadoop.hive.cli.TestCliDriver.testCliDriver_auto_join20 org.apache.hadoop.hive.cli.TestCliDriver.testCliDriver_auto_join21 org.apache.hadoop.hive.cli.TestCliDriver.testCliDriver_auto_join22 org.apache.hadoop.hive.cli.TestCliDriver.testCliDriver_auto_join23 org.apache.hadoop.hive.cli.TestCliDriver.testCliDriver_auto_join28 org.apache.hadoop.hive.cli.TestCliDriver.testCliDriver_auto_join29 org.apache.hadoop.hive.cli.TestCliDriver.testCliDriver_auto_join3 org.apache.hadoop.hive.cli.TestCliDriver.testCliDriver_auto_join32 org.apache.hadoop.hive.cli.TestCliDriver.testCliDriver_auto_join9 org.apache.hadoop.hive.cli.TestCliDriver.testCliDriver_auto_join_reordering_values org.apache.hadoop.hive.cli.TestCliDriver.testCliDriver_auto_smb_mapjoin_14 org.apache.hadoop.hive.cli.TestCliDriver.testCliDriver_auto_sortmerge_join_13 org.apache.hadoop.hive.cli.TestCliDriver.testCliDriver_bucketmapjoin1 org.apache.hadoop.hive.cli.TestCliDriver.testCliDriver_bucketmapjoin2 org.apache.hadoop.hive.cli.TestCliDriver.testCliDriver_bucketmapjoin3 org.apache.hadoop.hive.cli.TestCliDriver.testCliDriver_bucketmapjoin4 org.apache.hadoop.hive.cli.TestCliDriver.testCliDriver_bucketmapjoin5 org.apache.hadoop.hive.cli.TestCliDriver.testCliDriver_bucketmapjoin_negative org.apache.hadoop.hive.cli.TestCliDriver.testCliDriver_bucketmapjoin_negative2 org.apache.hadoop.hive.cli.TestCliDriver.testCliDriver_bucketmapjoin_negative3 org.apache.hadoop.hive.cli.TestCliDriver.testCliDriver_bucketsortoptimize_insert_2 org.apache.hadoop.hive.cli.TestCliDriver.testCliDriver_bucketsortoptimize_insert_4 org.apache.hadoop.hive.cli.TestCliDriver.testCliDriver_bucketsortoptimize_insert_5 org.apache.hadoop.hive.cli.TestCliDriver.testCliDriver_bucketsortoptimize_insert_6 org.apache.hadoop.hive.cli.TestCliDriver.testCliDriver_bucketsortoptimize_insert_7 org.apache.hadoop.hive.cli.TestCliDriver.testCliDriver_bucketsortoptimize_insert_8 org.apache.hadoop.hive.cli.TestCliDriver.testCliDriver_cluster org.apache.hadoop.hive.cli.TestCliDriver.testCliDriver_column_access_stats org.apache.hadoop.hive.cli.TestCliDriver.testCliDriver_constprog2 org.apache.hadoop.hive.cli.TestCliDriver.testCliDriver_correlationoptimizer1 org.apache.hadoop.hive.cli.TestCliDriver.testCliDriver_correlationoptimizer4 org.apache.hadoop.hive.cli.TestCliDriver.testCliDriver_correlationoptimizer5 org.apache.hadoop.hive.cli.TestCliDriver.testCliDriver_correlationoptimizer6 org.apache.hadoop.hive.cli.TestCliDriver.testCliDriver_cross_product_check_1 org.apache.hadoop.hive.cli.TestCliDriver.testCliDriver_cross_product_check_2 org.apache.hadoop.hive.cli.TestCliDriver.testCliDriver_explain_logical org.apache.hadoop.hive.cli.TestCliDriver.testCliDriver_filter_join_breaktask org.apache.hadoop.hive.cli.TestCliDriver.testCliDriver_index_auto_self_join org.apache.hadoop.hive.cli.TestCliDriver.testCliDriver_innerjoin org.apache.hadoop.hive.cli.TestCliDriver.testCliDriver_input23 org.apache.hadoop.hive.cli.TestCliDriver.testCliDriver_join14 org.apache.hadoop.hive.cli.TestCliDriver.testCliDriver_join15 org.apache.hadoop.hive.cli.TestCliDriver.testCliDriver_join17 org.apache.hadoop.hive.cli.TestCliDriver.testCliDriver_join2 org.apache.hadoop.hive.cli.TestCliDriver.testCliDriver_join20 org.apache.hadoop.hive.cli.TestCliDriver.testCliDriver_join21 org.apache.hadoop.hive.cli.TestCliDriver.testCliDriver_join22 org.apache.hadoop.hive.cli.TestCliDriver.testCliDriver_join23 org.apache.hadoop.hive.cli.TestCliDriver.testCliDriver_join25 org.apache.hadoop.hive.cli.TestCliDriver.testCliDriver_join26 org.apache.hadoop.hive.cli.TestCliDriver.testCliDriver_join27 org.apache.hadoop.hive.cli.TestCliDriver.testCliDriver_join3 org.apache.hadoop.hive.cli.TestCliDriver.testCliDriver_join32 org.apache.hadoop.hive.cli.TestCliDriver.testCliDriver_join32_lessSize org.apache.hadoop.hive.cli.TestCliDriver.testCliDriver_join33 org.apache.hadoop.hive.cli.TestCliDriver.testCliDriver_join36 org.apache.hadoop.hive.cli.TestCliDriver.testCliDriver_join37 org.apache.hadoop.hive.cli.TestCliDriver.testCliDriver_join38 org.apache.hadoop.hive.cli.TestCliDriver.testCliDriver_join39 org.apache.hadoop.hive.cli.TestCliDriver.testCliDriver_join40 org.apache.hadoop.hive.cli.TestCliDriver.testCliDriver_join41 org.apache.hadoop.hive.cli.TestCliDriver.testCliDriver_join9 org.apache.hadoop.hive.cli.TestCliDriver.testCliDriver_join_alt_syntax org.apache.hadoop.hive.cli.TestCliDriver.testCliDriver_join_cond_pushdown_1 org.apache.hadoop.hive.cli.TestCliDriver.testCliDriver_join_cond_pushdown_2 org.apache.hadoop.hive.cli.TestCliDriver.testCliDriver_join_cond_pushdown_3 org.apache.hadoop.hive.cli.TestCliDriver.testCliDriver_join_cond_pushdown_4 org.apache.hadoop.hive.cli.TestCliDriver.testCliDriver_join_cond_pushdown_unqual1 org.apache.hadoop.hive.cli.TestCliDriver.testCliDriver_join_cond_pushdown_unqual2 org.apache.hadoop.hive.cli.TestCliDriver.testCliDriver_join_cond_pushdown_unqual3 org.apache.hadoop.hive.cli.TestCliDriver.testCliDriver_join_cond_pushdown_unqual4 org.apache.hadoop.hive.cli.TestCliDriver.testCliDriver_join_filters_overlap org.apache.hadoop.hive.cli.TestCliDriver.testCliDriver_join_hive_626 org.apache.hadoop.hive.cli.TestCliDriver.testCliDriver_join_map_ppr org.apache.hadoop.hive.cli.TestCliDriver.testCliDriver_join_merging org.apache.hadoop.hive.cli.TestCliDriver.testCliDriver_join_nullsafe org.apache.hadoop.hive.cli.TestCliDriver.testCliDriver_join_rc org.apache.hadoop.hive.cli.TestCliDriver.testCliDriver_join_reorder org.apache.hadoop.hive.cli.TestCliDriver.testCliDriver_join_reorder2 org.apache.hadoop.hive.cli.TestCliDriver.testCliDriver_join_reorder3 org.apache.hadoop.hive.cli.TestCliDriver.testCliDriver_join_reorder4 org.apache.hadoop.hive.cli.TestCliDriver.testCliDriver_join_star org.apache.hadoop.hive.cli.TestCliDriver.testCliDriver_join_thrift org.apache.hadoop.hive.cli.TestCliDriver.testCliDriver_join_vc org.apache.hadoop.hive.cli.TestCliDriver.testCliDriver_join_view org.apache.hadoop.hive.cli.TestCliDriver.testCliDriver_lateral_view org.apache.hadoop.hive.cli.TestCliDriver.testCliDriver_lateral_view_cp org.apache.hadoop.hive.cli.TestCliDriver.testCliDriver_lateral_view_noalias org.apache.hadoop.hive.cli.TestCliDriver.testCliDriver_lateral_view_outer org.apache.hadoop.hive.cli.TestCliDriver.testCliDriver_lateral_view_ppd org.apache.hadoop.hive.cli.TestCliDriver.testCliDriver_limit_pushdown_negative org.apache.hadoop.hive.cli.TestCliDriver.testCliDriver_lineage1 org.apache.hadoop.hive.cli.TestCliDriver.testCliDriver_louter_join_ppr org.apache.hadoop.hive.cli.TestCliDriver.testCliDriver_mapjoin1 org.apache.hadoop.hive.cli.TestCliDriver.testCliDriver_mapjoin_filter_on_outerjoin org.apache.hadoop.hive.cli.TestCliDriver.testCliDriver_mapjoin_memcheck org.apache.hadoop.hive.cli.TestCliDriver.testCliDriver_mapjoin_subquery2 org.apache.hadoop.hive.cli.TestCliDriver.testCliDriver_mapjoin_test_outer org.apache.hadoop.hive.cli.TestCliDriver.testCliDriver_mergejoins org.apache.hadoop.hive.cli.TestCliDriver.testCliDriver_mergejoins_mixed org.apache.hadoop.hive.cli.TestCliDriver.testCliDriver_multiMapJoin1 org.apache.hadoop.hive.cli.TestCliDriver.testCliDriver_multi_insert_lateral_view org.apache.hadoop.hive.cli.TestCliDriver.testCliDriver_multi_join_union org.apache.hadoop.hive.cli.TestCliDriver.testCliDriver_no_hooks org.apache.hadoop.hive.cli.TestCliDriver.testCliDriver_nonmr_fetch org.apache.hadoop.hive.cli.TestCliDriver.testCliDriver_optional_outer org.apache.hadoop.hive.cli.TestCliDriver.testCliDriver_outer_join_ppr org.apache.hadoop.hive.cli.TestCliDriver.testCliDriver_pcr org.apache.hadoop.hive.cli.TestCliDriver.testCliDriver_ppd_join5 org.apache.hadoop.hive.cli.TestCliDriver.testCliDriver_ppd_join_filter org.apache.hadoop.hive.cli.TestCliDriver.testCliDriver_ppd_outer_join1 org.apache.hadoop.hive.cli.TestCliDriver.testCliDriver_ppd_outer_join2 org.apache.hadoop.hive.cli.TestCliDriver.testCliDriver_ppd_outer_join3 org.apache.hadoop.hive.cli.TestCliDriver.testCliDriver_ppd_outer_join4 org.apache.hadoop.hive.cli.TestCliDriver.testCliDriver_ppd_outer_join5 org.apache.hadoop.hive.cli.TestCliDriver.testCliDriver_ppd_repeated_alias org.apache.hadoop.hive.cli.TestCliDriver.testCliDriver_ppd_udf_case org.apache.hadoop.hive.cli.TestCliDriver.testCliDriver_ppd_union_view org.apache.hadoop.hive.cli.TestCliDriver.testCliDriver_ppd_vc org.apache.hadoop.hive.cli.TestCliDriver.testCliDriver_ptf org.apache.hadoop.hive.cli.TestCliDriver.testCliDriver_quotedid_skew org.apache.hadoop.hive.cli.TestCliDriver.testCliDriver_regex_col org.apache.hadoop.hive.cli.TestCliDriver.testCliDriver_router_join_ppr org.apache.hadoop.hive.cli.TestCliDriver.testCliDriver_sample8 org.apache.hadoop.hive.cli.TestCliDriver.testCliDriver_semijoin org.apache.hadoop.hive.cli.TestCliDriver.testCliDriver_skewjoin org.apache.hadoop.hive.cli.TestCliDriver.testCliDriver_skewjoin_union_remove_1 org.apache.hadoop.hive.cli.TestCliDriver.testCliDriver_skewjoin_union_remove_2 org.apache.hadoop.hive.cli.TestCliDriver.testCliDriver_skewjoinopt1 org.apache.hadoop.hive.cli.TestCliDriver.testCliDriver_skewjoinopt10 org.apache.hadoop.hive.cli.TestCliDriver.testCliDriver_skewjoinopt11 org.apache.hadoop.hive.cli.TestCliDriver.testCliDriver_skewjoinopt12 org.apache.hadoop.hive.cli.TestCliDriver.testCliDriver_skewjoinopt13 org.apache.hadoop.hive.cli.TestCliDriver.testCliDriver_skewjoinopt14 org.apache.hadoop.hive.cli.TestCliDriver.testCliDriver_skewjoinopt15 org.apache.hadoop.hive.cli.TestCliDriver.testCliDriver_skewjoinopt16 org.apache.hadoop.hive.cli.TestCliDriver.testCliDriver_skewjoinopt17 org.apache.hadoop.hive.cli.TestCliDriver.testCliDriver_skewjoinopt18 org.apache.hadoop.hive.cli.TestCliDriver.testCliDriver_skewjoinopt19 org.apache.hadoop.hive.cli.TestCliDriver.testCliDriver_skewjoinopt2 org.apache.hadoop.hive.cli.TestCliDriver.testCliDriver_skewjoinopt20 org.apache.hadoop.hive.cli.TestCliDriver.testCliDriver_skewjoinopt3 org.apache.hadoop.hive.cli.TestCliDriver.testCliDriver_skewjoinopt4 org.apache.hadoop.hive.cli.TestCliDriver.testCliDriver_skewjoinopt5 org.apache.hadoop.hive.cli.TestCliDriver.testCliDriver_skewjoinopt6 org.apache.hadoop.hive.cli.TestCliDriver.testCliDriver_skewjoinopt7 org.apache.hadoop.hive.cli.TestCliDriver.testCliDriver_skewjoinopt8 org.apache.hadoop.hive.cli.TestCliDriver.testCliDriver_smb_mapjoin9 org.apache.hadoop.hive.cli.TestCliDriver.testCliDriver_smb_mapjoin_1 org.apache.hadoop.hive.cli.TestCliDriver.testCliDriver_smb_mapjoin_10 org.apache.hadoop.hive.cli.TestCliDriver.testCliDriver_smb_mapjoin_11 org.apache.hadoop.hive.cli.TestCliDriver.testCliDriver_smb_mapjoin_12 org.apache.hadoop.hive.cli.TestCliDriver.testCliDriver_smb_mapjoin_13 org.apache.hadoop.hive.cli.TestCliDriver.testCliDriver_smb_mapjoin_15 org.apache.hadoop.hive.cli.TestCliDriver.testCliDriver_smb_mapjoin_2 org.apache.hadoop.hive.cli.TestCliDriver.testCliDriver_smb_mapjoin_3 org.apache.hadoop.hive.cli.TestCliDriver.testCliDriver_smb_mapjoin_4 org.apache.hadoop.hive.cli.TestCliDriver.testCliDriver_smb_mapjoin_5 org.apache.hadoop.hive.cli.TestCliDriver.testCliDriver_smb_mapjoin_6 org.apache.hadoop.hive.cli.TestCliDriver.testCliDriver_smb_mapjoin_7 org.apache.hadoop.hive.cli.TestCliDriver.testCliDriver_stats11 org.apache.hadoop.hive.cli.TestCliDriver.testCliDriver_subquery_multiinsert org.apache.hadoop.hive.cli.TestCliDriver.testCliDriver_subquery_notexists org.apache.hadoop.hive.cli.TestCliDriver.testCliDriver_subquery_notin org.apache.hadoop.hive.cli.TestCliDriver.testCliDriver_subquery_unqualcolumnrefs org.apache.hadoop.hive.cli.TestCliDriver.testCliDriver_subquery_views org.apache.hadoop.hive.cli.TestCliDriver.testCliDriver_temp_table_join1 org.apache.hadoop.hive.cli.TestCliDriver.testCliDriver_temp_table_windowing_expressions org.apache.hadoop.hive.cli.TestCliDriver.testCliDriver_udtf_json_tuple org.apache.hadoop.hive.cli.TestCliDriver.testCliDriver_udtf_parse_url_tuple org.apache.hadoop.hive.cli.TestCliDriver.testCliDriver_udtf_stack org.apache.hadoop.hive.cli.TestCliDriver.testCliDriver_union22 org.apache.hadoop.hive.cli.TestCliDriver.testCliDriver_union24 org.apache.hadoop.hive.cli.TestCliDriver.testCliDriver_union26 org.apache.hadoop.hive.cli.TestCliDriver.testCliDriver_union27 org.apache.hadoop.hive.cli.TestCliDriver.testCliDriver_union32 org.apache.hadoop.hive.cli.TestCliDriver.testCliDriver_union_remove_12 org.apache.hadoop.hive.cli.TestCliDriver.testCliDriver_union_remove_13 org.apache.hadoop.hive.cli.TestCliDriver.testCliDriver_union_remove_14 org.apache.hadoop.hive.cli.TestCliDriver.testCliDriver_union_top_level org.apache.hadoop.hive.cli.TestCliDriver.testCliDriver_vector_decimal_mapjoin org.apache.hadoop.hive.cli.TestCliDriver.testCliDriver_vectorized_bucketmapjoin1 org.apache.hadoop.hive.cli.TestCliDriver.testCliDriver_vectorized_context org.apache.hadoop.hive.cli.TestCliDriver.testCliDriver_vectorized_mapjoin org.apache.hadoop.hive.cli.TestCliDriver.testCliDriver_vectorized_nested_mapjoin org.apache.hadoop.hive.cli.TestCliDriver.testCliDriver_vectorized_ptf org.apache.hadoop.hive.cli.TestCliDriver.testCliDriver_vectorized_shufflejoin org.apache.hadoop.hive.cli.TestCliDriver.testCliDriver_windowing org.apache.hadoop.hive.cli.TestCliDriver.testCliDriver_windowing_expressions org.apache.hadoop.hive.cli.TestMiniTezCliDriver.testCliDriver_auto_join1 org.apache.hadoop.hive.cli.TestMiniTezCliDriver.testCliDriver_bucket_map_join_tez1 org.apache.hadoop.hive.cli.TestMiniTezCliDriver.testCliDriver_bucket_map_join_tez2 org.apache.hadoop.hive.cli.TestMiniTezCliDriver.testCliDriver_cross_product_check_1 org.apache.hadoop.hive.cli.TestMiniTezCliDriver.testCliDriver_cross_product_check_2 org.apache.hadoop.hive.cli.TestMiniTezCliDriver.testCliDriver_filter_join_breaktask org.apache.hadoop.hive.cli.TestMiniTezCliDriver.testCliDriver_join1 org.apache.hadoop.hive.cli.TestMiniTezCliDriver.testCliDriver_mapjoin_decimal org.apache.hadoop.hive.cli.TestMiniTezCliDriver.testCliDriver_mrr org.apache.hadoop.hive.cli.TestMiniTezCliDriver.testCliDriver_ptf org.apache.hadoop.hive.cli.TestMiniTezCliDriver.testCliDriver_tez_join_hash org.apache.hadoop.hive.cli.TestMiniTezCliDriver.testCliDriver_tez_join_tests org.apache.hadoop.hive.cli.TestMiniTezCliDriver.testCliDriver_tez_joins_explain org.apache.hadoop.hive.cli.TestMiniTezCliDriver.testCliDriver_tez_union org.apache.hadoop.hive.cli.TestMiniTezCliDriver.testCliDriver_vectorized_ptf org.apache.hadoop.hive.cli.TestMinimrCliDriver.testCliDriver_bucketmapjoin7 org.apache.hadoop.hive.cli.TestMinimrCliDriver.testCliDriver_infer_bucket_sort_map_operators org.apache.hadoop.hive.cli.TestMinimrCliDriver.testCliDriver_join1 org.apache.hadoop.hive.cli.TestMinimrCliDriver.testCliDriver_ql_rewrite_gbtoidx org.apache.hadoop.hive.cli.TestNegativeCliDriver.testNegativeCliDriver_bucket_mapjoin_mismatch1 org.apache.hadoop.hive.cli.TestNegativeCliDriver.testNegativeCliDriver_sortmerge_mapjoin_mismatch_1 org.apache.hadoop.hive.cli.TestNegativeCliDriver.testNegativeCliDriver_udf_assert_true org.apache.hadoop.hive.cli.TestNegativeCliDriver.testNegativeCliDriver_udf_assert_true2 org.apache.hadoop.hive.ql.TestMTQueries.testMTQueries1 org.apache.hadoop.hive.ql.io.orc.TestInputOutputFormat.testInOutFormat org.apache.hadoop.hive.ql.io.orc.TestInputOutputFormat.testVectorizationWithAcid org.apache.hadoop.hive.ql.io.orc.TestOrcRawRecordMerger.testRecordReaderDelta org.apache.hadoop.hive.ql.io.orc.TestOrcRawRecordMerger.testRecordReaderIncompleteDelta org.apache.hadoop.hive.ql.io.orc.TestOrcRawRecordMerger.testRecordReaderNewBaseAndDelta org.apache.hadoop.hive.ql.io.orc.TestOrcRawRecordMerger.testRecordReaderOldBaseAndDelta org.apache.hadoop.hive.ql.parse.TestParse.testParse_case_sensitivity org.apache.hadoop.hive.ql.parse.TestParse.testParse_cast1 org.apache.hadoop.hive.ql.parse.TestParse.testParse_groupby1 org.apache.hadoop.hive.ql.parse.TestParse.testParse_groupby2 org.apache.hadoop.hive.ql.parse.TestParse.testParse_groupby3 org.apache.hadoop.hive.ql.parse.TestParse.testParse_groupby4 org.apache.hadoop.hive.ql.parse.TestParse.testParse_groupby5 org.apache.hadoop.hive.ql.parse.TestParse.testParse_groupby6 org.apache.hadoop.hive.ql.parse.TestParse.testParse_input1 org.apache.hadoop.hive.ql.parse.TestParse.testParse_input2 org.apache.hadoop.hive.ql.parse.TestParse.testParse_input20 org.apache.hadoop.hive.ql.parse.TestParse.testParse_input3 org.apache.hadoop.hive.ql.parse.TestParse.testParse_input4 org.apache.hadoop.hive.ql.parse.TestParse.testParse_input5 org.apache.hadoop.hive.ql.parse.TestParse.testParse_input6 org.apache.hadoop.hive.ql.parse.TestParse.testParse_input7 org.apache.hadoop.hive.ql.parse.TestParse.testParse_input8 org.apache.hadoop.hive.ql.parse.TestParse.testParse_input9 org.apache.hadoop.hive.ql.parse.TestParse.testParse_input_part1 org.apache.hadoop.hive.ql.parse.TestParse.testParse_input_testsequencefile org.apache.hadoop.hive.ql.parse.TestParse.testParse_input_testxpath org.apache.hadoop.hive.ql.parse.TestParse.testParse_input_testxpath2 org.apache.hadoop.hive.ql.parse.TestParse.testParse_join1 org.apache.hadoop.hive.ql.parse.TestParse.testParse_join2 org.apache.hadoop.hive.ql.parse.TestParse.testParse_join3 org.apache.hadoop.hive.ql.parse.TestParse.testParse_join4 org.apache.hadoop.hive.ql.parse.TestParse.testParse_join5 org.apache.hadoop.hive.ql.parse.TestParse.testParse_join6 org.apache.hadoop.hive.ql.parse.TestParse.testParse_join7 org.apache.hadoop.hive.ql.parse.TestParse.testParse_join8 org.apache.hadoop.hive.ql.parse.TestParse.testParse_sample1 org.apache.hadoop.hive.ql.parse.TestParse.testParse_sample2 org.apache.hadoop.hive.ql.parse.TestParse.testParse_sample3 org.apache.hadoop.hive.ql.parse.TestParse.testParse_sample4 org.apache.hadoop.hive.ql.parse.TestParse.testParse_sample5 org.apache.hadoop.hive.ql.parse.TestParse.testParse_sample6 org.apache.hadoop.hive.ql.parse.TestParse.testParse_sample7 org.apache.hadoop.hive.ql.parse.TestParse.testParse_subq org.apache.hadoop.hive.ql.parse.TestParse.testParse_udf1 org.apache.hadoop.hive.ql.parse.TestParse.testParse_udf4 org.apache.hadoop.hive.ql.parse.TestParse.testParse_udf6 org.apache.hadoop.hive.ql.parse.TestParse.testParse_udf_case org.apache.hadoop.hive.ql.parse.TestParse.testParse_udf_when org.apache.hadoop.hive.ql.parse.TestParse.testParse_union org.apache.hive.hcatalog.streaming.TestStreaming.testInterleavedTransactionBatchCommits org.apache.hive.hcatalog.streaming.TestStreaming.testMultipleTransactionBatchCommits org.apache.hive.hcatalog.streaming.TestStreaming.testTransactionBatchAbortAndCommit org.apache.hive.hcatalog.streaming.TestStreaming.testTransactionBatchCommit_Delimited org.apache.hive.hcatalog.streaming.TestStreaming.testTransactionBatchCommit_Json org.apache.hive.jdbc.miniHS2.TestHiveServer2.testConnection Test results: http://ec2-174-129-184-35.compute-1.amazonaws.com/jenkins/job/PreCommit-HIVE-TRUNK-Build/156/testReport Console output: http://ec2-174-129-184-35.compute-1.amazonaws.com/jenkins/job/PreCommit-HIVE-TRUNK-Build/156/console Test logs: http://ec2-174-129-184-35.compute-1.amazonaws.com/logs/PreCommit-HIVE-TRUNK-Build-156/ Messages: Executing org.apache.hive.ptest.execution.PrepPhase Executing org.apache.hive.ptest.execution.ExecutionPhase Executing org.apache.hive.ptest.execution.ReportingPhase Tests exited with: TestsFailedException: 277 tests failed This message is automatically generated. ATTACHMENT ID: 12659591
          Show
          Eugene Koifman added a comment - https://reviews.apache.org/r/24254/
          Hide
          Eugene Koifman added a comment -

          Bunch of failures here because the columns got renamed in the plan. The internal col names such as _col5 became _col6. Most of the failed test cases is in the join queries because adding VirtualColumns to LHS table renumbers the RHS columns.

          Show
          Eugene Koifman added a comment - Bunch of failures here because the columns got renamed in the plan. The internal col names such as _col5 became _col6. Most of the failed test cases is in the join queries because adding VirtualColumns to LHS table renumbers the RHS columns.
          Hide
          Eugene Koifman added a comment -

          fixed a couple of tests which are due to API changes and not related to column renumbering

          Show
          Eugene Koifman added a comment - fixed a couple of tests which are due to API changes and not related to column renumbering
          Hide
          Eugene Koifman added a comment -

          HIVE-7513.5.patch - fix a few more tests

          Show
          Eugene Koifman added a comment - HIVE-7513 .5.patch - fix a few more tests
          Hide
          Eugene Koifman added a comment -

          Navis, I'm not sure how it would work with SerDe. Arguably, if SerDe could cause creation of a VC in table metadata this could work very cleanly but I think this is beyond the scope of this ticket... unless you can think of a simple way to do that. As far as Hive is concerned this would just be a 'normal' column.

          Show
          Eugene Koifman added a comment - Navis , I'm not sure how it would work with SerDe. Arguably, if SerDe could cause creation of a VC in table metadata this could work very cleanly but I think this is beyond the scope of this ticket... unless you can think of a simple way to do that. As far as Hive is concerned this would just be a 'normal' column.
          Hide
          Hive QA added a comment -

          Overall: -1 at least one tests failed

          Here are the results of testing the latest attachment:
          https://issues.apache.org/jira/secure/attachment/12659752/HIVE-7513.5.patch

          ERROR: -1 due to 263 failed/errored test(s), 5849 tests executed
          Failed tests:

          org.apache.hadoop.hive.cli.TestCliDriver.testCliDriver_allcolref_in_udf
          org.apache.hadoop.hive.cli.TestCliDriver.testCliDriver_annotate_stats_join
          org.apache.hadoop.hive.cli.TestCliDriver.testCliDriver_auto_join1
          org.apache.hadoop.hive.cli.TestCliDriver.testCliDriver_auto_join14
          org.apache.hadoop.hive.cli.TestCliDriver.testCliDriver_auto_join15
          org.apache.hadoop.hive.cli.TestCliDriver.testCliDriver_auto_join17
          org.apache.hadoop.hive.cli.TestCliDriver.testCliDriver_auto_join19
          org.apache.hadoop.hive.cli.TestCliDriver.testCliDriver_auto_join2
          org.apache.hadoop.hive.cli.TestCliDriver.testCliDriver_auto_join20
          org.apache.hadoop.hive.cli.TestCliDriver.testCliDriver_auto_join21
          org.apache.hadoop.hive.cli.TestCliDriver.testCliDriver_auto_join22
          org.apache.hadoop.hive.cli.TestCliDriver.testCliDriver_auto_join23
          org.apache.hadoop.hive.cli.TestCliDriver.testCliDriver_auto_join28
          org.apache.hadoop.hive.cli.TestCliDriver.testCliDriver_auto_join29
          org.apache.hadoop.hive.cli.TestCliDriver.testCliDriver_auto_join3
          org.apache.hadoop.hive.cli.TestCliDriver.testCliDriver_auto_join32
          org.apache.hadoop.hive.cli.TestCliDriver.testCliDriver_auto_join9
          org.apache.hadoop.hive.cli.TestCliDriver.testCliDriver_auto_join_reordering_values
          org.apache.hadoop.hive.cli.TestCliDriver.testCliDriver_auto_smb_mapjoin_14
          org.apache.hadoop.hive.cli.TestCliDriver.testCliDriver_auto_sortmerge_join_13
          org.apache.hadoop.hive.cli.TestCliDriver.testCliDriver_bucketmapjoin1
          org.apache.hadoop.hive.cli.TestCliDriver.testCliDriver_bucketmapjoin2
          org.apache.hadoop.hive.cli.TestCliDriver.testCliDriver_bucketmapjoin3
          org.apache.hadoop.hive.cli.TestCliDriver.testCliDriver_bucketmapjoin4
          org.apache.hadoop.hive.cli.TestCliDriver.testCliDriver_bucketmapjoin5
          org.apache.hadoop.hive.cli.TestCliDriver.testCliDriver_bucketmapjoin_negative
          org.apache.hadoop.hive.cli.TestCliDriver.testCliDriver_bucketmapjoin_negative2
          org.apache.hadoop.hive.cli.TestCliDriver.testCliDriver_bucketmapjoin_negative3
          org.apache.hadoop.hive.cli.TestCliDriver.testCliDriver_bucketsortoptimize_insert_2
          org.apache.hadoop.hive.cli.TestCliDriver.testCliDriver_bucketsortoptimize_insert_4
          org.apache.hadoop.hive.cli.TestCliDriver.testCliDriver_bucketsortoptimize_insert_5
          org.apache.hadoop.hive.cli.TestCliDriver.testCliDriver_bucketsortoptimize_insert_6
          org.apache.hadoop.hive.cli.TestCliDriver.testCliDriver_bucketsortoptimize_insert_7
          org.apache.hadoop.hive.cli.TestCliDriver.testCliDriver_bucketsortoptimize_insert_8
          org.apache.hadoop.hive.cli.TestCliDriver.testCliDriver_cluster
          org.apache.hadoop.hive.cli.TestCliDriver.testCliDriver_column_access_stats
          org.apache.hadoop.hive.cli.TestCliDriver.testCliDriver_constprog2
          org.apache.hadoop.hive.cli.TestCliDriver.testCliDriver_correlationoptimizer1
          org.apache.hadoop.hive.cli.TestCliDriver.testCliDriver_correlationoptimizer4
          org.apache.hadoop.hive.cli.TestCliDriver.testCliDriver_correlationoptimizer5
          org.apache.hadoop.hive.cli.TestCliDriver.testCliDriver_correlationoptimizer6
          org.apache.hadoop.hive.cli.TestCliDriver.testCliDriver_cross_product_check_1
          org.apache.hadoop.hive.cli.TestCliDriver.testCliDriver_cross_product_check_2
          org.apache.hadoop.hive.cli.TestCliDriver.testCliDriver_explain_logical
          org.apache.hadoop.hive.cli.TestCliDriver.testCliDriver_filter_join_breaktask
          org.apache.hadoop.hive.cli.TestCliDriver.testCliDriver_index_auto_self_join
          org.apache.hadoop.hive.cli.TestCliDriver.testCliDriver_innerjoin
          org.apache.hadoop.hive.cli.TestCliDriver.testCliDriver_input23
          org.apache.hadoop.hive.cli.TestCliDriver.testCliDriver_join14
          org.apache.hadoop.hive.cli.TestCliDriver.testCliDriver_join15
          org.apache.hadoop.hive.cli.TestCliDriver.testCliDriver_join17
          org.apache.hadoop.hive.cli.TestCliDriver.testCliDriver_join2
          org.apache.hadoop.hive.cli.TestCliDriver.testCliDriver_join20
          org.apache.hadoop.hive.cli.TestCliDriver.testCliDriver_join21
          org.apache.hadoop.hive.cli.TestCliDriver.testCliDriver_join22
          org.apache.hadoop.hive.cli.TestCliDriver.testCliDriver_join23
          org.apache.hadoop.hive.cli.TestCliDriver.testCliDriver_join25
          org.apache.hadoop.hive.cli.TestCliDriver.testCliDriver_join26
          org.apache.hadoop.hive.cli.TestCliDriver.testCliDriver_join27
          org.apache.hadoop.hive.cli.TestCliDriver.testCliDriver_join3
          org.apache.hadoop.hive.cli.TestCliDriver.testCliDriver_join32
          org.apache.hadoop.hive.cli.TestCliDriver.testCliDriver_join32_lessSize
          org.apache.hadoop.hive.cli.TestCliDriver.testCliDriver_join33
          org.apache.hadoop.hive.cli.TestCliDriver.testCliDriver_join36
          org.apache.hadoop.hive.cli.TestCliDriver.testCliDriver_join37
          org.apache.hadoop.hive.cli.TestCliDriver.testCliDriver_join38
          org.apache.hadoop.hive.cli.TestCliDriver.testCliDriver_join39
          org.apache.hadoop.hive.cli.TestCliDriver.testCliDriver_join40
          org.apache.hadoop.hive.cli.TestCliDriver.testCliDriver_join41
          org.apache.hadoop.hive.cli.TestCliDriver.testCliDriver_join9
          org.apache.hadoop.hive.cli.TestCliDriver.testCliDriver_join_alt_syntax
          org.apache.hadoop.hive.cli.TestCliDriver.testCliDriver_join_cond_pushdown_1
          org.apache.hadoop.hive.cli.TestCliDriver.testCliDriver_join_cond_pushdown_2
          org.apache.hadoop.hive.cli.TestCliDriver.testCliDriver_join_cond_pushdown_3
          org.apache.hadoop.hive.cli.TestCliDriver.testCliDriver_join_cond_pushdown_4
          org.apache.hadoop.hive.cli.TestCliDriver.testCliDriver_join_cond_pushdown_unqual1
          org.apache.hadoop.hive.cli.TestCliDriver.testCliDriver_join_cond_pushdown_unqual2
          org.apache.hadoop.hive.cli.TestCliDriver.testCliDriver_join_cond_pushdown_unqual3
          org.apache.hadoop.hive.cli.TestCliDriver.testCliDriver_join_cond_pushdown_unqual4
          org.apache.hadoop.hive.cli.TestCliDriver.testCliDriver_join_filters_overlap
          org.apache.hadoop.hive.cli.TestCliDriver.testCliDriver_join_hive_626
          org.apache.hadoop.hive.cli.TestCliDriver.testCliDriver_join_map_ppr
          org.apache.hadoop.hive.cli.TestCliDriver.testCliDriver_join_merging
          org.apache.hadoop.hive.cli.TestCliDriver.testCliDriver_join_nullsafe
          org.apache.hadoop.hive.cli.TestCliDriver.testCliDriver_join_rc
          org.apache.hadoop.hive.cli.TestCliDriver.testCliDriver_join_reorder
          org.apache.hadoop.hive.cli.TestCliDriver.testCliDriver_join_reorder2
          org.apache.hadoop.hive.cli.TestCliDriver.testCliDriver_join_reorder3
          org.apache.hadoop.hive.cli.TestCliDriver.testCliDriver_join_reorder4
          org.apache.hadoop.hive.cli.TestCliDriver.testCliDriver_join_star
          org.apache.hadoop.hive.cli.TestCliDriver.testCliDriver_join_thrift
          org.apache.hadoop.hive.cli.TestCliDriver.testCliDriver_join_vc
          org.apache.hadoop.hive.cli.TestCliDriver.testCliDriver_join_view
          org.apache.hadoop.hive.cli.TestCliDriver.testCliDriver_lateral_view
          org.apache.hadoop.hive.cli.TestCliDriver.testCliDriver_lateral_view_cp
          org.apache.hadoop.hive.cli.TestCliDriver.testCliDriver_lateral_view_noalias
          org.apache.hadoop.hive.cli.TestCliDriver.testCliDriver_lateral_view_outer
          org.apache.hadoop.hive.cli.TestCliDriver.testCliDriver_lateral_view_ppd
          org.apache.hadoop.hive.cli.TestCliDriver.testCliDriver_limit_pushdown_negative
          org.apache.hadoop.hive.cli.TestCliDriver.testCliDriver_lineage1
          org.apache.hadoop.hive.cli.TestCliDriver.testCliDriver_louter_join_ppr
          org.apache.hadoop.hive.cli.TestCliDriver.testCliDriver_mapjoin1
          org.apache.hadoop.hive.cli.TestCliDriver.testCliDriver_mapjoin_filter_on_outerjoin
          org.apache.hadoop.hive.cli.TestCliDriver.testCliDriver_mapjoin_memcheck
          org.apache.hadoop.hive.cli.TestCliDriver.testCliDriver_mapjoin_subquery2
          org.apache.hadoop.hive.cli.TestCliDriver.testCliDriver_mapjoin_test_outer
          org.apache.hadoop.hive.cli.TestCliDriver.testCliDriver_mergejoins
          org.apache.hadoop.hive.cli.TestCliDriver.testCliDriver_mergejoins_mixed
          org.apache.hadoop.hive.cli.TestCliDriver.testCliDriver_multiMapJoin1
          org.apache.hadoop.hive.cli.TestCliDriver.testCliDriver_multi_insert_lateral_view
          org.apache.hadoop.hive.cli.TestCliDriver.testCliDriver_multi_join_union
          org.apache.hadoop.hive.cli.TestCliDriver.testCliDriver_no_hooks
          org.apache.hadoop.hive.cli.TestCliDriver.testCliDriver_nonmr_fetch
          org.apache.hadoop.hive.cli.TestCliDriver.testCliDriver_optional_outer
          org.apache.hadoop.hive.cli.TestCliDriver.testCliDriver_outer_join_ppr
          org.apache.hadoop.hive.cli.TestCliDriver.testCliDriver_pcr
          org.apache.hadoop.hive.cli.TestCliDriver.testCliDriver_ppd_join5
          org.apache.hadoop.hive.cli.TestCliDriver.testCliDriver_ppd_join_filter
          org.apache.hadoop.hive.cli.TestCliDriver.testCliDriver_ppd_outer_join1
          org.apache.hadoop.hive.cli.TestCliDriver.testCliDriver_ppd_outer_join2
          org.apache.hadoop.hive.cli.TestCliDriver.testCliDriver_ppd_outer_join3
          org.apache.hadoop.hive.cli.TestCliDriver.testCliDriver_ppd_outer_join4
          org.apache.hadoop.hive.cli.TestCliDriver.testCliDriver_ppd_outer_join5
          org.apache.hadoop.hive.cli.TestCliDriver.testCliDriver_ppd_repeated_alias
          org.apache.hadoop.hive.cli.TestCliDriver.testCliDriver_ppd_udf_case
          org.apache.hadoop.hive.cli.TestCliDriver.testCliDriver_ppd_union_view
          org.apache.hadoop.hive.cli.TestCliDriver.testCliDriver_ppd_vc
          org.apache.hadoop.hive.cli.TestCliDriver.testCliDriver_ptf
          org.apache.hadoop.hive.cli.TestCliDriver.testCliDriver_quotedid_skew
          org.apache.hadoop.hive.cli.TestCliDriver.testCliDriver_regex_col
          org.apache.hadoop.hive.cli.TestCliDriver.testCliDriver_router_join_ppr
          org.apache.hadoop.hive.cli.TestCliDriver.testCliDriver_sample8
          org.apache.hadoop.hive.cli.TestCliDriver.testCliDriver_semijoin
          org.apache.hadoop.hive.cli.TestCliDriver.testCliDriver_skewjoin
          org.apache.hadoop.hive.cli.TestCliDriver.testCliDriver_skewjoin_union_remove_1
          org.apache.hadoop.hive.cli.TestCliDriver.testCliDriver_skewjoin_union_remove_2
          org.apache.hadoop.hive.cli.TestCliDriver.testCliDriver_skewjoinopt1
          org.apache.hadoop.hive.cli.TestCliDriver.testCliDriver_skewjoinopt10
          org.apache.hadoop.hive.cli.TestCliDriver.testCliDriver_skewjoinopt11
          org.apache.hadoop.hive.cli.TestCliDriver.testCliDriver_skewjoinopt12
          org.apache.hadoop.hive.cli.TestCliDriver.testCliDriver_skewjoinopt13
          org.apache.hadoop.hive.cli.TestCliDriver.testCliDriver_skewjoinopt14
          org.apache.hadoop.hive.cli.TestCliDriver.testCliDriver_skewjoinopt15
          org.apache.hadoop.hive.cli.TestCliDriver.testCliDriver_skewjoinopt16
          org.apache.hadoop.hive.cli.TestCliDriver.testCliDriver_skewjoinopt17
          org.apache.hadoop.hive.cli.TestCliDriver.testCliDriver_skewjoinopt18
          org.apache.hadoop.hive.cli.TestCliDriver.testCliDriver_skewjoinopt19
          org.apache.hadoop.hive.cli.TestCliDriver.testCliDriver_skewjoinopt2
          org.apache.hadoop.hive.cli.TestCliDriver.testCliDriver_skewjoinopt20
          org.apache.hadoop.hive.cli.TestCliDriver.testCliDriver_skewjoinopt3
          org.apache.hadoop.hive.cli.TestCliDriver.testCliDriver_skewjoinopt4
          org.apache.hadoop.hive.cli.TestCliDriver.testCliDriver_skewjoinopt5
          org.apache.hadoop.hive.cli.TestCliDriver.testCliDriver_skewjoinopt6
          org.apache.hadoop.hive.cli.TestCliDriver.testCliDriver_skewjoinopt7
          org.apache.hadoop.hive.cli.TestCliDriver.testCliDriver_skewjoinopt8
          org.apache.hadoop.hive.cli.TestCliDriver.testCliDriver_smb_mapjoin9
          org.apache.hadoop.hive.cli.TestCliDriver.testCliDriver_smb_mapjoin_1
          org.apache.hadoop.hive.cli.TestCliDriver.testCliDriver_smb_mapjoin_10
          org.apache.hadoop.hive.cli.TestCliDriver.testCliDriver_smb_mapjoin_11
          org.apache.hadoop.hive.cli.TestCliDriver.testCliDriver_smb_mapjoin_12
          org.apache.hadoop.hive.cli.TestCliDriver.testCliDriver_smb_mapjoin_13
          org.apache.hadoop.hive.cli.TestCliDriver.testCliDriver_smb_mapjoin_15
          org.apache.hadoop.hive.cli.TestCliDriver.testCliDriver_smb_mapjoin_2
          org.apache.hadoop.hive.cli.TestCliDriver.testCliDriver_smb_mapjoin_3
          org.apache.hadoop.hive.cli.TestCliDriver.testCliDriver_smb_mapjoin_4
          org.apache.hadoop.hive.cli.TestCliDriver.testCliDriver_smb_mapjoin_5
          org.apache.hadoop.hive.cli.TestCliDriver.testCliDriver_smb_mapjoin_6
          org.apache.hadoop.hive.cli.TestCliDriver.testCliDriver_smb_mapjoin_7
          org.apache.hadoop.hive.cli.TestCliDriver.testCliDriver_stats11
          org.apache.hadoop.hive.cli.TestCliDriver.testCliDriver_subquery_multiinsert
          org.apache.hadoop.hive.cli.TestCliDriver.testCliDriver_subquery_notexists
          org.apache.hadoop.hive.cli.TestCliDriver.testCliDriver_subquery_notin
          org.apache.hadoop.hive.cli.TestCliDriver.testCliDriver_subquery_unqualcolumnrefs
          org.apache.hadoop.hive.cli.TestCliDriver.testCliDriver_subquery_views
          org.apache.hadoop.hive.cli.TestCliDriver.testCliDriver_temp_table_join1
          org.apache.hadoop.hive.cli.TestCliDriver.testCliDriver_temp_table_windowing_expressions
          org.apache.hadoop.hive.cli.TestCliDriver.testCliDriver_udtf_json_tuple
          org.apache.hadoop.hive.cli.TestCliDriver.testCliDriver_udtf_parse_url_tuple
          org.apache.hadoop.hive.cli.TestCliDriver.testCliDriver_udtf_stack
          org.apache.hadoop.hive.cli.TestCliDriver.testCliDriver_union22
          org.apache.hadoop.hive.cli.TestCliDriver.testCliDriver_union24
          org.apache.hadoop.hive.cli.TestCliDriver.testCliDriver_union26
          org.apache.hadoop.hive.cli.TestCliDriver.testCliDriver_union27
          org.apache.hadoop.hive.cli.TestCliDriver.testCliDriver_union32
          org.apache.hadoop.hive.cli.TestCliDriver.testCliDriver_union_remove_12
          org.apache.hadoop.hive.cli.TestCliDriver.testCliDriver_union_remove_13
          org.apache.hadoop.hive.cli.TestCliDriver.testCliDriver_union_remove_14
          org.apache.hadoop.hive.cli.TestCliDriver.testCliDriver_union_top_level
          org.apache.hadoop.hive.cli.TestCliDriver.testCliDriver_vector_decimal_mapjoin
          org.apache.hadoop.hive.cli.TestCliDriver.testCliDriver_vectorized_bucketmapjoin1
          org.apache.hadoop.hive.cli.TestCliDriver.testCliDriver_vectorized_context
          org.apache.hadoop.hive.cli.TestCliDriver.testCliDriver_vectorized_mapjoin
          org.apache.hadoop.hive.cli.TestCliDriver.testCliDriver_vectorized_nested_mapjoin
          org.apache.hadoop.hive.cli.TestCliDriver.testCliDriver_vectorized_ptf
          org.apache.hadoop.hive.cli.TestCliDriver.testCliDriver_vectorized_shufflejoin
          org.apache.hadoop.hive.cli.TestCliDriver.testCliDriver_windowing
          org.apache.hadoop.hive.cli.TestCliDriver.testCliDriver_windowing_expressions
          org.apache.hadoop.hive.cli.TestMiniTezCliDriver.testCliDriver_auto_join1
          org.apache.hadoop.hive.cli.TestMiniTezCliDriver.testCliDriver_bucket_map_join_tez2
          org.apache.hadoop.hive.cli.TestMiniTezCliDriver.testCliDriver_cross_product_check_1
          org.apache.hadoop.hive.cli.TestMiniTezCliDriver.testCliDriver_cross_product_check_2
          org.apache.hadoop.hive.cli.TestMiniTezCliDriver.testCliDriver_filter_join_breaktask
          org.apache.hadoop.hive.cli.TestMiniTezCliDriver.testCliDriver_mapjoin_decimal
          org.apache.hadoop.hive.cli.TestMiniTezCliDriver.testCliDriver_mrr
          org.apache.hadoop.hive.cli.TestMiniTezCliDriver.testCliDriver_ptf
          org.apache.hadoop.hive.cli.TestMiniTezCliDriver.testCliDriver_tez_join_hash
          org.apache.hadoop.hive.cli.TestMiniTezCliDriver.testCliDriver_tez_join_tests
          org.apache.hadoop.hive.cli.TestMiniTezCliDriver.testCliDriver_tez_union
          org.apache.hadoop.hive.cli.TestMiniTezCliDriver.testCliDriver_vectorized_ptf
          org.apache.hadoop.hive.cli.TestMinimrCliDriver.testCliDriver_bucketmapjoin7
          org.apache.hadoop.hive.cli.TestMinimrCliDriver.testCliDriver_infer_bucket_sort_map_operators
          org.apache.hadoop.hive.cli.TestMinimrCliDriver.testCliDriver_join1
          org.apache.hadoop.hive.cli.TestMinimrCliDriver.testCliDriver_ql_rewrite_gbtoidx
          org.apache.hadoop.hive.cli.TestNegativeCliDriver.testNegativeCliDriver_bucket_mapjoin_mismatch1
          org.apache.hadoop.hive.cli.TestNegativeCliDriver.testNegativeCliDriver_sortmerge_mapjoin_mismatch_1
          org.apache.hadoop.hive.cli.TestNegativeCliDriver.testNegativeCliDriver_udf_assert_true
          org.apache.hadoop.hive.cli.TestNegativeCliDriver.testNegativeCliDriver_udf_assert_true2
          org.apache.hadoop.hive.ql.TestDDLWithRemoteMetastoreSecondNamenode.testCreateTableWithIndexAndPartitionsNonDefaultNameNode
          org.apache.hadoop.hive.ql.TestMTQueries.testMTQueries1
          org.apache.hadoop.hive.ql.parse.TestParse.testParse_case_sensitivity
          org.apache.hadoop.hive.ql.parse.TestParse.testParse_cast1
          org.apache.hadoop.hive.ql.parse.TestParse.testParse_groupby1
          org.apache.hadoop.hive.ql.parse.TestParse.testParse_groupby2
          org.apache.hadoop.hive.ql.parse.TestParse.testParse_groupby3
          org.apache.hadoop.hive.ql.parse.TestParse.testParse_groupby4
          org.apache.hadoop.hive.ql.parse.TestParse.testParse_groupby5
          org.apache.hadoop.hive.ql.parse.TestParse.testParse_groupby6
          org.apache.hadoop.hive.ql.parse.TestParse.testParse_input1
          org.apache.hadoop.hive.ql.parse.TestParse.testParse_input2
          org.apache.hadoop.hive.ql.parse.TestParse.testParse_input20
          org.apache.hadoop.hive.ql.parse.TestParse.testParse_input3
          org.apache.hadoop.hive.ql.parse.TestParse.testParse_input4
          org.apache.hadoop.hive.ql.parse.TestParse.testParse_input5
          org.apache.hadoop.hive.ql.parse.TestParse.testParse_input6
          org.apache.hadoop.hive.ql.parse.TestParse.testParse_input7
          org.apache.hadoop.hive.ql.parse.TestParse.testParse_input8
          org.apache.hadoop.hive.ql.parse.TestParse.testParse_input9
          org.apache.hadoop.hive.ql.parse.TestParse.testParse_input_part1
          org.apache.hadoop.hive.ql.parse.TestParse.testParse_input_testsequencefile
          org.apache.hadoop.hive.ql.parse.TestParse.testParse_input_testxpath
          org.apache.hadoop.hive.ql.parse.TestParse.testParse_input_testxpath2
          org.apache.hadoop.hive.ql.parse.TestParse.testParse_join1
          org.apache.hadoop.hive.ql.parse.TestParse.testParse_join2
          org.apache.hadoop.hive.ql.parse.TestParse.testParse_join3
          org.apache.hadoop.hive.ql.parse.TestParse.testParse_join4
          org.apache.hadoop.hive.ql.parse.TestParse.testParse_join5
          org.apache.hadoop.hive.ql.parse.TestParse.testParse_join6
          org.apache.hadoop.hive.ql.parse.TestParse.testParse_join7
          org.apache.hadoop.hive.ql.parse.TestParse.testParse_join8
          org.apache.hadoop.hive.ql.parse.TestParse.testParse_sample1
          org.apache.hadoop.hive.ql.parse.TestParse.testParse_sample2
          org.apache.hadoop.hive.ql.parse.TestParse.testParse_sample3
          org.apache.hadoop.hive.ql.parse.TestParse.testParse_sample4
          org.apache.hadoop.hive.ql.parse.TestParse.testParse_sample5
          org.apache.hadoop.hive.ql.parse.TestParse.testParse_sample6
          org.apache.hadoop.hive.ql.parse.TestParse.testParse_sample7
          org.apache.hadoop.hive.ql.parse.TestParse.testParse_subq
          org.apache.hadoop.hive.ql.parse.TestParse.testParse_udf1
          org.apache.hadoop.hive.ql.parse.TestParse.testParse_udf4
          org.apache.hadoop.hive.ql.parse.TestParse.testParse_udf6
          org.apache.hadoop.hive.ql.parse.TestParse.testParse_udf_case
          org.apache.hadoop.hive.ql.parse.TestParse.testParse_udf_when
          org.apache.hadoop.hive.ql.parse.TestParse.testParse_union
          

          Test results: http://ec2-174-129-184-35.compute-1.amazonaws.com/jenkins/job/PreCommit-HIVE-TRUNK-Build/173/testReport
          Console output: http://ec2-174-129-184-35.compute-1.amazonaws.com/jenkins/job/PreCommit-HIVE-TRUNK-Build/173/console
          Test logs: http://ec2-174-129-184-35.compute-1.amazonaws.com/logs/PreCommit-HIVE-TRUNK-Build-173/

          Messages:

          Executing org.apache.hive.ptest.execution.PrepPhase
          Executing org.apache.hive.ptest.execution.ExecutionPhase
          Executing org.apache.hive.ptest.execution.ReportingPhase
          Tests exited with: TestsFailedException: 263 tests failed
          

          This message is automatically generated.

          ATTACHMENT ID: 12659752

          Show
          Hive QA added a comment - Overall : -1 at least one tests failed Here are the results of testing the latest attachment: https://issues.apache.org/jira/secure/attachment/12659752/HIVE-7513.5.patch ERROR: -1 due to 263 failed/errored test(s), 5849 tests executed Failed tests: org.apache.hadoop.hive.cli.TestCliDriver.testCliDriver_allcolref_in_udf org.apache.hadoop.hive.cli.TestCliDriver.testCliDriver_annotate_stats_join org.apache.hadoop.hive.cli.TestCliDriver.testCliDriver_auto_join1 org.apache.hadoop.hive.cli.TestCliDriver.testCliDriver_auto_join14 org.apache.hadoop.hive.cli.TestCliDriver.testCliDriver_auto_join15 org.apache.hadoop.hive.cli.TestCliDriver.testCliDriver_auto_join17 org.apache.hadoop.hive.cli.TestCliDriver.testCliDriver_auto_join19 org.apache.hadoop.hive.cli.TestCliDriver.testCliDriver_auto_join2 org.apache.hadoop.hive.cli.TestCliDriver.testCliDriver_auto_join20 org.apache.hadoop.hive.cli.TestCliDriver.testCliDriver_auto_join21 org.apache.hadoop.hive.cli.TestCliDriver.testCliDriver_auto_join22 org.apache.hadoop.hive.cli.TestCliDriver.testCliDriver_auto_join23 org.apache.hadoop.hive.cli.TestCliDriver.testCliDriver_auto_join28 org.apache.hadoop.hive.cli.TestCliDriver.testCliDriver_auto_join29 org.apache.hadoop.hive.cli.TestCliDriver.testCliDriver_auto_join3 org.apache.hadoop.hive.cli.TestCliDriver.testCliDriver_auto_join32 org.apache.hadoop.hive.cli.TestCliDriver.testCliDriver_auto_join9 org.apache.hadoop.hive.cli.TestCliDriver.testCliDriver_auto_join_reordering_values org.apache.hadoop.hive.cli.TestCliDriver.testCliDriver_auto_smb_mapjoin_14 org.apache.hadoop.hive.cli.TestCliDriver.testCliDriver_auto_sortmerge_join_13 org.apache.hadoop.hive.cli.TestCliDriver.testCliDriver_bucketmapjoin1 org.apache.hadoop.hive.cli.TestCliDriver.testCliDriver_bucketmapjoin2 org.apache.hadoop.hive.cli.TestCliDriver.testCliDriver_bucketmapjoin3 org.apache.hadoop.hive.cli.TestCliDriver.testCliDriver_bucketmapjoin4 org.apache.hadoop.hive.cli.TestCliDriver.testCliDriver_bucketmapjoin5 org.apache.hadoop.hive.cli.TestCliDriver.testCliDriver_bucketmapjoin_negative org.apache.hadoop.hive.cli.TestCliDriver.testCliDriver_bucketmapjoin_negative2 org.apache.hadoop.hive.cli.TestCliDriver.testCliDriver_bucketmapjoin_negative3 org.apache.hadoop.hive.cli.TestCliDriver.testCliDriver_bucketsortoptimize_insert_2 org.apache.hadoop.hive.cli.TestCliDriver.testCliDriver_bucketsortoptimize_insert_4 org.apache.hadoop.hive.cli.TestCliDriver.testCliDriver_bucketsortoptimize_insert_5 org.apache.hadoop.hive.cli.TestCliDriver.testCliDriver_bucketsortoptimize_insert_6 org.apache.hadoop.hive.cli.TestCliDriver.testCliDriver_bucketsortoptimize_insert_7 org.apache.hadoop.hive.cli.TestCliDriver.testCliDriver_bucketsortoptimize_insert_8 org.apache.hadoop.hive.cli.TestCliDriver.testCliDriver_cluster org.apache.hadoop.hive.cli.TestCliDriver.testCliDriver_column_access_stats org.apache.hadoop.hive.cli.TestCliDriver.testCliDriver_constprog2 org.apache.hadoop.hive.cli.TestCliDriver.testCliDriver_correlationoptimizer1 org.apache.hadoop.hive.cli.TestCliDriver.testCliDriver_correlationoptimizer4 org.apache.hadoop.hive.cli.TestCliDriver.testCliDriver_correlationoptimizer5 org.apache.hadoop.hive.cli.TestCliDriver.testCliDriver_correlationoptimizer6 org.apache.hadoop.hive.cli.TestCliDriver.testCliDriver_cross_product_check_1 org.apache.hadoop.hive.cli.TestCliDriver.testCliDriver_cross_product_check_2 org.apache.hadoop.hive.cli.TestCliDriver.testCliDriver_explain_logical org.apache.hadoop.hive.cli.TestCliDriver.testCliDriver_filter_join_breaktask org.apache.hadoop.hive.cli.TestCliDriver.testCliDriver_index_auto_self_join org.apache.hadoop.hive.cli.TestCliDriver.testCliDriver_innerjoin org.apache.hadoop.hive.cli.TestCliDriver.testCliDriver_input23 org.apache.hadoop.hive.cli.TestCliDriver.testCliDriver_join14 org.apache.hadoop.hive.cli.TestCliDriver.testCliDriver_join15 org.apache.hadoop.hive.cli.TestCliDriver.testCliDriver_join17 org.apache.hadoop.hive.cli.TestCliDriver.testCliDriver_join2 org.apache.hadoop.hive.cli.TestCliDriver.testCliDriver_join20 org.apache.hadoop.hive.cli.TestCliDriver.testCliDriver_join21 org.apache.hadoop.hive.cli.TestCliDriver.testCliDriver_join22 org.apache.hadoop.hive.cli.TestCliDriver.testCliDriver_join23 org.apache.hadoop.hive.cli.TestCliDriver.testCliDriver_join25 org.apache.hadoop.hive.cli.TestCliDriver.testCliDriver_join26 org.apache.hadoop.hive.cli.TestCliDriver.testCliDriver_join27 org.apache.hadoop.hive.cli.TestCliDriver.testCliDriver_join3 org.apache.hadoop.hive.cli.TestCliDriver.testCliDriver_join32 org.apache.hadoop.hive.cli.TestCliDriver.testCliDriver_join32_lessSize org.apache.hadoop.hive.cli.TestCliDriver.testCliDriver_join33 org.apache.hadoop.hive.cli.TestCliDriver.testCliDriver_join36 org.apache.hadoop.hive.cli.TestCliDriver.testCliDriver_join37 org.apache.hadoop.hive.cli.TestCliDriver.testCliDriver_join38 org.apache.hadoop.hive.cli.TestCliDriver.testCliDriver_join39 org.apache.hadoop.hive.cli.TestCliDriver.testCliDriver_join40 org.apache.hadoop.hive.cli.TestCliDriver.testCliDriver_join41 org.apache.hadoop.hive.cli.TestCliDriver.testCliDriver_join9 org.apache.hadoop.hive.cli.TestCliDriver.testCliDriver_join_alt_syntax org.apache.hadoop.hive.cli.TestCliDriver.testCliDriver_join_cond_pushdown_1 org.apache.hadoop.hive.cli.TestCliDriver.testCliDriver_join_cond_pushdown_2 org.apache.hadoop.hive.cli.TestCliDriver.testCliDriver_join_cond_pushdown_3 org.apache.hadoop.hive.cli.TestCliDriver.testCliDriver_join_cond_pushdown_4 org.apache.hadoop.hive.cli.TestCliDriver.testCliDriver_join_cond_pushdown_unqual1 org.apache.hadoop.hive.cli.TestCliDriver.testCliDriver_join_cond_pushdown_unqual2 org.apache.hadoop.hive.cli.TestCliDriver.testCliDriver_join_cond_pushdown_unqual3 org.apache.hadoop.hive.cli.TestCliDriver.testCliDriver_join_cond_pushdown_unqual4 org.apache.hadoop.hive.cli.TestCliDriver.testCliDriver_join_filters_overlap org.apache.hadoop.hive.cli.TestCliDriver.testCliDriver_join_hive_626 org.apache.hadoop.hive.cli.TestCliDriver.testCliDriver_join_map_ppr org.apache.hadoop.hive.cli.TestCliDriver.testCliDriver_join_merging org.apache.hadoop.hive.cli.TestCliDriver.testCliDriver_join_nullsafe org.apache.hadoop.hive.cli.TestCliDriver.testCliDriver_join_rc org.apache.hadoop.hive.cli.TestCliDriver.testCliDriver_join_reorder org.apache.hadoop.hive.cli.TestCliDriver.testCliDriver_join_reorder2 org.apache.hadoop.hive.cli.TestCliDriver.testCliDriver_join_reorder3 org.apache.hadoop.hive.cli.TestCliDriver.testCliDriver_join_reorder4 org.apache.hadoop.hive.cli.TestCliDriver.testCliDriver_join_star org.apache.hadoop.hive.cli.TestCliDriver.testCliDriver_join_thrift org.apache.hadoop.hive.cli.TestCliDriver.testCliDriver_join_vc org.apache.hadoop.hive.cli.TestCliDriver.testCliDriver_join_view org.apache.hadoop.hive.cli.TestCliDriver.testCliDriver_lateral_view org.apache.hadoop.hive.cli.TestCliDriver.testCliDriver_lateral_view_cp org.apache.hadoop.hive.cli.TestCliDriver.testCliDriver_lateral_view_noalias org.apache.hadoop.hive.cli.TestCliDriver.testCliDriver_lateral_view_outer org.apache.hadoop.hive.cli.TestCliDriver.testCliDriver_lateral_view_ppd org.apache.hadoop.hive.cli.TestCliDriver.testCliDriver_limit_pushdown_negative org.apache.hadoop.hive.cli.TestCliDriver.testCliDriver_lineage1 org.apache.hadoop.hive.cli.TestCliDriver.testCliDriver_louter_join_ppr org.apache.hadoop.hive.cli.TestCliDriver.testCliDriver_mapjoin1 org.apache.hadoop.hive.cli.TestCliDriver.testCliDriver_mapjoin_filter_on_outerjoin org.apache.hadoop.hive.cli.TestCliDriver.testCliDriver_mapjoin_memcheck org.apache.hadoop.hive.cli.TestCliDriver.testCliDriver_mapjoin_subquery2 org.apache.hadoop.hive.cli.TestCliDriver.testCliDriver_mapjoin_test_outer org.apache.hadoop.hive.cli.TestCliDriver.testCliDriver_mergejoins org.apache.hadoop.hive.cli.TestCliDriver.testCliDriver_mergejoins_mixed org.apache.hadoop.hive.cli.TestCliDriver.testCliDriver_multiMapJoin1 org.apache.hadoop.hive.cli.TestCliDriver.testCliDriver_multi_insert_lateral_view org.apache.hadoop.hive.cli.TestCliDriver.testCliDriver_multi_join_union org.apache.hadoop.hive.cli.TestCliDriver.testCliDriver_no_hooks org.apache.hadoop.hive.cli.TestCliDriver.testCliDriver_nonmr_fetch org.apache.hadoop.hive.cli.TestCliDriver.testCliDriver_optional_outer org.apache.hadoop.hive.cli.TestCliDriver.testCliDriver_outer_join_ppr org.apache.hadoop.hive.cli.TestCliDriver.testCliDriver_pcr org.apache.hadoop.hive.cli.TestCliDriver.testCliDriver_ppd_join5 org.apache.hadoop.hive.cli.TestCliDriver.testCliDriver_ppd_join_filter org.apache.hadoop.hive.cli.TestCliDriver.testCliDriver_ppd_outer_join1 org.apache.hadoop.hive.cli.TestCliDriver.testCliDriver_ppd_outer_join2 org.apache.hadoop.hive.cli.TestCliDriver.testCliDriver_ppd_outer_join3 org.apache.hadoop.hive.cli.TestCliDriver.testCliDriver_ppd_outer_join4 org.apache.hadoop.hive.cli.TestCliDriver.testCliDriver_ppd_outer_join5 org.apache.hadoop.hive.cli.TestCliDriver.testCliDriver_ppd_repeated_alias org.apache.hadoop.hive.cli.TestCliDriver.testCliDriver_ppd_udf_case org.apache.hadoop.hive.cli.TestCliDriver.testCliDriver_ppd_union_view org.apache.hadoop.hive.cli.TestCliDriver.testCliDriver_ppd_vc org.apache.hadoop.hive.cli.TestCliDriver.testCliDriver_ptf org.apache.hadoop.hive.cli.TestCliDriver.testCliDriver_quotedid_skew org.apache.hadoop.hive.cli.TestCliDriver.testCliDriver_regex_col org.apache.hadoop.hive.cli.TestCliDriver.testCliDriver_router_join_ppr org.apache.hadoop.hive.cli.TestCliDriver.testCliDriver_sample8 org.apache.hadoop.hive.cli.TestCliDriver.testCliDriver_semijoin org.apache.hadoop.hive.cli.TestCliDriver.testCliDriver_skewjoin org.apache.hadoop.hive.cli.TestCliDriver.testCliDriver_skewjoin_union_remove_1 org.apache.hadoop.hive.cli.TestCliDriver.testCliDriver_skewjoin_union_remove_2 org.apache.hadoop.hive.cli.TestCliDriver.testCliDriver_skewjoinopt1 org.apache.hadoop.hive.cli.TestCliDriver.testCliDriver_skewjoinopt10 org.apache.hadoop.hive.cli.TestCliDriver.testCliDriver_skewjoinopt11 org.apache.hadoop.hive.cli.TestCliDriver.testCliDriver_skewjoinopt12 org.apache.hadoop.hive.cli.TestCliDriver.testCliDriver_skewjoinopt13 org.apache.hadoop.hive.cli.TestCliDriver.testCliDriver_skewjoinopt14 org.apache.hadoop.hive.cli.TestCliDriver.testCliDriver_skewjoinopt15 org.apache.hadoop.hive.cli.TestCliDriver.testCliDriver_skewjoinopt16 org.apache.hadoop.hive.cli.TestCliDriver.testCliDriver_skewjoinopt17 org.apache.hadoop.hive.cli.TestCliDriver.testCliDriver_skewjoinopt18 org.apache.hadoop.hive.cli.TestCliDriver.testCliDriver_skewjoinopt19 org.apache.hadoop.hive.cli.TestCliDriver.testCliDriver_skewjoinopt2 org.apache.hadoop.hive.cli.TestCliDriver.testCliDriver_skewjoinopt20 org.apache.hadoop.hive.cli.TestCliDriver.testCliDriver_skewjoinopt3 org.apache.hadoop.hive.cli.TestCliDriver.testCliDriver_skewjoinopt4 org.apache.hadoop.hive.cli.TestCliDriver.testCliDriver_skewjoinopt5 org.apache.hadoop.hive.cli.TestCliDriver.testCliDriver_skewjoinopt6 org.apache.hadoop.hive.cli.TestCliDriver.testCliDriver_skewjoinopt7 org.apache.hadoop.hive.cli.TestCliDriver.testCliDriver_skewjoinopt8 org.apache.hadoop.hive.cli.TestCliDriver.testCliDriver_smb_mapjoin9 org.apache.hadoop.hive.cli.TestCliDriver.testCliDriver_smb_mapjoin_1 org.apache.hadoop.hive.cli.TestCliDriver.testCliDriver_smb_mapjoin_10 org.apache.hadoop.hive.cli.TestCliDriver.testCliDriver_smb_mapjoin_11 org.apache.hadoop.hive.cli.TestCliDriver.testCliDriver_smb_mapjoin_12 org.apache.hadoop.hive.cli.TestCliDriver.testCliDriver_smb_mapjoin_13 org.apache.hadoop.hive.cli.TestCliDriver.testCliDriver_smb_mapjoin_15 org.apache.hadoop.hive.cli.TestCliDriver.testCliDriver_smb_mapjoin_2 org.apache.hadoop.hive.cli.TestCliDriver.testCliDriver_smb_mapjoin_3 org.apache.hadoop.hive.cli.TestCliDriver.testCliDriver_smb_mapjoin_4 org.apache.hadoop.hive.cli.TestCliDriver.testCliDriver_smb_mapjoin_5 org.apache.hadoop.hive.cli.TestCliDriver.testCliDriver_smb_mapjoin_6 org.apache.hadoop.hive.cli.TestCliDriver.testCliDriver_smb_mapjoin_7 org.apache.hadoop.hive.cli.TestCliDriver.testCliDriver_stats11 org.apache.hadoop.hive.cli.TestCliDriver.testCliDriver_subquery_multiinsert org.apache.hadoop.hive.cli.TestCliDriver.testCliDriver_subquery_notexists org.apache.hadoop.hive.cli.TestCliDriver.testCliDriver_subquery_notin org.apache.hadoop.hive.cli.TestCliDriver.testCliDriver_subquery_unqualcolumnrefs org.apache.hadoop.hive.cli.TestCliDriver.testCliDriver_subquery_views org.apache.hadoop.hive.cli.TestCliDriver.testCliDriver_temp_table_join1 org.apache.hadoop.hive.cli.TestCliDriver.testCliDriver_temp_table_windowing_expressions org.apache.hadoop.hive.cli.TestCliDriver.testCliDriver_udtf_json_tuple org.apache.hadoop.hive.cli.TestCliDriver.testCliDriver_udtf_parse_url_tuple org.apache.hadoop.hive.cli.TestCliDriver.testCliDriver_udtf_stack org.apache.hadoop.hive.cli.TestCliDriver.testCliDriver_union22 org.apache.hadoop.hive.cli.TestCliDriver.testCliDriver_union24 org.apache.hadoop.hive.cli.TestCliDriver.testCliDriver_union26 org.apache.hadoop.hive.cli.TestCliDriver.testCliDriver_union27 org.apache.hadoop.hive.cli.TestCliDriver.testCliDriver_union32 org.apache.hadoop.hive.cli.TestCliDriver.testCliDriver_union_remove_12 org.apache.hadoop.hive.cli.TestCliDriver.testCliDriver_union_remove_13 org.apache.hadoop.hive.cli.TestCliDriver.testCliDriver_union_remove_14 org.apache.hadoop.hive.cli.TestCliDriver.testCliDriver_union_top_level org.apache.hadoop.hive.cli.TestCliDriver.testCliDriver_vector_decimal_mapjoin org.apache.hadoop.hive.cli.TestCliDriver.testCliDriver_vectorized_bucketmapjoin1 org.apache.hadoop.hive.cli.TestCliDriver.testCliDriver_vectorized_context org.apache.hadoop.hive.cli.TestCliDriver.testCliDriver_vectorized_mapjoin org.apache.hadoop.hive.cli.TestCliDriver.testCliDriver_vectorized_nested_mapjoin org.apache.hadoop.hive.cli.TestCliDriver.testCliDriver_vectorized_ptf org.apache.hadoop.hive.cli.TestCliDriver.testCliDriver_vectorized_shufflejoin org.apache.hadoop.hive.cli.TestCliDriver.testCliDriver_windowing org.apache.hadoop.hive.cli.TestCliDriver.testCliDriver_windowing_expressions org.apache.hadoop.hive.cli.TestMiniTezCliDriver.testCliDriver_auto_join1 org.apache.hadoop.hive.cli.TestMiniTezCliDriver.testCliDriver_bucket_map_join_tez2 org.apache.hadoop.hive.cli.TestMiniTezCliDriver.testCliDriver_cross_product_check_1 org.apache.hadoop.hive.cli.TestMiniTezCliDriver.testCliDriver_cross_product_check_2 org.apache.hadoop.hive.cli.TestMiniTezCliDriver.testCliDriver_filter_join_breaktask org.apache.hadoop.hive.cli.TestMiniTezCliDriver.testCliDriver_mapjoin_decimal org.apache.hadoop.hive.cli.TestMiniTezCliDriver.testCliDriver_mrr org.apache.hadoop.hive.cli.TestMiniTezCliDriver.testCliDriver_ptf org.apache.hadoop.hive.cli.TestMiniTezCliDriver.testCliDriver_tez_join_hash org.apache.hadoop.hive.cli.TestMiniTezCliDriver.testCliDriver_tez_join_tests org.apache.hadoop.hive.cli.TestMiniTezCliDriver.testCliDriver_tez_union org.apache.hadoop.hive.cli.TestMiniTezCliDriver.testCliDriver_vectorized_ptf org.apache.hadoop.hive.cli.TestMinimrCliDriver.testCliDriver_bucketmapjoin7 org.apache.hadoop.hive.cli.TestMinimrCliDriver.testCliDriver_infer_bucket_sort_map_operators org.apache.hadoop.hive.cli.TestMinimrCliDriver.testCliDriver_join1 org.apache.hadoop.hive.cli.TestMinimrCliDriver.testCliDriver_ql_rewrite_gbtoidx org.apache.hadoop.hive.cli.TestNegativeCliDriver.testNegativeCliDriver_bucket_mapjoin_mismatch1 org.apache.hadoop.hive.cli.TestNegativeCliDriver.testNegativeCliDriver_sortmerge_mapjoin_mismatch_1 org.apache.hadoop.hive.cli.TestNegativeCliDriver.testNegativeCliDriver_udf_assert_true org.apache.hadoop.hive.cli.TestNegativeCliDriver.testNegativeCliDriver_udf_assert_true2 org.apache.hadoop.hive.ql.TestDDLWithRemoteMetastoreSecondNamenode.testCreateTableWithIndexAndPartitionsNonDefaultNameNode org.apache.hadoop.hive.ql.TestMTQueries.testMTQueries1 org.apache.hadoop.hive.ql.parse.TestParse.testParse_case_sensitivity org.apache.hadoop.hive.ql.parse.TestParse.testParse_cast1 org.apache.hadoop.hive.ql.parse.TestParse.testParse_groupby1 org.apache.hadoop.hive.ql.parse.TestParse.testParse_groupby2 org.apache.hadoop.hive.ql.parse.TestParse.testParse_groupby3 org.apache.hadoop.hive.ql.parse.TestParse.testParse_groupby4 org.apache.hadoop.hive.ql.parse.TestParse.testParse_groupby5 org.apache.hadoop.hive.ql.parse.TestParse.testParse_groupby6 org.apache.hadoop.hive.ql.parse.TestParse.testParse_input1 org.apache.hadoop.hive.ql.parse.TestParse.testParse_input2 org.apache.hadoop.hive.ql.parse.TestParse.testParse_input20 org.apache.hadoop.hive.ql.parse.TestParse.testParse_input3 org.apache.hadoop.hive.ql.parse.TestParse.testParse_input4 org.apache.hadoop.hive.ql.parse.TestParse.testParse_input5 org.apache.hadoop.hive.ql.parse.TestParse.testParse_input6 org.apache.hadoop.hive.ql.parse.TestParse.testParse_input7 org.apache.hadoop.hive.ql.parse.TestParse.testParse_input8 org.apache.hadoop.hive.ql.parse.TestParse.testParse_input9 org.apache.hadoop.hive.ql.parse.TestParse.testParse_input_part1 org.apache.hadoop.hive.ql.parse.TestParse.testParse_input_testsequencefile org.apache.hadoop.hive.ql.parse.TestParse.testParse_input_testxpath org.apache.hadoop.hive.ql.parse.TestParse.testParse_input_testxpath2 org.apache.hadoop.hive.ql.parse.TestParse.testParse_join1 org.apache.hadoop.hive.ql.parse.TestParse.testParse_join2 org.apache.hadoop.hive.ql.parse.TestParse.testParse_join3 org.apache.hadoop.hive.ql.parse.TestParse.testParse_join4 org.apache.hadoop.hive.ql.parse.TestParse.testParse_join5 org.apache.hadoop.hive.ql.parse.TestParse.testParse_join6 org.apache.hadoop.hive.ql.parse.TestParse.testParse_join7 org.apache.hadoop.hive.ql.parse.TestParse.testParse_join8 org.apache.hadoop.hive.ql.parse.TestParse.testParse_sample1 org.apache.hadoop.hive.ql.parse.TestParse.testParse_sample2 org.apache.hadoop.hive.ql.parse.TestParse.testParse_sample3 org.apache.hadoop.hive.ql.parse.TestParse.testParse_sample4 org.apache.hadoop.hive.ql.parse.TestParse.testParse_sample5 org.apache.hadoop.hive.ql.parse.TestParse.testParse_sample6 org.apache.hadoop.hive.ql.parse.TestParse.testParse_sample7 org.apache.hadoop.hive.ql.parse.TestParse.testParse_subq org.apache.hadoop.hive.ql.parse.TestParse.testParse_udf1 org.apache.hadoop.hive.ql.parse.TestParse.testParse_udf4 org.apache.hadoop.hive.ql.parse.TestParse.testParse_udf6 org.apache.hadoop.hive.ql.parse.TestParse.testParse_udf_case org.apache.hadoop.hive.ql.parse.TestParse.testParse_udf_when org.apache.hadoop.hive.ql.parse.TestParse.testParse_union Test results: http://ec2-174-129-184-35.compute-1.amazonaws.com/jenkins/job/PreCommit-HIVE-TRUNK-Build/173/testReport Console output: http://ec2-174-129-184-35.compute-1.amazonaws.com/jenkins/job/PreCommit-HIVE-TRUNK-Build/173/console Test logs: http://ec2-174-129-184-35.compute-1.amazonaws.com/logs/PreCommit-HIVE-TRUNK-Build-173/ Messages: Executing org.apache.hive.ptest.execution.PrepPhase Executing org.apache.hive.ptest.execution.ExecutionPhase Executing org.apache.hive.ptest.execution.ReportingPhase Tests exited with: TestsFailedException: 263 tests failed This message is automatically generated. ATTACHMENT ID: 12659752
          Hide
          Eugene Koifman added a comment -

          If we modify MapOperator.process(Writable value) to process(Writable key, Writable value), we could pass the key ExecMapper.map() which means we don't need to use IOContext to pass the RecordIdentifier from IO layer into the operator pipeline.

          Note that Tez also calls MapOperator.process() - need to see if 'key' is available in that context.

          Show
          Eugene Koifman added a comment - If we modify MapOperator.process(Writable value) to process(Writable key, Writable value), we could pass the key ExecMapper.map() which means we don't need to use IOContext to pass the RecordIdentifier from IO layer into the operator pipeline. Note that Tez also calls MapOperator.process() - need to see if 'key' is available in that context.
          Hide
          Eugene Koifman added a comment -

          HIVE-7513.8.patch removes the backwards incompatible Orc API changes

          Show
          Eugene Koifman added a comment - HIVE-7513 .8.patch removes the backwards incompatible Orc API changes
          Hide
          Hive QA added a comment -

          Overall: -1 no tests executed

          Here are the results of testing the latest attachment:
          https://issues.apache.org/jira/secure/attachment/12661379/HIVE-7513.8.patch

          Test results: http://ec2-174-129-184-35.compute-1.amazonaws.com/jenkins/job/PreCommit-HIVE-TRUNK-Build/287/testReport
          Console output: http://ec2-174-129-184-35.compute-1.amazonaws.com/jenkins/job/PreCommit-HIVE-TRUNK-Build/287/console
          Test logs: http://ec2-174-129-184-35.compute-1.amazonaws.com/logs/PreCommit-HIVE-TRUNK-Build-287/

          Messages:

          **** This message was trimmed, see log for full details ****
          As a result, alternative(s) 2 were disabled for that input
          warning(200): IdentifiersParser.g:68:4: 
          Decision can match input such as "LPAREN KW_NULL RPAREN" using multiple alternatives: 1, 2
          
          As a result, alternative(s) 2 were disabled for that input
          warning(200): IdentifiersParser.g:68:4: 
          Decision can match input such as "LPAREN LPAREN Number" using multiple alternatives: 1, 2
          
          As a result, alternative(s) 2 were disabled for that input
          warning(200): IdentifiersParser.g:68:4: 
          Decision can match input such as "LPAREN KW_CASE Identifier" using multiple alternatives: 1, 2
          
          As a result, alternative(s) 2 were disabled for that input
          warning(200): IdentifiersParser.g:115:5: 
          Decision can match input such as "KW_CLUSTER KW_BY LPAREN" using multiple alternatives: 1, 2
          
          As a result, alternative(s) 2 were disabled for that input
          warning(200): IdentifiersParser.g:127:5: 
          Decision can match input such as "KW_PARTITION KW_BY LPAREN" using multiple alternatives: 1, 2
          
          As a result, alternative(s) 2 were disabled for that input
          warning(200): IdentifiersParser.g:138:5: 
          Decision can match input such as "KW_DISTRIBUTE KW_BY LPAREN" using multiple alternatives: 1, 2
          
          As a result, alternative(s) 2 were disabled for that input
          warning(200): IdentifiersParser.g:149:5: 
          Decision can match input such as "KW_SORT KW_BY LPAREN" using multiple alternatives: 1, 2
          
          As a result, alternative(s) 2 were disabled for that input
          warning(200): IdentifiersParser.g:166:7: 
          Decision can match input such as "STAR" using multiple alternatives: 1, 2
          
          As a result, alternative(s) 2 were disabled for that input
          warning(200): IdentifiersParser.g:179:5: 
          Decision can match input such as "KW_ARRAY" using multiple alternatives: 2, 6
          
          As a result, alternative(s) 6 were disabled for that input
          warning(200): IdentifiersParser.g:179:5: 
          Decision can match input such as "KW_STRUCT" using multiple alternatives: 4, 6
          
          As a result, alternative(s) 6 were disabled for that input
          warning(200): IdentifiersParser.g:179:5: 
          Decision can match input such as "KW_UNIONTYPE" using multiple alternatives: 5, 6
          
          As a result, alternative(s) 6 were disabled for that input
          warning(200): IdentifiersParser.g:261:5: 
          Decision can match input such as "KW_DATE StringLiteral" using multiple alternatives: 2, 3
          
          As a result, alternative(s) 3 were disabled for that input
          warning(200): IdentifiersParser.g:261:5: 
          Decision can match input such as "KW_NULL" using multiple alternatives: 1, 8
          
          As a result, alternative(s) 8 were disabled for that input
          warning(200): IdentifiersParser.g:261:5: 
          Decision can match input such as "KW_FALSE" using multiple alternatives: 3, 8
          
          As a result, alternative(s) 8 were disabled for that input
          warning(200): IdentifiersParser.g:261:5: 
          Decision can match input such as "KW_TRUE" using multiple alternatives: 3, 8
          
          As a result, alternative(s) 8 were disabled for that input
          warning(200): IdentifiersParser.g:393:5: 
          Decision can match input such as "{KW_LIKE, KW_REGEXP, KW_RLIKE} KW_INSERT KW_INTO" using multiple alternatives: 2, 9
          
          As a result, alternative(s) 9 were disabled for that input
          warning(200): IdentifiersParser.g:393:5: 
          Decision can match input such as "{KW_LIKE, KW_REGEXP, KW_RLIKE} KW_SORT KW_BY" using multiple alternatives: 2, 9
          
          As a result, alternative(s) 9 were disabled for that input
          warning(200): IdentifiersParser.g:393:5: 
          Decision can match input such as "{KW_LIKE, KW_REGEXP, KW_RLIKE} KW_CLUSTER KW_BY" using multiple alternatives: 2, 9
          
          As a result, alternative(s) 9 were disabled for that input
          warning(200): IdentifiersParser.g:393:5: 
          Decision can match input such as "{KW_LIKE, KW_REGEXP, KW_RLIKE} KW_DISTRIBUTE KW_BY" using multiple alternatives: 2, 9
          
          As a result, alternative(s) 9 were disabled for that input
          warning(200): IdentifiersParser.g:393:5: 
          Decision can match input such as "{KW_LIKE, KW_REGEXP, KW_RLIKE} KW_ORDER KW_BY" using multiple alternatives: 2, 9
          
          As a result, alternative(s) 9 were disabled for that input
          warning(200): IdentifiersParser.g:393:5: 
          Decision can match input such as "{KW_LIKE, KW_REGEXP, KW_RLIKE} KW_INSERT KW_OVERWRITE" using multiple alternatives: 2, 9
          
          As a result, alternative(s) 9 were disabled for that input
          warning(200): IdentifiersParser.g:393:5: 
          Decision can match input such as "{KW_LIKE, KW_REGEXP, KW_RLIKE} KW_UNION KW_ALL" using multiple alternatives: 2, 9
          
          As a result, alternative(s) 9 were disabled for that input
          warning(200): IdentifiersParser.g:393:5: 
          Decision can match input such as "KW_BETWEEN KW_MAP LPAREN" using multiple alternatives: 8, 9
          
          As a result, alternative(s) 9 were disabled for that input
          warning(200): IdentifiersParser.g:393:5: 
          Decision can match input such as "{KW_LIKE, KW_REGEXP, KW_RLIKE} KW_LATERAL KW_VIEW" using multiple alternatives: 2, 9
          
          As a result, alternative(s) 9 were disabled for that input
          warning(200): IdentifiersParser.g:393:5: 
          Decision can match input such as "{KW_LIKE, KW_REGEXP, KW_RLIKE} KW_MAP LPAREN" using multiple alternatives: 2, 9
          
          As a result, alternative(s) 9 were disabled for that input
          warning(200): IdentifiersParser.g:393:5: 
          Decision can match input such as "{KW_LIKE, KW_REGEXP, KW_RLIKE} KW_GROUP KW_BY" using multiple alternatives: 2, 9
          
          As a result, alternative(s) 9 were disabled for that input
          warning(200): IdentifiersParser.g:518:5: 
          Decision can match input such as "{AMPERSAND..BITWISEXOR, DIV..DIVIDE, EQUAL..EQUAL_NS, GREATERTHAN..GREATERTHANOREQUALTO, KW_AND, KW_ARRAY, KW_BETWEEN..KW_BOOLEAN, KW_CASE, KW_DOUBLE, KW_FLOAT, KW_IF, KW_IN, KW_INT, KW_LIKE, KW_MAP, KW_NOT, KW_OR, KW_REGEXP, KW_RLIKE, KW_SMALLINT, KW_STRING..KW_STRUCT, KW_TINYINT, KW_UNIONTYPE, KW_WHEN, LESSTHAN..LESSTHANOREQUALTO, MINUS..NOTEQUAL, PLUS, STAR, TILDE}" using multiple alternatives: 1, 3
          
          As a result, alternative(s) 3 were disabled for that input
          [INFO] 
          [INFO] --- maven-remote-resources-plugin:1.5:process (default) @ hive-exec ---
          [INFO] 
          [INFO] --- maven-resources-plugin:2.6:resources (default-resources) @ hive-exec ---
          [INFO] Using 'UTF-8' encoding to copy filtered resources.
          [INFO] Copying 2 resources
          [INFO] Copying 3 resources
          [INFO] 
          [INFO] --- maven-antrun-plugin:1.7:run (define-classpath) @ hive-exec ---
          [INFO] Executing tasks
          
          main:
          [INFO] Executed tasks
          [INFO] 
          [INFO] --- maven-compiler-plugin:3.1:compile (default-compile) @ hive-exec ---
          [INFO] Compiling 1733 source files to /data/hive-ptest/working/apache-svn-trunk-source/ql/target/classes
          [INFO] -------------------------------------------------------------
          [WARNING] COMPILATION WARNING : 
          [INFO] -------------------------------------------------------------
          [WARNING] /data/hive-ptest/working/apache-svn-trunk-source/ql/src/java/org/apache/hadoop/hive/ql/exec/persistence/MapJoinBytesTableContainer.java: Some input files use or override a deprecated API.
          [WARNING] /data/hive-ptest/working/apache-svn-trunk-source/ql/src/java/org/apache/hadoop/hive/ql/exec/persistence/MapJoinBytesTableContainer.java: Recompile with -Xlint:deprecation for details.
          [WARNING] /data/hive-ptest/working/apache-svn-trunk-source/ql/src/gen/thrift/gen-javabean/org/apache/hadoop/hive/ql/plan/api/Query.java: Some input files use unchecked or unsafe operations.
          [WARNING] /data/hive-ptest/working/apache-svn-trunk-source/ql/src/gen/thrift/gen-javabean/org/apache/hadoop/hive/ql/plan/api/Query.java: Recompile with -Xlint:unchecked for details.
          [INFO] 4 warnings 
          [INFO] -------------------------------------------------------------
          [INFO] -------------------------------------------------------------
          [ERROR] COMPILATION ERROR : 
          [INFO] -------------------------------------------------------------
          [ERROR] /data/hive-ptest/working/apache-svn-trunk-source/ql/src/java/org/apache/hadoop/hive/ql/io/RecordIdentifier.java:[21,31] package com.sun.istack.internal does not exist
          [ERROR] /data/hive-ptest/working/apache-svn-trunk-source/ql/src/java/org/apache/hadoop/hive/ql/io/RecordIdentifier.java:[178,25] cannot find symbol
            symbol:   class NotNull
            location: class org.apache.hadoop.hive.ql.io.RecordIdentifier
          [INFO] 2 errors 
          [INFO] -------------------------------------------------------------
          [INFO] ------------------------------------------------------------------------
          [INFO] Reactor Summary:
          [INFO] 
          [INFO] Hive .............................................. SUCCESS [10.775s]
          [INFO] Hive Ant Utilities ................................ SUCCESS [6.518s]
          [INFO] Hive Shims Common ................................. SUCCESS [4.072s]
          [INFO] Hive Shims 0.20 ................................... SUCCESS [2.857s]
          [INFO] Hive Shims Secure Common .......................... SUCCESS [3.984s]
          [INFO] Hive Shims 0.20S .................................. SUCCESS [2.646s]
          [INFO] Hive Shims 0.23 ................................... SUCCESS [6.256s]
          [INFO] Hive Shims ........................................ SUCCESS [0.943s]
          [INFO] Hive Common ....................................... SUCCESS [8.491s]
          [INFO] Hive Serde ........................................ SUCCESS [13.981s]
          [INFO] Hive Metastore .................................... SUCCESS [31.420s]
          [INFO] Hive Query Language ............................... FAILURE [1:00.463s]
          [INFO] Hive Service ...................................... SKIPPED
          [INFO] Hive JDBC ......................................... SKIPPED
          [INFO] Hive Beeline ...................................... SKIPPED
          [INFO] Hive CLI .......................................... SKIPPED
          [INFO] Hive Contrib ...................................... SKIPPED
          [INFO] Hive HBase Handler ................................ SKIPPED
          [INFO] Hive HCatalog ..................................... SKIPPED
          [INFO] Hive HCatalog Core ................................ SKIPPED
          [INFO] Hive HCatalog Pig Adapter ......................... SKIPPED
          [INFO] Hive HCatalog Server Extensions ................... SKIPPED
          [INFO] Hive HCatalog Webhcat Java Client ................. SKIPPED
          [INFO] Hive HCatalog Webhcat ............................. SKIPPED
          [INFO] Hive HCatalog Streaming ........................... SKIPPED
          [INFO] Hive HWI .......................................... SKIPPED
          [INFO] Hive ODBC ......................................... SKIPPED
          [INFO] Hive Shims Aggregator ............................. SKIPPED
          [INFO] Hive TestUtils .................................... SKIPPED
          [INFO] Hive Packaging .................................... SKIPPED
          [INFO] ------------------------------------------------------------------------
          [INFO] BUILD FAILURE
          [INFO] ------------------------------------------------------------------------
          [INFO] Total time: 2:35.052s
          [INFO] Finished at: Wed Aug 13 05:00:56 EDT 2014
          [INFO] Final Memory: 84M/489M
          [INFO] ------------------------------------------------------------------------
          [ERROR] Failed to execute goal org.apache.maven.plugins:maven-compiler-plugin:3.1:compile (default-compile) on project hive-exec: Compilation failure: Compilation failure:
          [ERROR] /data/hive-ptest/working/apache-svn-trunk-source/ql/src/java/org/apache/hadoop/hive/ql/io/RecordIdentifier.java:[21,31] package com.sun.istack.internal does not exist
          [ERROR] /data/hive-ptest/working/apache-svn-trunk-source/ql/src/java/org/apache/hadoop/hive/ql/io/RecordIdentifier.java:[178,25] cannot find symbol
          [ERROR] symbol:   class NotNull
          [ERROR] location: class org.apache.hadoop.hive.ql.io.RecordIdentifier
          [ERROR] -> [Help 1]
          [ERROR] 
          [ERROR] To see the full stack trace of the errors, re-run Maven with the -e switch.
          [ERROR] Re-run Maven using the -X switch to enable full debug logging.
          [ERROR] 
          [ERROR] For more information about the errors and possible solutions, please read the following articles:
          [ERROR] [Help 1] http://cwiki.apache.org/confluence/display/MAVEN/MojoFailureException
          [ERROR] 
          [ERROR] After correcting the problems, you can resume the build with the command
          [ERROR]   mvn <goals> -rf :hive-exec
          + exit 1
          '
          

          This message is automatically generated.

          ATTACHMENT ID: 12661379

          Show
          Hive QA added a comment - Overall : -1 no tests executed Here are the results of testing the latest attachment: https://issues.apache.org/jira/secure/attachment/12661379/HIVE-7513.8.patch Test results: http://ec2-174-129-184-35.compute-1.amazonaws.com/jenkins/job/PreCommit-HIVE-TRUNK-Build/287/testReport Console output: http://ec2-174-129-184-35.compute-1.amazonaws.com/jenkins/job/PreCommit-HIVE-TRUNK-Build/287/console Test logs: http://ec2-174-129-184-35.compute-1.amazonaws.com/logs/PreCommit-HIVE-TRUNK-Build-287/ Messages: **** This message was trimmed, see log for full details **** As a result, alternative(s) 2 were disabled for that input warning(200): IdentifiersParser.g:68:4: Decision can match input such as "LPAREN KW_NULL RPAREN" using multiple alternatives: 1, 2 As a result, alternative(s) 2 were disabled for that input warning(200): IdentifiersParser.g:68:4: Decision can match input such as "LPAREN LPAREN Number" using multiple alternatives: 1, 2 As a result, alternative(s) 2 were disabled for that input warning(200): IdentifiersParser.g:68:4: Decision can match input such as "LPAREN KW_CASE Identifier" using multiple alternatives: 1, 2 As a result, alternative(s) 2 were disabled for that input warning(200): IdentifiersParser.g:115:5: Decision can match input such as "KW_CLUSTER KW_BY LPAREN" using multiple alternatives: 1, 2 As a result, alternative(s) 2 were disabled for that input warning(200): IdentifiersParser.g:127:5: Decision can match input such as "KW_PARTITION KW_BY LPAREN" using multiple alternatives: 1, 2 As a result, alternative(s) 2 were disabled for that input warning(200): IdentifiersParser.g:138:5: Decision can match input such as "KW_DISTRIBUTE KW_BY LPAREN" using multiple alternatives: 1, 2 As a result, alternative(s) 2 were disabled for that input warning(200): IdentifiersParser.g:149:5: Decision can match input such as "KW_SORT KW_BY LPAREN" using multiple alternatives: 1, 2 As a result, alternative(s) 2 were disabled for that input warning(200): IdentifiersParser.g:166:7: Decision can match input such as "STAR" using multiple alternatives: 1, 2 As a result, alternative(s) 2 were disabled for that input warning(200): IdentifiersParser.g:179:5: Decision can match input such as "KW_ARRAY" using multiple alternatives: 2, 6 As a result, alternative(s) 6 were disabled for that input warning(200): IdentifiersParser.g:179:5: Decision can match input such as "KW_STRUCT" using multiple alternatives: 4, 6 As a result, alternative(s) 6 were disabled for that input warning(200): IdentifiersParser.g:179:5: Decision can match input such as "KW_UNIONTYPE" using multiple alternatives: 5, 6 As a result, alternative(s) 6 were disabled for that input warning(200): IdentifiersParser.g:261:5: Decision can match input such as "KW_DATE StringLiteral" using multiple alternatives: 2, 3 As a result, alternative(s) 3 were disabled for that input warning(200): IdentifiersParser.g:261:5: Decision can match input such as "KW_NULL" using multiple alternatives: 1, 8 As a result, alternative(s) 8 were disabled for that input warning(200): IdentifiersParser.g:261:5: Decision can match input such as "KW_FALSE" using multiple alternatives: 3, 8 As a result, alternative(s) 8 were disabled for that input warning(200): IdentifiersParser.g:261:5: Decision can match input such as "KW_TRUE" using multiple alternatives: 3, 8 As a result, alternative(s) 8 were disabled for that input warning(200): IdentifiersParser.g:393:5: Decision can match input such as "{KW_LIKE, KW_REGEXP, KW_RLIKE} KW_INSERT KW_INTO" using multiple alternatives: 2, 9 As a result, alternative(s) 9 were disabled for that input warning(200): IdentifiersParser.g:393:5: Decision can match input such as "{KW_LIKE, KW_REGEXP, KW_RLIKE} KW_SORT KW_BY" using multiple alternatives: 2, 9 As a result, alternative(s) 9 were disabled for that input warning(200): IdentifiersParser.g:393:5: Decision can match input such as "{KW_LIKE, KW_REGEXP, KW_RLIKE} KW_CLUSTER KW_BY" using multiple alternatives: 2, 9 As a result, alternative(s) 9 were disabled for that input warning(200): IdentifiersParser.g:393:5: Decision can match input such as "{KW_LIKE, KW_REGEXP, KW_RLIKE} KW_DISTRIBUTE KW_BY" using multiple alternatives: 2, 9 As a result, alternative(s) 9 were disabled for that input warning(200): IdentifiersParser.g:393:5: Decision can match input such as "{KW_LIKE, KW_REGEXP, KW_RLIKE} KW_ORDER KW_BY" using multiple alternatives: 2, 9 As a result, alternative(s) 9 were disabled for that input warning(200): IdentifiersParser.g:393:5: Decision can match input such as "{KW_LIKE, KW_REGEXP, KW_RLIKE} KW_INSERT KW_OVERWRITE" using multiple alternatives: 2, 9 As a result, alternative(s) 9 were disabled for that input warning(200): IdentifiersParser.g:393:5: Decision can match input such as "{KW_LIKE, KW_REGEXP, KW_RLIKE} KW_UNION KW_ALL" using multiple alternatives: 2, 9 As a result, alternative(s) 9 were disabled for that input warning(200): IdentifiersParser.g:393:5: Decision can match input such as "KW_BETWEEN KW_MAP LPAREN" using multiple alternatives: 8, 9 As a result, alternative(s) 9 were disabled for that input warning(200): IdentifiersParser.g:393:5: Decision can match input such as "{KW_LIKE, KW_REGEXP, KW_RLIKE} KW_LATERAL KW_VIEW" using multiple alternatives: 2, 9 As a result, alternative(s) 9 were disabled for that input warning(200): IdentifiersParser.g:393:5: Decision can match input such as "{KW_LIKE, KW_REGEXP, KW_RLIKE} KW_MAP LPAREN" using multiple alternatives: 2, 9 As a result, alternative(s) 9 were disabled for that input warning(200): IdentifiersParser.g:393:5: Decision can match input such as "{KW_LIKE, KW_REGEXP, KW_RLIKE} KW_GROUP KW_BY" using multiple alternatives: 2, 9 As a result, alternative(s) 9 were disabled for that input warning(200): IdentifiersParser.g:518:5: Decision can match input such as "{AMPERSAND..BITWISEXOR, DIV..DIVIDE, EQUAL..EQUAL_NS, GREATERTHAN..GREATERTHANOREQUALTO, KW_AND, KW_ARRAY, KW_BETWEEN..KW_BOOLEAN, KW_CASE, KW_DOUBLE, KW_FLOAT, KW_IF, KW_IN, KW_INT, KW_LIKE, KW_MAP, KW_NOT, KW_OR, KW_REGEXP, KW_RLIKE, KW_SMALLINT, KW_STRING..KW_STRUCT, KW_TINYINT, KW_UNIONTYPE, KW_WHEN, LESSTHAN..LESSTHANOREQUALTO, MINUS..NOTEQUAL, PLUS, STAR, TILDE}" using multiple alternatives: 1, 3 As a result, alternative(s) 3 were disabled for that input [INFO] [INFO] --- maven-remote-resources-plugin:1.5:process (default) @ hive-exec --- [INFO] [INFO] --- maven-resources-plugin:2.6:resources (default-resources) @ hive-exec --- [INFO] Using 'UTF-8' encoding to copy filtered resources. [INFO] Copying 2 resources [INFO] Copying 3 resources [INFO] [INFO] --- maven-antrun-plugin:1.7:run (define-classpath) @ hive-exec --- [INFO] Executing tasks main: [INFO] Executed tasks [INFO] [INFO] --- maven-compiler-plugin:3.1:compile (default-compile) @ hive-exec --- [INFO] Compiling 1733 source files to /data/hive-ptest/working/apache-svn-trunk-source/ql/target/classes [INFO] ------------------------------------------------------------- [WARNING] COMPILATION WARNING : [INFO] ------------------------------------------------------------- [WARNING] /data/hive-ptest/working/apache-svn-trunk-source/ql/src/java/org/apache/hadoop/hive/ql/exec/persistence/MapJoinBytesTableContainer.java: Some input files use or override a deprecated API. [WARNING] /data/hive-ptest/working/apache-svn-trunk-source/ql/src/java/org/apache/hadoop/hive/ql/exec/persistence/MapJoinBytesTableContainer.java: Recompile with -Xlint:deprecation for details. [WARNING] /data/hive-ptest/working/apache-svn-trunk-source/ql/src/gen/thrift/gen-javabean/org/apache/hadoop/hive/ql/plan/api/Query.java: Some input files use unchecked or unsafe operations. [WARNING] /data/hive-ptest/working/apache-svn-trunk-source/ql/src/gen/thrift/gen-javabean/org/apache/hadoop/hive/ql/plan/api/Query.java: Recompile with -Xlint:unchecked for details. [INFO] 4 warnings [INFO] ------------------------------------------------------------- [INFO] ------------------------------------------------------------- [ERROR] COMPILATION ERROR : [INFO] ------------------------------------------------------------- [ERROR] /data/hive-ptest/working/apache-svn-trunk-source/ql/src/java/org/apache/hadoop/hive/ql/io/RecordIdentifier.java:[21,31] package com.sun.istack.internal does not exist [ERROR] /data/hive-ptest/working/apache-svn-trunk-source/ql/src/java/org/apache/hadoop/hive/ql/io/RecordIdentifier.java:[178,25] cannot find symbol symbol: class NotNull location: class org.apache.hadoop.hive.ql.io.RecordIdentifier [INFO] 2 errors [INFO] ------------------------------------------------------------- [INFO] ------------------------------------------------------------------------ [INFO] Reactor Summary: [INFO] [INFO] Hive .............................................. SUCCESS [10.775s] [INFO] Hive Ant Utilities ................................ SUCCESS [6.518s] [INFO] Hive Shims Common ................................. SUCCESS [4.072s] [INFO] Hive Shims 0.20 ................................... SUCCESS [2.857s] [INFO] Hive Shims Secure Common .......................... SUCCESS [3.984s] [INFO] Hive Shims 0.20S .................................. SUCCESS [2.646s] [INFO] Hive Shims 0.23 ................................... SUCCESS [6.256s] [INFO] Hive Shims ........................................ SUCCESS [0.943s] [INFO] Hive Common ....................................... SUCCESS [8.491s] [INFO] Hive Serde ........................................ SUCCESS [13.981s] [INFO] Hive Metastore .................................... SUCCESS [31.420s] [INFO] Hive Query Language ............................... FAILURE [1:00.463s] [INFO] Hive Service ...................................... SKIPPED [INFO] Hive JDBC ......................................... SKIPPED [INFO] Hive Beeline ...................................... SKIPPED [INFO] Hive CLI .......................................... SKIPPED [INFO] Hive Contrib ...................................... SKIPPED [INFO] Hive HBase Handler ................................ SKIPPED [INFO] Hive HCatalog ..................................... SKIPPED [INFO] Hive HCatalog Core ................................ SKIPPED [INFO] Hive HCatalog Pig Adapter ......................... SKIPPED [INFO] Hive HCatalog Server Extensions ................... SKIPPED [INFO] Hive HCatalog Webhcat Java Client ................. SKIPPED [INFO] Hive HCatalog Webhcat ............................. SKIPPED [INFO] Hive HCatalog Streaming ........................... SKIPPED [INFO] Hive HWI .......................................... SKIPPED [INFO] Hive ODBC ......................................... SKIPPED [INFO] Hive Shims Aggregator ............................. SKIPPED [INFO] Hive TestUtils .................................... SKIPPED [INFO] Hive Packaging .................................... SKIPPED [INFO] ------------------------------------------------------------------------ [INFO] BUILD FAILURE [INFO] ------------------------------------------------------------------------ [INFO] Total time: 2:35.052s [INFO] Finished at: Wed Aug 13 05:00:56 EDT 2014 [INFO] Final Memory: 84M/489M [INFO] ------------------------------------------------------------------------ [ERROR] Failed to execute goal org.apache.maven.plugins:maven-compiler-plugin:3.1:compile (default-compile) on project hive-exec: Compilation failure: Compilation failure: [ERROR] /data/hive-ptest/working/apache-svn-trunk-source/ql/src/java/org/apache/hadoop/hive/ql/io/RecordIdentifier.java:[21,31] package com.sun.istack.internal does not exist [ERROR] /data/hive-ptest/working/apache-svn-trunk-source/ql/src/java/org/apache/hadoop/hive/ql/io/RecordIdentifier.java:[178,25] cannot find symbol [ERROR] symbol: class NotNull [ERROR] location: class org.apache.hadoop.hive.ql.io.RecordIdentifier [ERROR] -> [Help 1] [ERROR] [ERROR] To see the full stack trace of the errors, re-run Maven with the -e switch. [ERROR] Re-run Maven using the -X switch to enable full debug logging. [ERROR] [ERROR] For more information about the errors and possible solutions, please read the following articles: [ERROR] [Help 1] http://cwiki.apache.org/confluence/display/MAVEN/MojoFailureException [ERROR] [ERROR] After correcting the problems, you can resume the build with the command [ERROR] mvn <goals> -rf :hive-exec + exit 1 ' This message is automatically generated. ATTACHMENT ID: 12661379
          Hide
          Navis added a comment -

          Just removed NotNull annotation in RecordIdentifier for test.

          Show
          Navis added a comment - Just removed NotNull annotation in RecordIdentifier for test.
          Hide
          Eugene Koifman added a comment -

          HIVE-7513.10.patch incorporates feedback from Owen

          Show
          Eugene Koifman added a comment - HIVE-7513 .10.patch incorporates feedback from Owen
          Hide
          Hive QA added a comment -

          Overall: -1 at least one tests failed

          Here are the results of testing the latest attachment:
          https://issues.apache.org/jira/secure/attachment/12661557/HIVE-7513.10.patch

          ERROR: -1 due to 270 failed/errored test(s), 5892 tests executed
          Failed tests:

          org.apache.hadoop.hive.cli.TestCliDriver.testCliDriver_allcolref_in_udf
          org.apache.hadoop.hive.cli.TestCliDriver.testCliDriver_annotate_stats_join
          org.apache.hadoop.hive.cli.TestCliDriver.testCliDriver_auto_join1
          org.apache.hadoop.hive.cli.TestCliDriver.testCliDriver_auto_join14
          org.apache.hadoop.hive.cli.TestCliDriver.testCliDriver_auto_join15
          org.apache.hadoop.hive.cli.TestCliDriver.testCliDriver_auto_join17
          org.apache.hadoop.hive.cli.TestCliDriver.testCliDriver_auto_join19
          org.apache.hadoop.hive.cli.TestCliDriver.testCliDriver_auto_join2
          org.apache.hadoop.hive.cli.TestCliDriver.testCliDriver_auto_join20
          org.apache.hadoop.hive.cli.TestCliDriver.testCliDriver_auto_join21
          org.apache.hadoop.hive.cli.TestCliDriver.testCliDriver_auto_join22
          org.apache.hadoop.hive.cli.TestCliDriver.testCliDriver_auto_join23
          org.apache.hadoop.hive.cli.TestCliDriver.testCliDriver_auto_join28
          org.apache.hadoop.hive.cli.TestCliDriver.testCliDriver_auto_join29
          org.apache.hadoop.hive.cli.TestCliDriver.testCliDriver_auto_join3
          org.apache.hadoop.hive.cli.TestCliDriver.testCliDriver_auto_join32
          org.apache.hadoop.hive.cli.TestCliDriver.testCliDriver_auto_join9
          org.apache.hadoop.hive.cli.TestCliDriver.testCliDriver_auto_join_reordering_values
          org.apache.hadoop.hive.cli.TestCliDriver.testCliDriver_auto_smb_mapjoin_14
          org.apache.hadoop.hive.cli.TestCliDriver.testCliDriver_auto_sortmerge_join_13
          org.apache.hadoop.hive.cli.TestCliDriver.testCliDriver_bucketmapjoin1
          org.apache.hadoop.hive.cli.TestCliDriver.testCliDriver_bucketmapjoin2
          org.apache.hadoop.hive.cli.TestCliDriver.testCliDriver_bucketmapjoin3
          org.apache.hadoop.hive.cli.TestCliDriver.testCliDriver_bucketmapjoin4
          org.apache.hadoop.hive.cli.TestCliDriver.testCliDriver_bucketmapjoin5
          org.apache.hadoop.hive.cli.TestCliDriver.testCliDriver_bucketmapjoin_negative
          org.apache.hadoop.hive.cli.TestCliDriver.testCliDriver_bucketmapjoin_negative2
          org.apache.hadoop.hive.cli.TestCliDriver.testCliDriver_bucketmapjoin_negative3
          org.apache.hadoop.hive.cli.TestCliDriver.testCliDriver_bucketsortoptimize_insert_2
          org.apache.hadoop.hive.cli.TestCliDriver.testCliDriver_bucketsortoptimize_insert_4
          org.apache.hadoop.hive.cli.TestCliDriver.testCliDriver_bucketsortoptimize_insert_5
          org.apache.hadoop.hive.cli.TestCliDriver.testCliDriver_bucketsortoptimize_insert_6
          org.apache.hadoop.hive.cli.TestCliDriver.testCliDriver_bucketsortoptimize_insert_7
          org.apache.hadoop.hive.cli.TestCliDriver.testCliDriver_bucketsortoptimize_insert_8
          org.apache.hadoop.hive.cli.TestCliDriver.testCliDriver_cluster
          org.apache.hadoop.hive.cli.TestCliDriver.testCliDriver_column_access_stats
          org.apache.hadoop.hive.cli.TestCliDriver.testCliDriver_constprog2
          org.apache.hadoop.hive.cli.TestCliDriver.testCliDriver_correlationoptimizer1
          org.apache.hadoop.hive.cli.TestCliDriver.testCliDriver_correlationoptimizer4
          org.apache.hadoop.hive.cli.TestCliDriver.testCliDriver_correlationoptimizer5
          org.apache.hadoop.hive.cli.TestCliDriver.testCliDriver_correlationoptimizer6
          org.apache.hadoop.hive.cli.TestCliDriver.testCliDriver_cross_product_check_1
          org.apache.hadoop.hive.cli.TestCliDriver.testCliDriver_cross_product_check_2
          org.apache.hadoop.hive.cli.TestCliDriver.testCliDriver_explain_logical
          org.apache.hadoop.hive.cli.TestCliDriver.testCliDriver_filter_join_breaktask
          org.apache.hadoop.hive.cli.TestCliDriver.testCliDriver_index_auto_self_join
          org.apache.hadoop.hive.cli.TestCliDriver.testCliDriver_innerjoin
          org.apache.hadoop.hive.cli.TestCliDriver.testCliDriver_input23
          org.apache.hadoop.hive.cli.TestCliDriver.testCliDriver_join14
          org.apache.hadoop.hive.cli.TestCliDriver.testCliDriver_join15
          org.apache.hadoop.hive.cli.TestCliDriver.testCliDriver_join17
          org.apache.hadoop.hive.cli.TestCliDriver.testCliDriver_join2
          org.apache.hadoop.hive.cli.TestCliDriver.testCliDriver_join20
          org.apache.hadoop.hive.cli.TestCliDriver.testCliDriver_join21
          org.apache.hadoop.hive.cli.TestCliDriver.testCliDriver_join22
          org.apache.hadoop.hive.cli.TestCliDriver.testCliDriver_join23
          org.apache.hadoop.hive.cli.TestCliDriver.testCliDriver_join25
          org.apache.hadoop.hive.cli.TestCliDriver.testCliDriver_join26
          org.apache.hadoop.hive.cli.TestCliDriver.testCliDriver_join27
          org.apache.hadoop.hive.cli.TestCliDriver.testCliDriver_join3
          org.apache.hadoop.hive.cli.TestCliDriver.testCliDriver_join32
          org.apache.hadoop.hive.cli.TestCliDriver.testCliDriver_join32_lessSize
          org.apache.hadoop.hive.cli.TestCliDriver.testCliDriver_join33
          org.apache.hadoop.hive.cli.TestCliDriver.testCliDriver_join36
          org.apache.hadoop.hive.cli.TestCliDriver.testCliDriver_join37
          org.apache.hadoop.hive.cli.TestCliDriver.testCliDriver_join38
          org.apache.hadoop.hive.cli.TestCliDriver.testCliDriver_join39
          org.apache.hadoop.hive.cli.TestCliDriver.testCliDriver_join40
          org.apache.hadoop.hive.cli.TestCliDriver.testCliDriver_join41
          org.apache.hadoop.hive.cli.TestCliDriver.testCliDriver_join9
          org.apache.hadoop.hive.cli.TestCliDriver.testCliDriver_join_alt_syntax
          org.apache.hadoop.hive.cli.TestCliDriver.testCliDriver_join_cond_pushdown_1
          org.apache.hadoop.hive.cli.TestCliDriver.testCliDriver_join_cond_pushdown_2
          org.apache.hadoop.hive.cli.TestCliDriver.testCliDriver_join_cond_pushdown_3
          org.apache.hadoop.hive.cli.TestCliDriver.testCliDriver_join_cond_pushdown_4
          org.apache.hadoop.hive.cli.TestCliDriver.testCliDriver_join_cond_pushdown_unqual1
          org.apache.hadoop.hive.cli.TestCliDriver.testCliDriver_join_cond_pushdown_unqual2
          org.apache.hadoop.hive.cli.TestCliDriver.testCliDriver_join_cond_pushdown_unqual3
          org.apache.hadoop.hive.cli.TestCliDriver.testCliDriver_join_cond_pushdown_unqual4
          org.apache.hadoop.hive.cli.TestCliDriver.testCliDriver_join_filters_overlap
          org.apache.hadoop.hive.cli.TestCliDriver.testCliDriver_join_hive_626
          org.apache.hadoop.hive.cli.TestCliDriver.testCliDriver_join_map_ppr
          org.apache.hadoop.hive.cli.TestCliDriver.testCliDriver_join_merging
          org.apache.hadoop.hive.cli.TestCliDriver.testCliDriver_join_nullsafe
          org.apache.hadoop.hive.cli.TestCliDriver.testCliDriver_join_rc
          org.apache.hadoop.hive.cli.TestCliDriver.testCliDriver_join_reorder
          org.apache.hadoop.hive.cli.TestCliDriver.testCliDriver_join_reorder2
          org.apache.hadoop.hive.cli.TestCliDriver.testCliDriver_join_reorder3
          org.apache.hadoop.hive.cli.TestCliDriver.testCliDriver_join_reorder4
          org.apache.hadoop.hive.cli.TestCliDriver.testCliDriver_join_star
          org.apache.hadoop.hive.cli.TestCliDriver.testCliDriver_join_thrift
          org.apache.hadoop.hive.cli.TestCliDriver.testCliDriver_join_vc
          org.apache.hadoop.hive.cli.TestCliDriver.testCliDriver_join_view
          org.apache.hadoop.hive.cli.TestCliDriver.testCliDriver_lateral_view
          org.apache.hadoop.hive.cli.TestCliDriver.testCliDriver_lateral_view_cp
          org.apache.hadoop.hive.cli.TestCliDriver.testCliDriver_lateral_view_noalias
          org.apache.hadoop.hive.cli.TestCliDriver.testCliDriver_lateral_view_outer
          org.apache.hadoop.hive.cli.TestCliDriver.testCliDriver_lateral_view_ppd
          org.apache.hadoop.hive.cli.TestCliDriver.testCliDriver_limit_pushdown_negative
          org.apache.hadoop.hive.cli.TestCliDriver.testCliDriver_lineage1
          org.apache.hadoop.hive.cli.TestCliDriver.testCliDriver_louter_join_ppr
          org.apache.hadoop.hive.cli.TestCliDriver.testCliDriver_mapjoin1
          org.apache.hadoop.hive.cli.TestCliDriver.testCliDriver_mapjoin_filter_on_outerjoin
          org.apache.hadoop.hive.cli.TestCliDriver.testCliDriver_mapjoin_memcheck
          org.apache.hadoop.hive.cli.TestCliDriver.testCliDriver_mapjoin_subquery2
          org.apache.hadoop.hive.cli.TestCliDriver.testCliDriver_mapjoin_test_outer
          org.apache.hadoop.hive.cli.TestCliDriver.testCliDriver_mergejoins
          org.apache.hadoop.hive.cli.TestCliDriver.testCliDriver_mergejoins_mixed
          org.apache.hadoop.hive.cli.TestCliDriver.testCliDriver_multiMapJoin1
          org.apache.hadoop.hive.cli.TestCliDriver.testCliDriver_multi_insert_lateral_view
          org.apache.hadoop.hive.cli.TestCliDriver.testCliDriver_multi_join_union
          org.apache.hadoop.hive.cli.TestCliDriver.testCliDriver_no_hooks
          org.apache.hadoop.hive.cli.TestCliDriver.testCliDriver_nonmr_fetch
          org.apache.hadoop.hive.cli.TestCliDriver.testCliDriver_optional_outer
          org.apache.hadoop.hive.cli.TestCliDriver.testCliDriver_outer_join_ppr
          org.apache.hadoop.hive.cli.TestCliDriver.testCliDriver_pcr
          org.apache.hadoop.hive.cli.TestCliDriver.testCliDriver_ppd_join5
          org.apache.hadoop.hive.cli.TestCliDriver.testCliDriver_ppd_join_filter
          org.apache.hadoop.hive.cli.TestCliDriver.testCliDriver_ppd_outer_join1
          org.apache.hadoop.hive.cli.TestCliDriver.testCliDriver_ppd_outer_join2
          org.apache.hadoop.hive.cli.TestCliDriver.testCliDriver_ppd_outer_join3
          org.apache.hadoop.hive.cli.TestCliDriver.testCliDriver_ppd_outer_join4
          org.apache.hadoop.hive.cli.TestCliDriver.testCliDriver_ppd_outer_join5
          org.apache.hadoop.hive.cli.TestCliDriver.testCliDriver_ppd_repeated_alias
          org.apache.hadoop.hive.cli.TestCliDriver.testCliDriver_ppd_udf_case
          org.apache.hadoop.hive.cli.TestCliDriver.testCliDriver_ppd_union_view
          org.apache.hadoop.hive.cli.TestCliDriver.testCliDriver_ppd_vc
          org.apache.hadoop.hive.cli.TestCliDriver.testCliDriver_ptf
          org.apache.hadoop.hive.cli.TestCliDriver.testCliDriver_quotedid_skew
          org.apache.hadoop.hive.cli.TestCliDriver.testCliDriver_regex_col
          org.apache.hadoop.hive.cli.TestCliDriver.testCliDriver_router_join_ppr
          org.apache.hadoop.hive.cli.TestCliDriver.testCliDriver_sample8
          org.apache.hadoop.hive.cli.TestCliDriver.testCliDriver_semijoin
          org.apache.hadoop.hive.cli.TestCliDriver.testCliDriver_skewjoin
          org.apache.hadoop.hive.cli.TestCliDriver.testCliDriver_skewjoin_union_remove_1
          org.apache.hadoop.hive.cli.TestCliDriver.testCliDriver_skewjoin_union_remove_2
          org.apache.hadoop.hive.cli.TestCliDriver.testCliDriver_skewjoinopt1
          org.apache.hadoop.hive.cli.TestCliDriver.testCliDriver_skewjoinopt10
          org.apache.hadoop.hive.cli.TestCliDriver.testCliDriver_skewjoinopt11
          org.apache.hadoop.hive.cli.TestCliDriver.testCliDriver_skewjoinopt12
          org.apache.hadoop.hive.cli.TestCliDriver.testCliDriver_skewjoinopt13
          org.apache.hadoop.hive.cli.TestCliDriver.testCliDriver_skewjoinopt14
          org.apache.hadoop.hive.cli.TestCliDriver.testCliDriver_skewjoinopt15
          org.apache.hadoop.hive.cli.TestCliDriver.testCliDriver_skewjoinopt16
          org.apache.hadoop.hive.cli.TestCliDriver.testCliDriver_skewjoinopt17
          org.apache.hadoop.hive.cli.TestCliDriver.testCliDriver_skewjoinopt18
          org.apache.hadoop.hive.cli.TestCliDriver.testCliDriver_skewjoinopt19
          org.apache.hadoop.hive.cli.TestCliDriver.testCliDriver_skewjoinopt2
          org.apache.hadoop.hive.cli.TestCliDriver.testCliDriver_skewjoinopt20
          org.apache.hadoop.hive.cli.TestCliDriver.testCliDriver_skewjoinopt3
          org.apache.hadoop.hive.cli.TestCliDriver.testCliDriver_skewjoinopt4
          org.apache.hadoop.hive.cli.TestCliDriver.testCliDriver_skewjoinopt5
          org.apache.hadoop.hive.cli.TestCliDriver.testCliDriver_skewjoinopt6
          org.apache.hadoop.hive.cli.TestCliDriver.testCliDriver_skewjoinopt7
          org.apache.hadoop.hive.cli.TestCliDriver.testCliDriver_skewjoinopt8
          org.apache.hadoop.hive.cli.TestCliDriver.testCliDriver_smb_mapjoin9
          org.apache.hadoop.hive.cli.TestCliDriver.testCliDriver_smb_mapjoin_1
          org.apache.hadoop.hive.cli.TestCliDriver.testCliDriver_smb_mapjoin_10
          org.apache.hadoop.hive.cli.TestCliDriver.testCliDriver_smb_mapjoin_11
          org.apache.hadoop.hive.cli.TestCliDriver.testCliDriver_smb_mapjoin_12
          org.apache.hadoop.hive.cli.TestCliDriver.testCliDriver_smb_mapjoin_13
          org.apache.hadoop.hive.cli.TestCliDriver.testCliDriver_smb_mapjoin_15
          org.apache.hadoop.hive.cli.TestCliDriver.testCliDriver_smb_mapjoin_2
          org.apache.hadoop.hive.cli.TestCliDriver.testCliDriver_smb_mapjoin_3
          org.apache.hadoop.hive.cli.TestCliDriver.testCliDriver_smb_mapjoin_4
          org.apache.hadoop.hive.cli.TestCliDriver.testCliDriver_smb_mapjoin_5
          org.apache.hadoop.hive.cli.TestCliDriver.testCliDriver_smb_mapjoin_6
          org.apache.hadoop.hive.cli.TestCliDriver.testCliDriver_smb_mapjoin_7
          org.apache.hadoop.hive.cli.TestCliDriver.testCliDriver_stats11
          org.apache.hadoop.hive.cli.TestCliDriver.testCliDriver_subquery_multiinsert
          org.apache.hadoop.hive.cli.TestCliDriver.testCliDriver_subquery_notexists
          org.apache.hadoop.hive.cli.TestCliDriver.testCliDriver_subquery_notin
          org.apache.hadoop.hive.cli.TestCliDriver.testCliDriver_subquery_unqualcolumnrefs
          org.apache.hadoop.hive.cli.TestCliDriver.testCliDriver_subquery_views
          org.apache.hadoop.hive.cli.TestCliDriver.testCliDriver_temp_table_join1
          org.apache.hadoop.hive.cli.TestCliDriver.testCliDriver_temp_table_windowing_expressions
          org.apache.hadoop.hive.cli.TestCliDriver.testCliDriver_udtf_json_tuple
          org.apache.hadoop.hive.cli.TestCliDriver.testCliDriver_udtf_parse_url_tuple
          org.apache.hadoop.hive.cli.TestCliDriver.testCliDriver_udtf_stack
          org.apache.hadoop.hive.cli.TestCliDriver.testCliDriver_union22
          org.apache.hadoop.hive.cli.TestCliDriver.testCliDriver_union24
          org.apache.hadoop.hive.cli.TestCliDriver.testCliDriver_union26
          org.apache.hadoop.hive.cli.TestCliDriver.testCliDriver_union27
          org.apache.hadoop.hive.cli.TestCliDriver.testCliDriver_union32
          org.apache.hadoop.hive.cli.TestCliDriver.testCliDriver_union_remove_12
          org.apache.hadoop.hive.cli.TestCliDriver.testCliDriver_union_remove_13
          org.apache.hadoop.hive.cli.TestCliDriver.testCliDriver_union_remove_14
          org.apache.hadoop.hive.cli.TestCliDriver.testCliDriver_union_top_level
          org.apache.hadoop.hive.cli.TestCliDriver.testCliDriver_vector_decimal_mapjoin
          org.apache.hadoop.hive.cli.TestCliDriver.testCliDriver_vectorized_bucketmapjoin1
          org.apache.hadoop.hive.cli.TestCliDriver.testCliDriver_vectorized_context
          org.apache.hadoop.hive.cli.TestCliDriver.testCliDriver_vectorized_mapjoin
          org.apache.hadoop.hive.cli.TestCliDriver.testCliDriver_vectorized_nested_mapjoin
          org.apache.hadoop.hive.cli.TestCliDriver.testCliDriver_vectorized_ptf
          org.apache.hadoop.hive.cli.TestCliDriver.testCliDriver_vectorized_shufflejoin
          org.apache.hadoop.hive.cli.TestCliDriver.testCliDriver_windowing
          org.apache.hadoop.hive.cli.TestCliDriver.testCliDriver_windowing_expressions
          org.apache.hadoop.hive.cli.TestMiniTezCliDriver.testCliDriver_auto_join1
          org.apache.hadoop.hive.cli.TestMiniTezCliDriver.testCliDriver_bucket_map_join_tez1
          org.apache.hadoop.hive.cli.TestMiniTezCliDriver.testCliDriver_bucket_map_join_tez2
          org.apache.hadoop.hive.cli.TestMiniTezCliDriver.testCliDriver_cross_product_check_1
          org.apache.hadoop.hive.cli.TestMiniTezCliDriver.testCliDriver_cross_product_check_2
          org.apache.hadoop.hive.cli.TestMiniTezCliDriver.testCliDriver_dynpart_sort_opt_vectorization
          org.apache.hadoop.hive.cli.TestMiniTezCliDriver.testCliDriver_filter_join_breaktask
          org.apache.hadoop.hive.cli.TestMiniTezCliDriver.testCliDriver_join1
          org.apache.hadoop.hive.cli.TestMiniTezCliDriver.testCliDriver_mapjoin_decimal
          org.apache.hadoop.hive.cli.TestMiniTezCliDriver.testCliDriver_mrr
          org.apache.hadoop.hive.cli.TestMiniTezCliDriver.testCliDriver_ptf
          org.apache.hadoop.hive.cli.TestMiniTezCliDriver.testCliDriver_tez_join_hash
          org.apache.hadoop.hive.cli.TestMiniTezCliDriver.testCliDriver_tez_join_tests
          org.apache.hadoop.hive.cli.TestMiniTezCliDriver.testCliDriver_tez_joins_explain
          org.apache.hadoop.hive.cli.TestMiniTezCliDriver.testCliDriver_tez_union
          org.apache.hadoop.hive.cli.TestMiniTezCliDriver.testCliDriver_vectorized_mapjoin
          org.apache.hadoop.hive.cli.TestMiniTezCliDriver.testCliDriver_vectorized_nested_mapjoin
          org.apache.hadoop.hive.cli.TestMiniTezCliDriver.testCliDriver_vectorized_ptf
          org.apache.hadoop.hive.cli.TestMiniTezCliDriver.testCliDriver_vectorized_shufflejoin
          org.apache.hadoop.hive.cli.TestMinimrCliDriver.testCliDriver_bucketmapjoin7
          org.apache.hadoop.hive.cli.TestMinimrCliDriver.testCliDriver_infer_bucket_sort_map_operators
          org.apache.hadoop.hive.cli.TestMinimrCliDriver.testCliDriver_join1
          org.apache.hadoop.hive.cli.TestNegativeCliDriver.testNegativeCliDriver_bucket_mapjoin_mismatch1
          org.apache.hadoop.hive.cli.TestNegativeCliDriver.testNegativeCliDriver_sortmerge_mapjoin_mismatch_1
          org.apache.hadoop.hive.cli.TestNegativeCliDriver.testNegativeCliDriver_udf_assert_true
          org.apache.hadoop.hive.cli.TestNegativeCliDriver.testNegativeCliDriver_udf_assert_true2
          org.apache.hadoop.hive.ql.TestMTQueries.testMTQueries1
          org.apache.hadoop.hive.ql.io.orc.TestInputOutputFormat.testInOutFormat
          org.apache.hadoop.hive.ql.parse.TestParse.testParse_case_sensitivity
          org.apache.hadoop.hive.ql.parse.TestParse.testParse_cast1
          org.apache.hadoop.hive.ql.parse.TestParse.testParse_groupby1
          org.apache.hadoop.hive.ql.parse.TestParse.testParse_groupby2
          org.apache.hadoop.hive.ql.parse.TestParse.testParse_groupby3
          org.apache.hadoop.hive.ql.parse.TestParse.testParse_groupby4
          org.apache.hadoop.hive.ql.parse.TestParse.testParse_groupby5
          org.apache.hadoop.hive.ql.parse.TestParse.testParse_groupby6
          org.apache.hadoop.hive.ql.parse.TestParse.testParse_input1
          org.apache.hadoop.hive.ql.parse.TestParse.testParse_input2
          org.apache.hadoop.hive.ql.parse.TestParse.testParse_input20
          org.apache.hadoop.hive.ql.parse.TestParse.testParse_input3
          org.apache.hadoop.hive.ql.parse.TestParse.testParse_input4
          org.apache.hadoop.hive.ql.parse.TestParse.testParse_input5
          org.apache.hadoop.hive.ql.parse.TestParse.testParse_input6
          org.apache.hadoop.hive.ql.parse.TestParse.testParse_input7
          org.apache.hadoop.hive.ql.parse.TestParse.testParse_input8
          org.apache.hadoop.hive.ql.parse.TestParse.testParse_input9
          org.apache.hadoop.hive.ql.parse.TestParse.testParse_input_part1
          org.apache.hadoop.hive.ql.parse.TestParse.testParse_input_testsequencefile
          org.apache.hadoop.hive.ql.parse.TestParse.testParse_input_testxpath
          org.apache.hadoop.hive.ql.parse.TestParse.testParse_input_testxpath2
          org.apache.hadoop.hive.ql.parse.TestParse.testParse_join1
          org.apache.hadoop.hive.ql.parse.TestParse.testParse_join2
          org.apache.hadoop.hive.ql.parse.TestParse.testParse_join3
          org.apache.hadoop.hive.ql.parse.TestParse.testParse_join4
          org.apache.hadoop.hive.ql.parse.TestParse.testParse_join5
          org.apache.hadoop.hive.ql.parse.TestParse.testParse_join6
          org.apache.hadoop.hive.ql.parse.TestParse.testParse_join7
          org.apache.hadoop.hive.ql.parse.TestParse.testParse_join8
          org.apache.hadoop.hive.ql.parse.TestParse.testParse_sample1
          org.apache.hadoop.hive.ql.parse.TestParse.testParse_sample2
          org.apache.hadoop.hive.ql.parse.TestParse.testParse_sample3
          org.apache.hadoop.hive.ql.parse.TestParse.testParse_sample4
          org.apache.hadoop.hive.ql.parse.TestParse.testParse_sample5
          org.apache.hadoop.hive.ql.parse.TestParse.testParse_sample6
          org.apache.hadoop.hive.ql.parse.TestParse.testParse_sample7
          org.apache.hadoop.hive.ql.parse.TestParse.testParse_subq
          org.apache.hadoop.hive.ql.parse.TestParse.testParse_udf1
          org.apache.hadoop.hive.ql.parse.TestParse.testParse_udf4
          org.apache.hadoop.hive.ql.parse.TestParse.testParse_udf6
          org.apache.hadoop.hive.ql.parse.TestParse.testParse_udf_case
          org.apache.hadoop.hive.ql.parse.TestParse.testParse_udf_when
          org.apache.hadoop.hive.ql.parse.TestParse.testParse_union
          org.apache.hive.jdbc.TestJdbcDriver2.testDatabaseMetaData
          

          Test results: http://ec2-174-129-184-35.compute-1.amazonaws.com/jenkins/job/PreCommit-HIVE-TRUNK-Build/296/testReport
          Console output: http://ec2-174-129-184-35.compute-1.amazonaws.com/jenkins/job/PreCommit-HIVE-TRUNK-Build/296/console
          Test logs: http://ec2-174-129-184-35.compute-1.amazonaws.com/logs/PreCommit-HIVE-TRUNK-Build-296/

          Messages:

          Executing org.apache.hive.ptest.execution.PrepPhase
          Executing org.apache.hive.ptest.execution.ExecutionPhase
          Executing org.apache.hive.ptest.execution.ReportingPhase
          Tests exited with: TestsFailedException: 270 tests failed
          

          This message is automatically generated.

          ATTACHMENT ID: 12661557

          Show
          Hive QA added a comment - Overall : -1 at least one tests failed Here are the results of testing the latest attachment: https://issues.apache.org/jira/secure/attachment/12661557/HIVE-7513.10.patch ERROR: -1 due to 270 failed/errored test(s), 5892 tests executed Failed tests: org.apache.hadoop.hive.cli.TestCliDriver.testCliDriver_allcolref_in_udf org.apache.hadoop.hive.cli.TestCliDriver.testCliDriver_annotate_stats_join org.apache.hadoop.hive.cli.TestCliDriver.testCliDriver_auto_join1 org.apache.hadoop.hive.cli.TestCliDriver.testCliDriver_auto_join14 org.apache.hadoop.hive.cli.TestCliDriver.testCliDriver_auto_join15 org.apache.hadoop.hive.cli.TestCliDriver.testCliDriver_auto_join17 org.apache.hadoop.hive.cli.TestCliDriver.testCliDriver_auto_join19 org.apache.hadoop.hive.cli.TestCliDriver.testCliDriver_auto_join2 org.apache.hadoop.hive.cli.TestCliDriver.testCliDriver_auto_join20 org.apache.hadoop.hive.cli.TestCliDriver.testCliDriver_auto_join21 org.apache.hadoop.hive.cli.TestCliDriver.testCliDriver_auto_join22 org.apache.hadoop.hive.cli.TestCliDriver.testCliDriver_auto_join23 org.apache.hadoop.hive.cli.TestCliDriver.testCliDriver_auto_join28 org.apache.hadoop.hive.cli.TestCliDriver.testCliDriver_auto_join29 org.apache.hadoop.hive.cli.TestCliDriver.testCliDriver_auto_join3 org.apache.hadoop.hive.cli.TestCliDriver.testCliDriver_auto_join32 org.apache.hadoop.hive.cli.TestCliDriver.testCliDriver_auto_join9 org.apache.hadoop.hive.cli.TestCliDriver.testCliDriver_auto_join_reordering_values org.apache.hadoop.hive.cli.TestCliDriver.testCliDriver_auto_smb_mapjoin_14 org.apache.hadoop.hive.cli.TestCliDriver.testCliDriver_auto_sortmerge_join_13 org.apache.hadoop.hive.cli.TestCliDriver.testCliDriver_bucketmapjoin1 org.apache.hadoop.hive.cli.TestCliDriver.testCliDriver_bucketmapjoin2 org.apache.hadoop.hive.cli.TestCliDriver.testCliDriver_bucketmapjoin3 org.apache.hadoop.hive.cli.TestCliDriver.testCliDriver_bucketmapjoin4 org.apache.hadoop.hive.cli.TestCliDriver.testCliDriver_bucketmapjoin5 org.apache.hadoop.hive.cli.TestCliDriver.testCliDriver_bucketmapjoin_negative org.apache.hadoop.hive.cli.TestCliDriver.testCliDriver_bucketmapjoin_negative2 org.apache.hadoop.hive.cli.TestCliDriver.testCliDriver_bucketmapjoin_negative3 org.apache.hadoop.hive.cli.TestCliDriver.testCliDriver_bucketsortoptimize_insert_2 org.apache.hadoop.hive.cli.TestCliDriver.testCliDriver_bucketsortoptimize_insert_4 org.apache.hadoop.hive.cli.TestCliDriver.testCliDriver_bucketsortoptimize_insert_5 org.apache.hadoop.hive.cli.TestCliDriver.testCliDriver_bucketsortoptimize_insert_6 org.apache.hadoop.hive.cli.TestCliDriver.testCliDriver_bucketsortoptimize_insert_7 org.apache.hadoop.hive.cli.TestCliDriver.testCliDriver_bucketsortoptimize_insert_8 org.apache.hadoop.hive.cli.TestCliDriver.testCliDriver_cluster org.apache.hadoop.hive.cli.TestCliDriver.testCliDriver_column_access_stats org.apache.hadoop.hive.cli.TestCliDriver.testCliDriver_constprog2 org.apache.hadoop.hive.cli.TestCliDriver.testCliDriver_correlationoptimizer1 org.apache.hadoop.hive.cli.TestCliDriver.testCliDriver_correlationoptimizer4 org.apache.hadoop.hive.cli.TestCliDriver.testCliDriver_correlationoptimizer5 org.apache.hadoop.hive.cli.TestCliDriver.testCliDriver_correlationoptimizer6 org.apache.hadoop.hive.cli.TestCliDriver.testCliDriver_cross_product_check_1 org.apache.hadoop.hive.cli.TestCliDriver.testCliDriver_cross_product_check_2 org.apache.hadoop.hive.cli.TestCliDriver.testCliDriver_explain_logical org.apache.hadoop.hive.cli.TestCliDriver.testCliDriver_filter_join_breaktask org.apache.hadoop.hive.cli.TestCliDriver.testCliDriver_index_auto_self_join org.apache.hadoop.hive.cli.TestCliDriver.testCliDriver_innerjoin org.apache.hadoop.hive.cli.TestCliDriver.testCliDriver_input23 org.apache.hadoop.hive.cli.TestCliDriver.testCliDriver_join14 org.apache.hadoop.hive.cli.TestCliDriver.testCliDriver_join15 org.apache.hadoop.hive.cli.TestCliDriver.testCliDriver_join17 org.apache.hadoop.hive.cli.TestCliDriver.testCliDriver_join2 org.apache.hadoop.hive.cli.TestCliDriver.testCliDriver_join20 org.apache.hadoop.hive.cli.TestCliDriver.testCliDriver_join21 org.apache.hadoop.hive.cli.TestCliDriver.testCliDriver_join22 org.apache.hadoop.hive.cli.TestCliDriver.testCliDriver_join23 org.apache.hadoop.hive.cli.TestCliDriver.testCliDriver_join25 org.apache.hadoop.hive.cli.TestCliDriver.testCliDriver_join26 org.apache.hadoop.hive.cli.TestCliDriver.testCliDriver_join27 org.apache.hadoop.hive.cli.TestCliDriver.testCliDriver_join3 org.apache.hadoop.hive.cli.TestCliDriver.testCliDriver_join32 org.apache.hadoop.hive.cli.TestCliDriver.testCliDriver_join32_lessSize org.apache.hadoop.hive.cli.TestCliDriver.testCliDriver_join33 org.apache.hadoop.hive.cli.TestCliDriver.testCliDriver_join36 org.apache.hadoop.hive.cli.TestCliDriver.testCliDriver_join37 org.apache.hadoop.hive.cli.TestCliDriver.testCliDriver_join38 org.apache.hadoop.hive.cli.TestCliDriver.testCliDriver_join39 org.apache.hadoop.hive.cli.TestCliDriver.testCliDriver_join40 org.apache.hadoop.hive.cli.TestCliDriver.testCliDriver_join41 org.apache.hadoop.hive.cli.TestCliDriver.testCliDriver_join9 org.apache.hadoop.hive.cli.TestCliDriver.testCliDriver_join_alt_syntax org.apache.hadoop.hive.cli.TestCliDriver.testCliDriver_join_cond_pushdown_1 org.apache.hadoop.hive.cli.TestCliDriver.testCliDriver_join_cond_pushdown_2 org.apache.hadoop.hive.cli.TestCliDriver.testCliDriver_join_cond_pushdown_3 org.apache.hadoop.hive.cli.TestCliDriver.testCliDriver_join_cond_pushdown_4 org.apache.hadoop.hive.cli.TestCliDriver.testCliDriver_join_cond_pushdown_unqual1 org.apache.hadoop.hive.cli.TestCliDriver.testCliDriver_join_cond_pushdown_unqual2 org.apache.hadoop.hive.cli.TestCliDriver.testCliDriver_join_cond_pushdown_unqual3 org.apache.hadoop.hive.cli.TestCliDriver.testCliDriver_join_cond_pushdown_unqual4 org.apache.hadoop.hive.cli.TestCliDriver.testCliDriver_join_filters_overlap org.apache.hadoop.hive.cli.TestCliDriver.testCliDriver_join_hive_626 org.apache.hadoop.hive.cli.TestCliDriver.testCliDriver_join_map_ppr org.apache.hadoop.hive.cli.TestCliDriver.testCliDriver_join_merging org.apache.hadoop.hive.cli.TestCliDriver.testCliDriver_join_nullsafe org.apache.hadoop.hive.cli.TestCliDriver.testCliDriver_join_rc org.apache.hadoop.hive.cli.TestCliDriver.testCliDriver_join_reorder org.apache.hadoop.hive.cli.TestCliDriver.testCliDriver_join_reorder2 org.apache.hadoop.hive.cli.TestCliDriver.testCliDriver_join_reorder3 org.apache.hadoop.hive.cli.TestCliDriver.testCliDriver_join_reorder4 org.apache.hadoop.hive.cli.TestCliDriver.testCliDriver_join_star org.apache.hadoop.hive.cli.TestCliDriver.testCliDriver_join_thrift org.apache.hadoop.hive.cli.TestCliDriver.testCliDriver_join_vc org.apache.hadoop.hive.cli.TestCliDriver.testCliDriver_join_view org.apache.hadoop.hive.cli.TestCliDriver.testCliDriver_lateral_view org.apache.hadoop.hive.cli.TestCliDriver.testCliDriver_lateral_view_cp org.apache.hadoop.hive.cli.TestCliDriver.testCliDriver_lateral_view_noalias org.apache.hadoop.hive.cli.TestCliDriver.testCliDriver_lateral_view_outer org.apache.hadoop.hive.cli.TestCliDriver.testCliDriver_lateral_view_ppd org.apache.hadoop.hive.cli.TestCliDriver.testCliDriver_limit_pushdown_negative org.apache.hadoop.hive.cli.TestCliDriver.testCliDriver_lineage1 org.apache.hadoop.hive.cli.TestCliDriver.testCliDriver_louter_join_ppr org.apache.hadoop.hive.cli.TestCliDriver.testCliDriver_mapjoin1 org.apache.hadoop.hive.cli.TestCliDriver.testCliDriver_mapjoin_filter_on_outerjoin org.apache.hadoop.hive.cli.TestCliDriver.testCliDriver_mapjoin_memcheck org.apache.hadoop.hive.cli.TestCliDriver.testCliDriver_mapjoin_subquery2 org.apache.hadoop.hive.cli.TestCliDriver.testCliDriver_mapjoin_test_outer org.apache.hadoop.hive.cli.TestCliDriver.testCliDriver_mergejoins org.apache.hadoop.hive.cli.TestCliDriver.testCliDriver_mergejoins_mixed org.apache.hadoop.hive.cli.TestCliDriver.testCliDriver_multiMapJoin1 org.apache.hadoop.hive.cli.TestCliDriver.testCliDriver_multi_insert_lateral_view org.apache.hadoop.hive.cli.TestCliDriver.testCliDriver_multi_join_union org.apache.hadoop.hive.cli.TestCliDriver.testCliDriver_no_hooks org.apache.hadoop.hive.cli.TestCliDriver.testCliDriver_nonmr_fetch org.apache.hadoop.hive.cli.TestCliDriver.testCliDriver_optional_outer org.apache.hadoop.hive.cli.TestCliDriver.testCliDriver_outer_join_ppr org.apache.hadoop.hive.cli.TestCliDriver.testCliDriver_pcr org.apache.hadoop.hive.cli.TestCliDriver.testCliDriver_ppd_join5 org.apache.hadoop.hive.cli.TestCliDriver.testCliDriver_ppd_join_filter org.apache.hadoop.hive.cli.TestCliDriver.testCliDriver_ppd_outer_join1 org.apache.hadoop.hive.cli.TestCliDriver.testCliDriver_ppd_outer_join2 org.apache.hadoop.hive.cli.TestCliDriver.testCliDriver_ppd_outer_join3 org.apache.hadoop.hive.cli.TestCliDriver.testCliDriver_ppd_outer_join4 org.apache.hadoop.hive.cli.TestCliDriver.testCliDriver_ppd_outer_join5 org.apache.hadoop.hive.cli.TestCliDriver.testCliDriver_ppd_repeated_alias org.apache.hadoop.hive.cli.TestCliDriver.testCliDriver_ppd_udf_case org.apache.hadoop.hive.cli.TestCliDriver.testCliDriver_ppd_union_view org.apache.hadoop.hive.cli.TestCliDriver.testCliDriver_ppd_vc org.apache.hadoop.hive.cli.TestCliDriver.testCliDriver_ptf org.apache.hadoop.hive.cli.TestCliDriver.testCliDriver_quotedid_skew org.apache.hadoop.hive.cli.TestCliDriver.testCliDriver_regex_col org.apache.hadoop.hive.cli.TestCliDriver.testCliDriver_router_join_ppr org.apache.hadoop.hive.cli.TestCliDriver.testCliDriver_sample8 org.apache.hadoop.hive.cli.TestCliDriver.testCliDriver_semijoin org.apache.hadoop.hive.cli.TestCliDriver.testCliDriver_skewjoin org.apache.hadoop.hive.cli.TestCliDriver.testCliDriver_skewjoin_union_remove_1 org.apache.hadoop.hive.cli.TestCliDriver.testCliDriver_skewjoin_union_remove_2 org.apache.hadoop.hive.cli.TestCliDriver.testCliDriver_skewjoinopt1 org.apache.hadoop.hive.cli.TestCliDriver.testCliDriver_skewjoinopt10 org.apache.hadoop.hive.cli.TestCliDriver.testCliDriver_skewjoinopt11 org.apache.hadoop.hive.cli.TestCliDriver.testCliDriver_skewjoinopt12 org.apache.hadoop.hive.cli.TestCliDriver.testCliDriver_skewjoinopt13 org.apache.hadoop.hive.cli.TestCliDriver.testCliDriver_skewjoinopt14 org.apache.hadoop.hive.cli.TestCliDriver.testCliDriver_skewjoinopt15 org.apache.hadoop.hive.cli.TestCliDriver.testCliDriver_skewjoinopt16 org.apache.hadoop.hive.cli.TestCliDriver.testCliDriver_skewjoinopt17 org.apache.hadoop.hive.cli.TestCliDriver.testCliDriver_skewjoinopt18 org.apache.hadoop.hive.cli.TestCliDriver.testCliDriver_skewjoinopt19 org.apache.hadoop.hive.cli.TestCliDriver.testCliDriver_skewjoinopt2 org.apache.hadoop.hive.cli.TestCliDriver.testCliDriver_skewjoinopt20 org.apache.hadoop.hive.cli.TestCliDriver.testCliDriver_skewjoinopt3 org.apache.hadoop.hive.cli.TestCliDriver.testCliDriver_skewjoinopt4 org.apache.hadoop.hive.cli.TestCliDriver.testCliDriver_skewjoinopt5 org.apache.hadoop.hive.cli.TestCliDriver.testCliDriver_skewjoinopt6 org.apache.hadoop.hive.cli.TestCliDriver.testCliDriver_skewjoinopt7 org.apache.hadoop.hive.cli.TestCliDriver.testCliDriver_skewjoinopt8 org.apache.hadoop.hive.cli.TestCliDriver.testCliDriver_smb_mapjoin9 org.apache.hadoop.hive.cli.TestCliDriver.testCliDriver_smb_mapjoin_1 org.apache.hadoop.hive.cli.TestCliDriver.testCliDriver_smb_mapjoin_10 org.apache.hadoop.hive.cli.TestCliDriver.testCliDriver_smb_mapjoin_11 org.apache.hadoop.hive.cli.TestCliDriver.testCliDriver_smb_mapjoin_12 org.apache.hadoop.hive.cli.TestCliDriver.testCliDriver_smb_mapjoin_13 org.apache.hadoop.hive.cli.TestCliDriver.testCliDriver_smb_mapjoin_15 org.apache.hadoop.hive.cli.TestCliDriver.testCliDriver_smb_mapjoin_2 org.apache.hadoop.hive.cli.TestCliDriver.testCliDriver_smb_mapjoin_3 org.apache.hadoop.hive.cli.TestCliDriver.testCliDriver_smb_mapjoin_4 org.apache.hadoop.hive.cli.TestCliDriver.testCliDriver_smb_mapjoin_5 org.apache.hadoop.hive.cli.TestCliDriver.testCliDriver_smb_mapjoin_6 org.apache.hadoop.hive.cli.TestCliDriver.testCliDriver_smb_mapjoin_7 org.apache.hadoop.hive.cli.TestCliDriver.testCliDriver_stats11 org.apache.hadoop.hive.cli.TestCliDriver.testCliDriver_subquery_multiinsert org.apache.hadoop.hive.cli.TestCliDriver.testCliDriver_subquery_notexists org.apache.hadoop.hive.cli.TestCliDriver.testCliDriver_subquery_notin org.apache.hadoop.hive.cli.TestCliDriver.testCliDriver_subquery_unqualcolumnrefs org.apache.hadoop.hive.cli.TestCliDriver.testCliDriver_subquery_views org.apache.hadoop.hive.cli.TestCliDriver.testCliDriver_temp_table_join1 org.apache.hadoop.hive.cli.TestCliDriver.testCliDriver_temp_table_windowing_expressions org.apache.hadoop.hive.cli.TestCliDriver.testCliDriver_udtf_json_tuple org.apache.hadoop.hive.cli.TestCliDriver.testCliDriver_udtf_parse_url_tuple org.apache.hadoop.hive.cli.TestCliDriver.testCliDriver_udtf_stack org.apache.hadoop.hive.cli.TestCliDriver.testCliDriver_union22 org.apache.hadoop.hive.cli.TestCliDriver.testCliDriver_union24 org.apache.hadoop.hive.cli.TestCliDriver.testCliDriver_union26 org.apache.hadoop.hive.cli.TestCliDriver.testCliDriver_union27 org.apache.hadoop.hive.cli.TestCliDriver.testCliDriver_union32 org.apache.hadoop.hive.cli.TestCliDriver.testCliDriver_union_remove_12 org.apache.hadoop.hive.cli.TestCliDriver.testCliDriver_union_remove_13 org.apache.hadoop.hive.cli.TestCliDriver.testCliDriver_union_remove_14 org.apache.hadoop.hive.cli.TestCliDriver.testCliDriver_union_top_level org.apache.hadoop.hive.cli.TestCliDriver.testCliDriver_vector_decimal_mapjoin org.apache.hadoop.hive.cli.TestCliDriver.testCliDriver_vectorized_bucketmapjoin1 org.apache.hadoop.hive.cli.TestCliDriver.testCliDriver_vectorized_context org.apache.hadoop.hive.cli.TestCliDriver.testCliDriver_vectorized_mapjoin org.apache.hadoop.hive.cli.TestCliDriver.testCliDriver_vectorized_nested_mapjoin org.apache.hadoop.hive.cli.TestCliDriver.testCliDriver_vectorized_ptf org.apache.hadoop.hive.cli.TestCliDriver.testCliDriver_vectorized_shufflejoin org.apache.hadoop.hive.cli.TestCliDriver.testCliDriver_windowing org.apache.hadoop.hive.cli.TestCliDriver.testCliDriver_windowing_expressions org.apache.hadoop.hive.cli.TestMiniTezCliDriver.testCliDriver_auto_join1 org.apache.hadoop.hive.cli.TestMiniTezCliDriver.testCliDriver_bucket_map_join_tez1 org.apache.hadoop.hive.cli.TestMiniTezCliDriver.testCliDriver_bucket_map_join_tez2 org.apache.hadoop.hive.cli.TestMiniTezCliDriver.testCliDriver_cross_product_check_1 org.apache.hadoop.hive.cli.TestMiniTezCliDriver.testCliDriver_cross_product_check_2 org.apache.hadoop.hive.cli.TestMiniTezCliDriver.testCliDriver_dynpart_sort_opt_vectorization org.apache.hadoop.hive.cli.TestMiniTezCliDriver.testCliDriver_filter_join_breaktask org.apache.hadoop.hive.cli.TestMiniTezCliDriver.testCliDriver_join1 org.apache.hadoop.hive.cli.TestMiniTezCliDriver.testCliDriver_mapjoin_decimal org.apache.hadoop.hive.cli.TestMiniTezCliDriver.testCliDriver_mrr org.apache.hadoop.hive.cli.TestMiniTezCliDriver.testCliDriver_ptf org.apache.hadoop.hive.cli.TestMiniTezCliDriver.testCliDriver_tez_join_hash org.apache.hadoop.hive.cli.TestMiniTezCliDriver.testCliDriver_tez_join_tests org.apache.hadoop.hive.cli.TestMiniTezCliDriver.testCliDriver_tez_joins_explain org.apache.hadoop.hive.cli.TestMiniTezCliDriver.testCliDriver_tez_union org.apache.hadoop.hive.cli.TestMiniTezCliDriver.testCliDriver_vectorized_mapjoin org.apache.hadoop.hive.cli.TestMiniTezCliDriver.testCliDriver_vectorized_nested_mapjoin org.apache.hadoop.hive.cli.TestMiniTezCliDriver.testCliDriver_vectorized_ptf org.apache.hadoop.hive.cli.TestMiniTezCliDriver.testCliDriver_vectorized_shufflejoin org.apache.hadoop.hive.cli.TestMinimrCliDriver.testCliDriver_bucketmapjoin7 org.apache.hadoop.hive.cli.TestMinimrCliDriver.testCliDriver_infer_bucket_sort_map_operators org.apache.hadoop.hive.cli.TestMinimrCliDriver.testCliDriver_join1 org.apache.hadoop.hive.cli.TestNegativeCliDriver.testNegativeCliDriver_bucket_mapjoin_mismatch1 org.apache.hadoop.hive.cli.TestNegativeCliDriver.testNegativeCliDriver_sortmerge_mapjoin_mismatch_1 org.apache.hadoop.hive.cli.TestNegativeCliDriver.testNegativeCliDriver_udf_assert_true org.apache.hadoop.hive.cli.TestNegativeCliDriver.testNegativeCliDriver_udf_assert_true2 org.apache.hadoop.hive.ql.TestMTQueries.testMTQueries1 org.apache.hadoop.hive.ql.io.orc.TestInputOutputFormat.testInOutFormat org.apache.hadoop.hive.ql.parse.TestParse.testParse_case_sensitivity org.apache.hadoop.hive.ql.parse.TestParse.testParse_cast1 org.apache.hadoop.hive.ql.parse.TestParse.testParse_groupby1 org.apache.hadoop.hive.ql.parse.TestParse.testParse_groupby2 org.apache.hadoop.hive.ql.parse.TestParse.testParse_groupby3 org.apache.hadoop.hive.ql.parse.TestParse.testParse_groupby4 org.apache.hadoop.hive.ql.parse.TestParse.testParse_groupby5 org.apache.hadoop.hive.ql.parse.TestParse.testParse_groupby6 org.apache.hadoop.hive.ql.parse.TestParse.testParse_input1 org.apache.hadoop.hive.ql.parse.TestParse.testParse_input2 org.apache.hadoop.hive.ql.parse.TestParse.testParse_input20 org.apache.hadoop.hive.ql.parse.TestParse.testParse_input3 org.apache.hadoop.hive.ql.parse.TestParse.testParse_input4 org.apache.hadoop.hive.ql.parse.TestParse.testParse_input5 org.apache.hadoop.hive.ql.parse.TestParse.testParse_input6 org.apache.hadoop.hive.ql.parse.TestParse.testParse_input7 org.apache.hadoop.hive.ql.parse.TestParse.testParse_input8 org.apache.hadoop.hive.ql.parse.TestParse.testParse_input9 org.apache.hadoop.hive.ql.parse.TestParse.testParse_input_part1 org.apache.hadoop.hive.ql.parse.TestParse.testParse_input_testsequencefile org.apache.hadoop.hive.ql.parse.TestParse.testParse_input_testxpath org.apache.hadoop.hive.ql.parse.TestParse.testParse_input_testxpath2 org.apache.hadoop.hive.ql.parse.TestParse.testParse_join1 org.apache.hadoop.hive.ql.parse.TestParse.testParse_join2 org.apache.hadoop.hive.ql.parse.TestParse.testParse_join3 org.apache.hadoop.hive.ql.parse.TestParse.testParse_join4 org.apache.hadoop.hive.ql.parse.TestParse.testParse_join5 org.apache.hadoop.hive.ql.parse.TestParse.testParse_join6 org.apache.hadoop.hive.ql.parse.TestParse.testParse_join7 org.apache.hadoop.hive.ql.parse.TestParse.testParse_join8 org.apache.hadoop.hive.ql.parse.TestParse.testParse_sample1 org.apache.hadoop.hive.ql.parse.TestParse.testParse_sample2 org.apache.hadoop.hive.ql.parse.TestParse.testParse_sample3 org.apache.hadoop.hive.ql.parse.TestParse.testParse_sample4 org.apache.hadoop.hive.ql.parse.TestParse.testParse_sample5 org.apache.hadoop.hive.ql.parse.TestParse.testParse_sample6 org.apache.hadoop.hive.ql.parse.TestParse.testParse_sample7 org.apache.hadoop.hive.ql.parse.TestParse.testParse_subq org.apache.hadoop.hive.ql.parse.TestParse.testParse_udf1 org.apache.hadoop.hive.ql.parse.TestParse.testParse_udf4 org.apache.hadoop.hive.ql.parse.TestParse.testParse_udf6 org.apache.hadoop.hive.ql.parse.TestParse.testParse_udf_case org.apache.hadoop.hive.ql.parse.TestParse.testParse_udf_when org.apache.hadoop.hive.ql.parse.TestParse.testParse_union org.apache.hive.jdbc.TestJdbcDriver2.testDatabaseMetaData Test results: http://ec2-174-129-184-35.compute-1.amazonaws.com/jenkins/job/PreCommit-HIVE-TRUNK-Build/296/testReport Console output: http://ec2-174-129-184-35.compute-1.amazonaws.com/jenkins/job/PreCommit-HIVE-TRUNK-Build/296/console Test logs: http://ec2-174-129-184-35.compute-1.amazonaws.com/logs/PreCommit-HIVE-TRUNK-Build-296/ Messages: Executing org.apache.hive.ptest.execution.PrepPhase Executing org.apache.hive.ptest.execution.ExecutionPhase Executing org.apache.hive.ptest.execution.ReportingPhase Tests exited with: TestsFailedException: 270 tests failed This message is automatically generated. ATTACHMENT ID: 12661557
          Hide
          Eugene Koifman added a comment -

          bunch of .q.out file changes

          Show
          Eugene Koifman added a comment - bunch of .q.out file changes
          Hide
          Hive QA added a comment -

          Overall: -1 at least one tests failed

          Here are the results of testing the latest attachment:
          https://issues.apache.org/jira/secure/attachment/12661639/HIVE-7513.11.patch

          ERROR: -1 due to 89 failed/errored test(s), 5894 tests executed
          Failed tests:

          org.apache.hadoop.hive.cli.TestCliDriver.testCliDriver_join_merging
          org.apache.hadoop.hive.cli.TestCliDriver.testCliDriver_join_star
          org.apache.hadoop.hive.cli.TestCliDriver.testCliDriver_join_thrift
          org.apache.hadoop.hive.cli.TestCliDriver.testCliDriver_join_vc
          org.apache.hadoop.hive.cli.TestCliDriver.testCliDriver_join_view
          org.apache.hadoop.hive.cli.TestCliDriver.testCliDriver_smb_mapjoin_1
          org.apache.hadoop.hive.cli.TestCliDriver.testCliDriver_smb_mapjoin_2
          org.apache.hadoop.hive.cli.TestCliDriver.testCliDriver_smb_mapjoin_3
          org.apache.hadoop.hive.cli.TestCliDriver.testCliDriver_smb_mapjoin_4
          org.apache.hadoop.hive.cli.TestCliDriver.testCliDriver_smb_mapjoin_5
          org.apache.hadoop.hive.cli.TestCliDriver.testCliDriver_smb_mapjoin_6
          org.apache.hadoop.hive.cli.TestCliDriver.testCliDriver_smb_mapjoin_7
          org.apache.hadoop.hive.cli.TestCliDriver.testCliDriver_subquery_multiinsert
          org.apache.hadoop.hive.cli.TestCliDriver.testCliDriver_subquery_notexists
          org.apache.hadoop.hive.cli.TestCliDriver.testCliDriver_subquery_notin
          org.apache.hadoop.hive.cli.TestCliDriver.testCliDriver_subquery_unqualcolumnrefs
          org.apache.hadoop.hive.cli.TestCliDriver.testCliDriver_subquery_views
          org.apache.hadoop.hive.cli.TestCliDriver.testCliDriver_temp_table_join1
          org.apache.hadoop.hive.cli.TestCliDriver.testCliDriver_temp_table_windowing_expressions
          org.apache.hadoop.hive.cli.TestCliDriver.testCliDriver_udtf_json_tuple
          org.apache.hadoop.hive.cli.TestCliDriver.testCliDriver_udtf_parse_url_tuple
          org.apache.hadoop.hive.cli.TestCliDriver.testCliDriver_udtf_stack
          org.apache.hadoop.hive.cli.TestMiniTezCliDriver.testCliDriver_dynpart_sort_opt_vectorization
          org.apache.hadoop.hive.cli.TestMiniTezCliDriver.testCliDriver_mapjoin_decimal
          org.apache.hadoop.hive.cli.TestMiniTezCliDriver.testCliDriver_mrr
          org.apache.hadoop.hive.cli.TestMiniTezCliDriver.testCliDriver_ptf
          org.apache.hadoop.hive.cli.TestMiniTezCliDriver.testCliDriver_tez_join_hash
          org.apache.hadoop.hive.cli.TestMiniTezCliDriver.testCliDriver_tez_join_tests
          org.apache.hadoop.hive.cli.TestMiniTezCliDriver.testCliDriver_tez_joins_explain
          org.apache.hadoop.hive.cli.TestMiniTezCliDriver.testCliDriver_tez_union
          org.apache.hadoop.hive.cli.TestMiniTezCliDriver.testCliDriver_vectorized_mapjoin
          org.apache.hadoop.hive.cli.TestMiniTezCliDriver.testCliDriver_vectorized_nested_mapjoin
          org.apache.hadoop.hive.cli.TestMiniTezCliDriver.testCliDriver_vectorized_ptf
          org.apache.hadoop.hive.cli.TestMiniTezCliDriver.testCliDriver_vectorized_shufflejoin
          org.apache.hadoop.hive.cli.TestMinimrCliDriver.testCliDriver_bucketmapjoin7
          org.apache.hadoop.hive.cli.TestMinimrCliDriver.testCliDriver_infer_bucket_sort_map_operators
          org.apache.hadoop.hive.cli.TestMinimrCliDriver.testCliDriver_join1
          org.apache.hadoop.hive.cli.TestNegativeCliDriver.testNegativeCliDriver_bucket_mapjoin_mismatch1
          org.apache.hadoop.hive.cli.TestNegativeCliDriver.testNegativeCliDriver_sortmerge_mapjoin_mismatch_1
          org.apache.hadoop.hive.cli.TestNegativeCliDriver.testNegativeCliDriver_udf_assert_true
          org.apache.hadoop.hive.cli.TestNegativeCliDriver.testNegativeCliDriver_udf_assert_true2
          org.apache.hadoop.hive.ql.TestMTQueries.testMTQueries1
          org.apache.hadoop.hive.ql.io.orc.TestInputOutputFormat.testInOutFormat
          org.apache.hadoop.hive.ql.parse.TestParse.testParse_case_sensitivity
          org.apache.hadoop.hive.ql.parse.TestParse.testParse_cast1
          org.apache.hadoop.hive.ql.parse.TestParse.testParse_groupby1
          org.apache.hadoop.hive.ql.parse.TestParse.testParse_groupby2
          org.apache.hadoop.hive.ql.parse.TestParse.testParse_groupby3
          org.apache.hadoop.hive.ql.parse.TestParse.testParse_groupby4
          org.apache.hadoop.hive.ql.parse.TestParse.testParse_groupby5
          org.apache.hadoop.hive.ql.parse.TestParse.testParse_groupby6
          org.apache.hadoop.hive.ql.parse.TestParse.testParse_input1
          org.apache.hadoop.hive.ql.parse.TestParse.testParse_input2
          org.apache.hadoop.hive.ql.parse.TestParse.testParse_input20
          org.apache.hadoop.hive.ql.parse.TestParse.testParse_input3
          org.apache.hadoop.hive.ql.parse.TestParse.testParse_input4
          org.apache.hadoop.hive.ql.parse.TestParse.testParse_input5
          org.apache.hadoop.hive.ql.parse.TestParse.testParse_input6
          org.apache.hadoop.hive.ql.parse.TestParse.testParse_input7
          org.apache.hadoop.hive.ql.parse.TestParse.testParse_input8
          org.apache.hadoop.hive.ql.parse.TestParse.testParse_input9
          org.apache.hadoop.hive.ql.parse.TestParse.testParse_input_part1
          org.apache.hadoop.hive.ql.parse.TestParse.testParse_input_testsequencefile
          org.apache.hadoop.hive.ql.parse.TestParse.testParse_input_testxpath
          org.apache.hadoop.hive.ql.parse.TestParse.testParse_input_testxpath2
          org.apache.hadoop.hive.ql.parse.TestParse.testParse_join1
          org.apache.hadoop.hive.ql.parse.TestParse.testParse_join2
          org.apache.hadoop.hive.ql.parse.TestParse.testParse_join3
          org.apache.hadoop.hive.ql.parse.TestParse.testParse_join4
          org.apache.hadoop.hive.ql.parse.TestParse.testParse_join5
          org.apache.hadoop.hive.ql.parse.TestParse.testParse_join6
          org.apache.hadoop.hive.ql.parse.TestParse.testParse_join7
          org.apache.hadoop.hive.ql.parse.TestParse.testParse_join8
          org.apache.hadoop.hive.ql.parse.TestParse.testParse_sample1
          org.apache.hadoop.hive.ql.parse.TestParse.testParse_sample2
          org.apache.hadoop.hive.ql.parse.TestParse.testParse_sample3
          org.apache.hadoop.hive.ql.parse.TestParse.testParse_sample4
          org.apache.hadoop.hive.ql.parse.TestParse.testParse_sample5
          org.apache.hadoop.hive.ql.parse.TestParse.testParse_sample6
          org.apache.hadoop.hive.ql.parse.TestParse.testParse_sample7
          org.apache.hadoop.hive.ql.parse.TestParse.testParse_subq
          org.apache.hadoop.hive.ql.parse.TestParse.testParse_udf1
          org.apache.hadoop.hive.ql.parse.TestParse.testParse_udf4
          org.apache.hadoop.hive.ql.parse.TestParse.testParse_udf6
          org.apache.hadoop.hive.ql.parse.TestParse.testParse_udf_case
          org.apache.hadoop.hive.ql.parse.TestParse.testParse_udf_when
          org.apache.hadoop.hive.ql.parse.TestParse.testParse_union
          org.apache.hive.jdbc.TestJdbcDriver2.testDatabaseMetaData
          org.apache.hive.jdbc.miniHS2.TestHiveServer2.testConnection
          

          Test results: http://ec2-174-129-184-35.compute-1.amazonaws.com/jenkins/job/PreCommit-HIVE-TRUNK-Build/308/testReport
          Console output: http://ec2-174-129-184-35.compute-1.amazonaws.com/jenkins/job/PreCommit-HIVE-TRUNK-Build/308/console
          Test logs: http://ec2-174-129-184-35.compute-1.amazonaws.com/logs/PreCommit-HIVE-TRUNK-Build-308/

          Messages:

          Executing org.apache.hive.ptest.execution.PrepPhase
          Executing org.apache.hive.ptest.execution.ExecutionPhase
          Executing org.apache.hive.ptest.execution.ReportingPhase
          Tests exited with: TestsFailedException: 89 tests failed
          

          This message is automatically generated.

          ATTACHMENT ID: 12661639

          Show
          Hive QA added a comment - Overall : -1 at least one tests failed Here are the results of testing the latest attachment: https://issues.apache.org/jira/secure/attachment/12661639/HIVE-7513.11.patch ERROR: -1 due to 89 failed/errored test(s), 5894 tests executed Failed tests: org.apache.hadoop.hive.cli.TestCliDriver.testCliDriver_join_merging org.apache.hadoop.hive.cli.TestCliDriver.testCliDriver_join_star org.apache.hadoop.hive.cli.TestCliDriver.testCliDriver_join_thrift org.apache.hadoop.hive.cli.TestCliDriver.testCliDriver_join_vc org.apache.hadoop.hive.cli.TestCliDriver.testCliDriver_join_view org.apache.hadoop.hive.cli.TestCliDriver.testCliDriver_smb_mapjoin_1 org.apache.hadoop.hive.cli.TestCliDriver.testCliDriver_smb_mapjoin_2 org.apache.hadoop.hive.cli.TestCliDriver.testCliDriver_smb_mapjoin_3 org.apache.hadoop.hive.cli.TestCliDriver.testCliDriver_smb_mapjoin_4 org.apache.hadoop.hive.cli.TestCliDriver.testCliDriver_smb_mapjoin_5 org.apache.hadoop.hive.cli.TestCliDriver.testCliDriver_smb_mapjoin_6 org.apache.hadoop.hive.cli.TestCliDriver.testCliDriver_smb_mapjoin_7 org.apache.hadoop.hive.cli.TestCliDriver.testCliDriver_subquery_multiinsert org.apache.hadoop.hive.cli.TestCliDriver.testCliDriver_subquery_notexists org.apache.hadoop.hive.cli.TestCliDriver.testCliDriver_subquery_notin org.apache.hadoop.hive.cli.TestCliDriver.testCliDriver_subquery_unqualcolumnrefs org.apache.hadoop.hive.cli.TestCliDriver.testCliDriver_subquery_views org.apache.hadoop.hive.cli.TestCliDriver.testCliDriver_temp_table_join1 org.apache.hadoop.hive.cli.TestCliDriver.testCliDriver_temp_table_windowing_expressions org.apache.hadoop.hive.cli.TestCliDriver.testCliDriver_udtf_json_tuple org.apache.hadoop.hive.cli.TestCliDriver.testCliDriver_udtf_parse_url_tuple org.apache.hadoop.hive.cli.TestCliDriver.testCliDriver_udtf_stack org.apache.hadoop.hive.cli.TestMiniTezCliDriver.testCliDriver_dynpart_sort_opt_vectorization org.apache.hadoop.hive.cli.TestMiniTezCliDriver.testCliDriver_mapjoin_decimal org.apache.hadoop.hive.cli.TestMiniTezCliDriver.testCliDriver_mrr org.apache.hadoop.hive.cli.TestMiniTezCliDriver.testCliDriver_ptf org.apache.hadoop.hive.cli.TestMiniTezCliDriver.testCliDriver_tez_join_hash org.apache.hadoop.hive.cli.TestMiniTezCliDriver.testCliDriver_tez_join_tests org.apache.hadoop.hive.cli.TestMiniTezCliDriver.testCliDriver_tez_joins_explain org.apache.hadoop.hive.cli.TestMiniTezCliDriver.testCliDriver_tez_union org.apache.hadoop.hive.cli.TestMiniTezCliDriver.testCliDriver_vectorized_mapjoin org.apache.hadoop.hive.cli.TestMiniTezCliDriver.testCliDriver_vectorized_nested_mapjoin org.apache.hadoop.hive.cli.TestMiniTezCliDriver.testCliDriver_vectorized_ptf org.apache.hadoop.hive.cli.TestMiniTezCliDriver.testCliDriver_vectorized_shufflejoin org.apache.hadoop.hive.cli.TestMinimrCliDriver.testCliDriver_bucketmapjoin7 org.apache.hadoop.hive.cli.TestMinimrCliDriver.testCliDriver_infer_bucket_sort_map_operators org.apache.hadoop.hive.cli.TestMinimrCliDriver.testCliDriver_join1 org.apache.hadoop.hive.cli.TestNegativeCliDriver.testNegativeCliDriver_bucket_mapjoin_mismatch1 org.apache.hadoop.hive.cli.TestNegativeCliDriver.testNegativeCliDriver_sortmerge_mapjoin_mismatch_1 org.apache.hadoop.hive.cli.TestNegativeCliDriver.testNegativeCliDriver_udf_assert_true org.apache.hadoop.hive.cli.TestNegativeCliDriver.testNegativeCliDriver_udf_assert_true2 org.apache.hadoop.hive.ql.TestMTQueries.testMTQueries1 org.apache.hadoop.hive.ql.io.orc.TestInputOutputFormat.testInOutFormat org.apache.hadoop.hive.ql.parse.TestParse.testParse_case_sensitivity org.apache.hadoop.hive.ql.parse.TestParse.testParse_cast1 org.apache.hadoop.hive.ql.parse.TestParse.testParse_groupby1 org.apache.hadoop.hive.ql.parse.TestParse.testParse_groupby2 org.apache.hadoop.hive.ql.parse.TestParse.testParse_groupby3 org.apache.hadoop.hive.ql.parse.TestParse.testParse_groupby4 org.apache.hadoop.hive.ql.parse.TestParse.testParse_groupby5 org.apache.hadoop.hive.ql.parse.TestParse.testParse_groupby6 org.apache.hadoop.hive.ql.parse.TestParse.testParse_input1 org.apache.hadoop.hive.ql.parse.TestParse.testParse_input2 org.apache.hadoop.hive.ql.parse.TestParse.testParse_input20 org.apache.hadoop.hive.ql.parse.TestParse.testParse_input3 org.apache.hadoop.hive.ql.parse.TestParse.testParse_input4 org.apache.hadoop.hive.ql.parse.TestParse.testParse_input5 org.apache.hadoop.hive.ql.parse.TestParse.testParse_input6 org.apache.hadoop.hive.ql.parse.TestParse.testParse_input7 org.apache.hadoop.hive.ql.parse.TestParse.testParse_input8 org.apache.hadoop.hive.ql.parse.TestParse.testParse_input9 org.apache.hadoop.hive.ql.parse.TestParse.testParse_input_part1 org.apache.hadoop.hive.ql.parse.TestParse.testParse_input_testsequencefile org.apache.hadoop.hive.ql.parse.TestParse.testParse_input_testxpath org.apache.hadoop.hive.ql.parse.TestParse.testParse_input_testxpath2 org.apache.hadoop.hive.ql.parse.TestParse.testParse_join1 org.apache.hadoop.hive.ql.parse.TestParse.testParse_join2 org.apache.hadoop.hive.ql.parse.TestParse.testParse_join3 org.apache.hadoop.hive.ql.parse.TestParse.testParse_join4 org.apache.hadoop.hive.ql.parse.TestParse.testParse_join5 org.apache.hadoop.hive.ql.parse.TestParse.testParse_join6 org.apache.hadoop.hive.ql.parse.TestParse.testParse_join7 org.apache.hadoop.hive.ql.parse.TestParse.testParse_join8 org.apache.hadoop.hive.ql.parse.TestParse.testParse_sample1 org.apache.hadoop.hive.ql.parse.TestParse.testParse_sample2 org.apache.hadoop.hive.ql.parse.TestParse.testParse_sample3 org.apache.hadoop.hive.ql.parse.TestParse.testParse_sample4 org.apache.hadoop.hive.ql.parse.TestParse.testParse_sample5 org.apache.hadoop.hive.ql.parse.TestParse.testParse_sample6 org.apache.hadoop.hive.ql.parse.TestParse.testParse_sample7 org.apache.hadoop.hive.ql.parse.TestParse.testParse_subq org.apache.hadoop.hive.ql.parse.TestParse.testParse_udf1 org.apache.hadoop.hive.ql.parse.TestParse.testParse_udf4 org.apache.hadoop.hive.ql.parse.TestParse.testParse_udf6 org.apache.hadoop.hive.ql.parse.TestParse.testParse_udf_case org.apache.hadoop.hive.ql.parse.TestParse.testParse_udf_when org.apache.hadoop.hive.ql.parse.TestParse.testParse_union org.apache.hive.jdbc.TestJdbcDriver2.testDatabaseMetaData org.apache.hive.jdbc.miniHS2.TestHiveServer2.testConnection Test results: http://ec2-174-129-184-35.compute-1.amazonaws.com/jenkins/job/PreCommit-HIVE-TRUNK-Build/308/testReport Console output: http://ec2-174-129-184-35.compute-1.amazonaws.com/jenkins/job/PreCommit-HIVE-TRUNK-Build/308/console Test logs: http://ec2-174-129-184-35.compute-1.amazonaws.com/logs/PreCommit-HIVE-TRUNK-Build-308/ Messages: Executing org.apache.hive.ptest.execution.PrepPhase Executing org.apache.hive.ptest.execution.ExecutionPhase Executing org.apache.hive.ptest.execution.ReportingPhase Tests exited with: TestsFailedException: 89 tests failed This message is automatically generated. ATTACHMENT ID: 12661639
          Hide
          Eugene Koifman added a comment -

          fixed remaining golden files

          Show
          Eugene Koifman added a comment - fixed remaining golden files
          Hide
          Eugene Koifman added a comment -

          HIVE-7513.codeOnly.txt is here to make review easier - just has the code changes, not the test updates.

          Show
          Eugene Koifman added a comment - HIVE-7513 .codeOnly.txt is here to make review easier - just has the code changes, not the test updates.
          Hide
          Alan Gates added a comment -

          This patch is almost ready. I have a couple of comments (see below) but they aren't blockers to getting this checked in. Things we do need to address before checkin:

          • Need blessing from Owen or Prasanth (both of whom understand ORC better than me) that the changes to OrcInputFormat are ok.
          • Latest test results from the build bot

          Comments:

          • The instanceof calls in the middle of HiveContextAwareRecordReader.next look ugly, since this is in the inner record fetching loop. But I can't think of a better way to do it. Subclassing for this would be hard since it would force subclassing of each of the existing subclasses of HiveContextAwareRecordReader. The performance penalty for this should not be bad as for any given query the same path will be chosen for all records, thus branch prediction should perform quite well. We shouldn't hold up the check in for this, but we should think on how to improve this later.
          • In FetchOperator a few includes were made unnecessary but not removed from the file. I'll remove them when I check the code in. I'm only noting it here for the record so it's clear why the file I check in differs slightly from the patch provided.
          Show
          Alan Gates added a comment - This patch is almost ready. I have a couple of comments (see below) but they aren't blockers to getting this checked in. Things we do need to address before checkin: Need blessing from Owen or Prasanth (both of whom understand ORC better than me) that the changes to OrcInputFormat are ok. Latest test results from the build bot Comments: The instanceof calls in the middle of HiveContextAwareRecordReader.next look ugly, since this is in the inner record fetching loop. But I can't think of a better way to do it. Subclassing for this would be hard since it would force subclassing of each of the existing subclasses of HiveContextAwareRecordReader. The performance penalty for this should not be bad as for any given query the same path will be chosen for all records, thus branch prediction should perform quite well. We shouldn't hold up the check in for this, but we should think on how to improve this later. In FetchOperator a few includes were made unnecessary but not removed from the file. I'll remove them when I check the code in. I'm only noting it here for the record so it's clear why the file I check in differs slightly from the patch provided.
          Hide
          Alan Gates added a comment -

          Owen O'Malley, Prasanth Jayachandran, a request to look at the changes to OrcInputFormat per the last comment.

          Show
          Alan Gates added a comment - Owen O'Malley , Prasanth Jayachandran , a request to look at the changes to OrcInputFormat per the last comment.
          Hide
          Prasanth Jayachandran added a comment -

          OrcInputFormat related changes for backward compat looks good to me.

          Show
          Prasanth Jayachandran added a comment - OrcInputFormat related changes for backward compat looks good to me.
          Hide
          Eugene Koifman added a comment -

          patch 13 is the same as 12 - trying to kick off a test run

          Show
          Eugene Koifman added a comment - patch 13 is the same as 12 - trying to kick off a test run
          Hide
          Hive QA added a comment -

          Overall: -1 at least one tests failed

          Here are the results of testing the latest attachment:
          https://issues.apache.org/jira/secure/attachment/12662332/HIVE-7513.13.patch

          ERROR: -1 due to 2 failed/errored test(s), 5817 tests executed
          Failed tests:

          org.apache.hadoop.hive.ql.parse.TestParse.testParse_sample2
          org.apache.hive.jdbc.miniHS2.TestHiveServer2.testConnection
          

          Test results: http://ec2-174-129-184-35.compute-1.amazonaws.com/jenkins/job/PreCommit-HIVE-TRUNK-Build/364/testReport
          Console output: http://ec2-174-129-184-35.compute-1.amazonaws.com/jenkins/job/PreCommit-HIVE-TRUNK-Build/364/console
          Test logs: http://ec2-174-129-184-35.compute-1.amazonaws.com/logs/PreCommit-HIVE-TRUNK-Build-364/

          Messages:

          Executing org.apache.hive.ptest.execution.PrepPhase
          Executing org.apache.hive.ptest.execution.ExecutionPhase
          Executing org.apache.hive.ptest.execution.ReportingPhase
          Tests exited with: TestsFailedException: 2 tests failed
          

          This message is automatically generated.

          ATTACHMENT ID: 12662332

          Show
          Hive QA added a comment - Overall : -1 at least one tests failed Here are the results of testing the latest attachment: https://issues.apache.org/jira/secure/attachment/12662332/HIVE-7513.13.patch ERROR: -1 due to 2 failed/errored test(s), 5817 tests executed Failed tests: org.apache.hadoop.hive.ql.parse.TestParse.testParse_sample2 org.apache.hive.jdbc.miniHS2.TestHiveServer2.testConnection Test results: http://ec2-174-129-184-35.compute-1.amazonaws.com/jenkins/job/PreCommit-HIVE-TRUNK-Build/364/testReport Console output: http://ec2-174-129-184-35.compute-1.amazonaws.com/jenkins/job/PreCommit-HIVE-TRUNK-Build/364/console Test logs: http://ec2-174-129-184-35.compute-1.amazonaws.com/logs/PreCommit-HIVE-TRUNK-Build-364/ Messages: Executing org.apache.hive.ptest.execution.PrepPhase Executing org.apache.hive.ptest.execution.ExecutionPhase Executing org.apache.hive.ptest.execution.ReportingPhase Tests exited with: TestsFailedException: 2 tests failed This message is automatically generated. ATTACHMENT ID: 12662332
          Hide
          Eugene Koifman added a comment -

          patch 14 - fixed one more test

          Show
          Eugene Koifman added a comment - patch 14 - fixed one more test
          Hide
          Hive QA added a comment -

          Overall: +1 all checks pass

          Here are the results of testing the latest attachment:
          https://issues.apache.org/jira/secure/attachment/12662346/HIVE-7513.14.patch

          SUCCESS: +1 5817 tests passed

          Test results: http://ec2-174-129-184-35.compute-1.amazonaws.com/jenkins/job/PreCommit-HIVE-TRUNK-Build/366/testReport
          Console output: http://ec2-174-129-184-35.compute-1.amazonaws.com/jenkins/job/PreCommit-HIVE-TRUNK-Build/366/console
          Test logs: http://ec2-174-129-184-35.compute-1.amazonaws.com/logs/PreCommit-HIVE-TRUNK-Build-366/

          Messages:

          Executing org.apache.hive.ptest.execution.PrepPhase
          Executing org.apache.hive.ptest.execution.ExecutionPhase
          Executing org.apache.hive.ptest.execution.ReportingPhase
          

          This message is automatically generated.

          ATTACHMENT ID: 12662346

          Show
          Hive QA added a comment - Overall : +1 all checks pass Here are the results of testing the latest attachment: https://issues.apache.org/jira/secure/attachment/12662346/HIVE-7513.14.patch SUCCESS: +1 5817 tests passed Test results: http://ec2-174-129-184-35.compute-1.amazonaws.com/jenkins/job/PreCommit-HIVE-TRUNK-Build/366/testReport Console output: http://ec2-174-129-184-35.compute-1.amazonaws.com/jenkins/job/PreCommit-HIVE-TRUNK-Build/366/console Test logs: http://ec2-174-129-184-35.compute-1.amazonaws.com/logs/PreCommit-HIVE-TRUNK-Build-366/ Messages: Executing org.apache.hive.ptest.execution.PrepPhase Executing org.apache.hive.ptest.execution.ExecutionPhase Executing org.apache.hive.ptest.execution.ReportingPhase This message is automatically generated. ATTACHMENT ID: 12662346
          Hide
          Alan Gates added a comment -

          +1

          Show
          Alan Gates added a comment - +1
          Hide
          Brock Noland added a comment -

          I noticed in this change that the constants in VirtualColumn are not final. I was going to ask if you could add that since there is other cleanup in this same change. However, given it's already been approved I created HIVE-7760 to track that.

          Show
          Brock Noland added a comment - I noticed in this change that the constants in VirtualColumn are not final. I was going to ask if you could add that since there is other cleanup in this same change. However, given it's already been approved I created HIVE-7760 to track that.
          Hide
          Alan Gates added a comment -

          Patch 14 checked in.

          Show
          Alan Gates added a comment - Patch 14 checked in.
          Hide
          Lefty Leverenz added a comment -

          Is this just behind-the-scenes or does it need some user doc?

          Show
          Lefty Leverenz added a comment - Is this just behind-the-scenes or does it need some user doc?
          Hide
          Lefty Leverenz added a comment -

          Doc ping for Eugene Koifman or anyone: Should this have a TODOC14 label or doesn't it need documentation?

          Show
          Lefty Leverenz added a comment - Doc ping for Eugene Koifman or anyone: Should this have a TODOC14 label or doesn't it need documentation?
          Hide
          Eugene Koifman added a comment -

          I don't think this needs documentation. At the moment this is an internal implementation detail to support ACID updates.

          Show
          Eugene Koifman added a comment - I don't think this needs documentation. At the moment this is an internal implementation detail to support ACID updates.
          Hide
          Lefty Leverenz added a comment -

          Yay.
          – LazySimpleTechWriter

          Show
          Lefty Leverenz added a comment - Yay. – LazySimpleTechWriter
          Hide
          Thejas M Nair added a comment -

          This has been fixed in 0.14 release. Please open new jira if you see any issues.

          Show
          Thejas M Nair added a comment - This has been fixed in 0.14 release. Please open new jira if you see any issues.

            People

            • Assignee:
              Eugene Koifman
              Reporter:
              Eugene Koifman
            • Votes:
              0 Vote for this issue
              Watchers:
              7 Start watching this issue

              Dates

              • Created:
                Updated:
                Resolved:

                Development