Details

    • Type: Improvement
    • Status: Resolved
    • Priority: Major
    • Resolution: Fixed
    • Affects Version/s: 2.7.1
    • Fix Version/s: 2.9.0, 3.0.0-alpha1
    • Component/s: test
    • Labels:
      None
    • Hadoop Flags:
      Reviewed

      Description

      Per discussion on the dev list, the tests for the new FileSystemSink class should be added to the HDFS project to avoid creating a dependency for the common project on the HDFS project.

      1. HDFS-9637.001.patch
        8 kB
        Daniel Templeton
      2. HDFS-9637.002.patch
        18 kB
        Daniel Templeton
      3. HDFS-9637.003.patch
        11 kB
        Daniel Templeton
      4. HDFS-9637.004.patch
        10 kB
        Daniel Templeton
      5. HDFS-9637.005.patch
        9 kB
        Daniel Templeton
      6. HDFS-9637.006.patch
        9 kB
        Daniel Templeton
      7. HDFS-9637.branch2.006.patch
        9 kB
        Daniel Templeton

        Issue Links

          Activity

          Hide
          kasha Karthik Kambatla added a comment -

          +1 on the branch-2 patch, just committed.

          Thanks Daniel for the contribution.

          Show
          kasha Karthik Kambatla added a comment - +1 on the branch-2 patch, just committed. Thanks Daniel for the contribution.
          Hide
          hadoopqa Hadoop QA added a comment -
          -1 overall



          Vote Subsystem Runtime Comment
          0 reexec 0m 12s Docker mode activated.
          +1 @author 0m 0s The patch does not contain any @author tags.
          +1 test4tests 0m 0s The patch appears to include 1 new or modified test files.
          +1 mvninstall 7m 16s trunk passed
          +1 compile 0m 42s trunk passed with JDK v1.8.0_66
          +1 compile 0m 43s trunk passed with JDK v1.7.0_91
          +1 checkstyle 0m 22s trunk passed
          +1 mvnsite 0m 55s trunk passed
          +1 mvneclipse 0m 14s trunk passed
          +1 findbugs 2m 0s trunk passed
          +1 javadoc 1m 10s trunk passed with JDK v1.8.0_66
          +1 javadoc 1m 51s trunk passed with JDK v1.7.0_91
          +1 mvninstall 0m 49s the patch passed
          +1 compile 0m 42s the patch passed with JDK v1.8.0_66
          +1 javac 0m 42s the patch passed
          +1 compile 0m 43s the patch passed with JDK v1.7.0_91
          +1 javac 0m 43s the patch passed
          +1 checkstyle 0m 19s the patch passed
          +1 mvnsite 0m 52s the patch passed
          +1 mvneclipse 0m 13s the patch passed
          +1 whitespace 0m 0s Patch has no whitespace issues.
          +1 findbugs 2m 20s the patch passed
          +1 javadoc 1m 9s the patch passed with JDK v1.8.0_66
          +1 javadoc 1m 51s the patch passed with JDK v1.7.0_91
          -1 unit 66m 39s hadoop-hdfs in the patch failed with JDK v1.8.0_66.
          -1 unit 61m 23s hadoop-hdfs in the patch failed with JDK v1.7.0_91.
          +1 asflicense 0m 34s Patch does not generate ASF License warnings.
          154m 5s



          Reason Tests
          JDK v1.8.0_66 Failed junit tests hadoop.hdfs.TestRollingUpgrade
            hadoop.hdfs.server.blockmanagement.TestBlockManager
            hadoop.hdfs.server.datanode.TestBlockScanner
            hadoop.fs.TestHdfsNativeCodeLoader
          JDK v1.7.0_91 Failed junit tests hadoop.hdfs.TestFileCreationDelete
            hadoop.hdfs.TestFileAppend
            hadoop.fs.TestHdfsNativeCodeLoader
            hadoop.hdfs.qjournal.TestSecureNNWithQJM
            hadoop.hdfs.TestReconstructStripedFile



          Subsystem Report/Notes
          Docker Image:yetus/hadoop:0ca8df7
          JIRA Patch URL https://issues.apache.org/jira/secure/attachment/12787342/HDFS-9637.branch2.006.patch
          JIRA Issue HDFS-9637
          Optional Tests asflicense compile javac javadoc mvninstall mvnsite unit findbugs checkstyle
          uname Linux f09c4f9b110b 3.13.0-36-lowlatency #63-Ubuntu SMP PREEMPT Wed Sep 3 21:56:12 UTC 2014 x86_64 x86_64 x86_64 GNU/Linux
          Build tool maven
          Personality /testptch/hadoop/patchprocess/precommit/personality/provided.sh
          git revision trunk / c3641ed
          Default Java 1.7.0_91
          Multi-JDK versions /usr/lib/jvm/java-8-oracle:1.8.0_66 /usr/lib/jvm/java-7-openjdk-amd64:1.7.0_91
          findbugs v3.0.0
          unit https://builds.apache.org/job/PreCommit-HDFS-Build/14445/artifact/patchprocess/patch-unit-hadoop-hdfs-project_hadoop-hdfs-jdk1.8.0_66.txt
          unit https://builds.apache.org/job/PreCommit-HDFS-Build/14445/artifact/patchprocess/patch-unit-hadoop-hdfs-project_hadoop-hdfs-jdk1.7.0_91.txt
          unit test logs https://builds.apache.org/job/PreCommit-HDFS-Build/14445/artifact/patchprocess/patch-unit-hadoop-hdfs-project_hadoop-hdfs-jdk1.8.0_66.txt https://builds.apache.org/job/PreCommit-HDFS-Build/14445/artifact/patchprocess/patch-unit-hadoop-hdfs-project_hadoop-hdfs-jdk1.7.0_91.txt
          JDK v1.7.0_91 Test Results https://builds.apache.org/job/PreCommit-HDFS-Build/14445/testReport/
          modules C: hadoop-hdfs-project/hadoop-hdfs U: hadoop-hdfs-project/hadoop-hdfs
          Max memory used 77MB
          Console output https://builds.apache.org/job/PreCommit-HDFS-Build/14445/console
          Powered by Apache Yetus 0.2.0-SNAPSHOT http://yetus.apache.org

          This message was automatically generated.

          Show
          hadoopqa Hadoop QA added a comment - -1 overall Vote Subsystem Runtime Comment 0 reexec 0m 12s Docker mode activated. +1 @author 0m 0s The patch does not contain any @author tags. +1 test4tests 0m 0s The patch appears to include 1 new or modified test files. +1 mvninstall 7m 16s trunk passed +1 compile 0m 42s trunk passed with JDK v1.8.0_66 +1 compile 0m 43s trunk passed with JDK v1.7.0_91 +1 checkstyle 0m 22s trunk passed +1 mvnsite 0m 55s trunk passed +1 mvneclipse 0m 14s trunk passed +1 findbugs 2m 0s trunk passed +1 javadoc 1m 10s trunk passed with JDK v1.8.0_66 +1 javadoc 1m 51s trunk passed with JDK v1.7.0_91 +1 mvninstall 0m 49s the patch passed +1 compile 0m 42s the patch passed with JDK v1.8.0_66 +1 javac 0m 42s the patch passed +1 compile 0m 43s the patch passed with JDK v1.7.0_91 +1 javac 0m 43s the patch passed +1 checkstyle 0m 19s the patch passed +1 mvnsite 0m 52s the patch passed +1 mvneclipse 0m 13s the patch passed +1 whitespace 0m 0s Patch has no whitespace issues. +1 findbugs 2m 20s the patch passed +1 javadoc 1m 9s the patch passed with JDK v1.8.0_66 +1 javadoc 1m 51s the patch passed with JDK v1.7.0_91 -1 unit 66m 39s hadoop-hdfs in the patch failed with JDK v1.8.0_66. -1 unit 61m 23s hadoop-hdfs in the patch failed with JDK v1.7.0_91. +1 asflicense 0m 34s Patch does not generate ASF License warnings. 154m 5s Reason Tests JDK v1.8.0_66 Failed junit tests hadoop.hdfs.TestRollingUpgrade   hadoop.hdfs.server.blockmanagement.TestBlockManager   hadoop.hdfs.server.datanode.TestBlockScanner   hadoop.fs.TestHdfsNativeCodeLoader JDK v1.7.0_91 Failed junit tests hadoop.hdfs.TestFileCreationDelete   hadoop.hdfs.TestFileAppend   hadoop.fs.TestHdfsNativeCodeLoader   hadoop.hdfs.qjournal.TestSecureNNWithQJM   hadoop.hdfs.TestReconstructStripedFile Subsystem Report/Notes Docker Image:yetus/hadoop:0ca8df7 JIRA Patch URL https://issues.apache.org/jira/secure/attachment/12787342/HDFS-9637.branch2.006.patch JIRA Issue HDFS-9637 Optional Tests asflicense compile javac javadoc mvninstall mvnsite unit findbugs checkstyle uname Linux f09c4f9b110b 3.13.0-36-lowlatency #63-Ubuntu SMP PREEMPT Wed Sep 3 21:56:12 UTC 2014 x86_64 x86_64 x86_64 GNU/Linux Build tool maven Personality /testptch/hadoop/patchprocess/precommit/personality/provided.sh git revision trunk / c3641ed Default Java 1.7.0_91 Multi-JDK versions /usr/lib/jvm/java-8-oracle:1.8.0_66 /usr/lib/jvm/java-7-openjdk-amd64:1.7.0_91 findbugs v3.0.0 unit https://builds.apache.org/job/PreCommit-HDFS-Build/14445/artifact/patchprocess/patch-unit-hadoop-hdfs-project_hadoop-hdfs-jdk1.8.0_66.txt unit https://builds.apache.org/job/PreCommit-HDFS-Build/14445/artifact/patchprocess/patch-unit-hadoop-hdfs-project_hadoop-hdfs-jdk1.7.0_91.txt unit test logs https://builds.apache.org/job/PreCommit-HDFS-Build/14445/artifact/patchprocess/patch-unit-hadoop-hdfs-project_hadoop-hdfs-jdk1.8.0_66.txt https://builds.apache.org/job/PreCommit-HDFS-Build/14445/artifact/patchprocess/patch-unit-hadoop-hdfs-project_hadoop-hdfs-jdk1.7.0_91.txt JDK v1.7.0_91 Test Results https://builds.apache.org/job/PreCommit-HDFS-Build/14445/testReport/ modules C: hadoop-hdfs-project/hadoop-hdfs U: hadoop-hdfs-project/hadoop-hdfs Max memory used 77MB Console output https://builds.apache.org/job/PreCommit-HDFS-Build/14445/console Powered by Apache Yetus 0.2.0-SNAPSHOT http://yetus.apache.org This message was automatically generated.
          Hide
          templedf Daniel Templeton added a comment -

          Here's a patch for branch 2. The metrics2 system is a little different between branch 2 and trunk.

          Show
          templedf Daniel Templeton added a comment - Here's a patch for branch 2. The metrics2 system is a little different between branch 2 and trunk.
          Hide
          hudson Hudson added a comment -

          FAILURE: Integrated in Hadoop-trunk-Commit #9277 (See https://builds.apache.org/job/Hadoop-trunk-Commit/9277/)
          HDFS-9637. Tests for RollingFileSystemSink. (Daniel Templeton via kasha) (kasha: rev bc425a623fd06c4f56106fb2ea662b19e4434d11)

          • hadoop-hdfs-project/hadoop-hdfs/src/test/java/org/apache/hadoop/metrics2/sink/TestRollingFileSystemSinkWithHdfs.java
          • hadoop-hdfs-project/hadoop-hdfs/CHANGES.txt
          Show
          hudson Hudson added a comment - FAILURE: Integrated in Hadoop-trunk-Commit #9277 (See https://builds.apache.org/job/Hadoop-trunk-Commit/9277/ ) HDFS-9637 . Tests for RollingFileSystemSink. (Daniel Templeton via kasha) (kasha: rev bc425a623fd06c4f56106fb2ea662b19e4434d11) hadoop-hdfs-project/hadoop-hdfs/src/test/java/org/apache/hadoop/metrics2/sink/TestRollingFileSystemSinkWithHdfs.java hadoop-hdfs-project/hadoop-hdfs/CHANGES.txt
          Hide
          kasha Karthik Kambatla added a comment -

          Committed this to trunk.

          On branch-2, one of the newly added tests fails:

          Running org.apache.hadoop.metrics2.sink.TestRollingFileSystemSinkWithHdfs
          Tests run: 10, Failures: 0, Errors: 1, Skipped: 0, Time elapsed: 39.088 sec <<< FAILURE! - in org.apache.hadoop.metrics2.sink.TestRollingFileSystemSinkWithHdfs
          testFailedClose(org.apache.hadoop.metrics2.sink.TestRollingFileSystemSinkWithHdfs)  Time elapsed: 1.385 sec  <<< ERROR!
          org.apache.hadoop.metrics2.MetricsException: org.apache.hadoop.metrics2.MetricsException: Unable to close log file: hdfs://localhost:51275/tmp/2016021018/testsrc-saya.local.log
          	at org.apache.hadoop.metrics2.sink.RollingFileSystemSink.checkForErrors(RollingFileSystemSink.java:512)
          	at org.apache.hadoop.metrics2.sink.RollingFileSystemSink.close(RollingFileSystemSink.java:488)
          	at org.apache.hadoop.metrics2.sink.RollingFileSystemSinkTestBase$ErrorSink.close(RollingFileSystemSinkTestBase.java:498)
          	at org.apache.hadoop.io.IOUtils.cleanup(IOUtils.java:245)
          	at org.apache.hadoop.metrics2.impl.MetricsSinkAdapter.stop(MetricsSinkAdapter.java:213)
          	at org.apache.hadoop.metrics2.impl.MetricsSystemImpl.stopSinks(MetricsSystemImpl.java:471)
          	at org.apache.hadoop.metrics2.impl.MetricsSystemImpl.stop(MetricsSystemImpl.java:214)
          	at org.apache.hadoop.metrics2.sink.TestRollingFileSystemSinkWithHdfs.testFailedClose(TestRollingFileSystemSinkWithHdfs.java:183)
          
          Show
          kasha Karthik Kambatla added a comment - Committed this to trunk. On branch-2, one of the newly added tests fails: Running org.apache.hadoop.metrics2.sink.TestRollingFileSystemSinkWithHdfs Tests run: 10, Failures: 0, Errors: 1, Skipped: 0, Time elapsed: 39.088 sec <<< FAILURE! - in org.apache.hadoop.metrics2.sink.TestRollingFileSystemSinkWithHdfs testFailedClose(org.apache.hadoop.metrics2.sink.TestRollingFileSystemSinkWithHdfs) Time elapsed: 1.385 sec <<< ERROR! org.apache.hadoop.metrics2.MetricsException: org.apache.hadoop.metrics2.MetricsException: Unable to close log file: hdfs://localhost:51275/tmp/2016021018/testsrc-saya.local.log at org.apache.hadoop.metrics2.sink.RollingFileSystemSink.checkForErrors(RollingFileSystemSink.java:512) at org.apache.hadoop.metrics2.sink.RollingFileSystemSink.close(RollingFileSystemSink.java:488) at org.apache.hadoop.metrics2.sink.RollingFileSystemSinkTestBase$ErrorSink.close(RollingFileSystemSinkTestBase.java:498) at org.apache.hadoop.io.IOUtils.cleanup(IOUtils.java:245) at org.apache.hadoop.metrics2.impl.MetricsSinkAdapter.stop(MetricsSinkAdapter.java:213) at org.apache.hadoop.metrics2.impl.MetricsSystemImpl.stopSinks(MetricsSystemImpl.java:471) at org.apache.hadoop.metrics2.impl.MetricsSystemImpl.stop(MetricsSystemImpl.java:214) at org.apache.hadoop.metrics2.sink.TestRollingFileSystemSinkWithHdfs.testFailedClose(TestRollingFileSystemSinkWithHdfs.java:183)
          Hide
          kasha Karthik Kambatla added a comment -

          +1, checking the latest patch in.

          Show
          kasha Karthik Kambatla added a comment - +1, checking the latest patch in.
          Hide
          hadoopqa Hadoop QA added a comment -
          -1 overall



          Vote Subsystem Runtime Comment
          0 reexec 0m 15s Docker mode activated.
          +1 @author 0m 0s The patch does not contain any @author tags.
          +1 test4tests 0m 0s The patch appears to include 1 new or modified test files.
          +1 mvninstall 7m 15s trunk passed
          +1 compile 0m 52s trunk passed with JDK v1.8.0_72
          +1 compile 0m 44s trunk passed with JDK v1.7.0_95
          +1 checkstyle 0m 21s trunk passed
          +1 mvnsite 0m 53s trunk passed
          +1 mvneclipse 0m 12s trunk passed
          +1 findbugs 1m 57s trunk passed
          +1 javadoc 1m 15s trunk passed with JDK v1.8.0_72
          +1 javadoc 1m 54s trunk passed with JDK v1.7.0_95
          +1 mvninstall 0m 49s the patch passed
          +1 compile 0m 51s the patch passed with JDK v1.8.0_72
          +1 javac 0m 51s the patch passed
          +1 compile 0m 42s the patch passed with JDK v1.7.0_95
          +1 javac 0m 42s the patch passed
          +1 checkstyle 0m 18s the patch passed
          +1 mvnsite 0m 51s the patch passed
          +1 mvneclipse 0m 11s the patch passed
          +1 whitespace 0m 0s Patch has no whitespace issues.
          +1 findbugs 2m 8s the patch passed
          +1 javadoc 1m 16s the patch passed with JDK v1.8.0_72
          +1 javadoc 1m 50s the patch passed with JDK v1.7.0_95
          -1 unit 109m 46s hadoop-hdfs in the patch failed with JDK v1.8.0_72.
          -1 unit 108m 22s hadoop-hdfs in the patch failed with JDK v1.7.0_95.
          +1 asflicense 0m 34s Patch does not generate ASF License warnings.
          244m 18s



          Reason Tests
          JDK v1.8.0_72 Failed junit tests hadoop.hdfs.server.datanode.TestBlockScanner
            hadoop.hdfs.server.namenode.ha.TestEditLogTailer
            hadoop.hdfs.security.TestDelegationTokenForProxyUser
            hadoop.hdfs.server.datanode.TestDataNodeVolumeFailure
            hadoop.hdfs.server.datanode.TestBlockReplacement
            hadoop.fs.TestHdfsNativeCodeLoader
            hadoop.hdfs.server.datanode.TestDirectoryScanner
          JDK v1.8.0_72 Timed out junit tests org.apache.hadoop.hdfs.TestLeaseRecovery2
          JDK v1.7.0_95 Failed junit tests hadoop.hdfs.TestDFSUpgradeFromImage
            hadoop.hdfs.server.datanode.TestBlockScanner
            hadoop.hdfs.server.datanode.TestDataNodeMultipleRegistrations
            hadoop.hdfs.security.TestDelegationTokenForProxyUser
            hadoop.hdfs.server.datanode.TestDataNodeVolumeFailure
            hadoop.hdfs.server.datanode.TestNNHandlesBlockReportPerStorage
            hadoop.hdfs.server.datanode.TestBlockReplacement
            hadoop.hdfs.TestDFSStripedOutputStreamWithFailure030
            hadoop.fs.TestHdfsNativeCodeLoader
            hadoop.hdfs.server.datanode.TestDirectoryScanner



          Subsystem Report/Notes
          Docker Image:yetus/hadoop:0ca8df7
          JIRA Patch URL https://issues.apache.org/jira/secure/attachment/12787217/HDFS-9637.006.patch
          JIRA Issue HDFS-9637
          Optional Tests asflicense compile javac javadoc mvninstall mvnsite unit findbugs checkstyle
          uname Linux c439465a7fd7 3.13.0-36-lowlatency #63-Ubuntu SMP PREEMPT Wed Sep 3 21:56:12 UTC 2014 x86_64 x86_64 x86_64 GNU/Linux
          Build tool maven
          Personality /testptch/hadoop/patchprocess/precommit/personality/provided.sh
          git revision trunk / a7fce9a
          Default Java 1.7.0_95
          Multi-JDK versions /usr/lib/jvm/java-8-oracle:1.8.0_72 /usr/lib/jvm/java-7-openjdk-amd64:1.7.0_95
          findbugs v3.0.0
          unit https://builds.apache.org/job/PreCommit-HDFS-Build/14441/artifact/patchprocess/patch-unit-hadoop-hdfs-project_hadoop-hdfs-jdk1.8.0_72.txt
          unit https://builds.apache.org/job/PreCommit-HDFS-Build/14441/artifact/patchprocess/patch-unit-hadoop-hdfs-project_hadoop-hdfs-jdk1.7.0_95.txt
          unit test logs https://builds.apache.org/job/PreCommit-HDFS-Build/14441/artifact/patchprocess/patch-unit-hadoop-hdfs-project_hadoop-hdfs-jdk1.8.0_72.txt https://builds.apache.org/job/PreCommit-HDFS-Build/14441/artifact/patchprocess/patch-unit-hadoop-hdfs-project_hadoop-hdfs-jdk1.7.0_95.txt
          JDK v1.7.0_95 Test Results https://builds.apache.org/job/PreCommit-HDFS-Build/14441/testReport/
          modules C: hadoop-hdfs-project/hadoop-hdfs U: hadoop-hdfs-project/hadoop-hdfs
          Max memory used 77MB
          Console output https://builds.apache.org/job/PreCommit-HDFS-Build/14441/console
          Powered by Apache Yetus 0.2.0-SNAPSHOT http://yetus.apache.org

          This message was automatically generated.

          Show
          hadoopqa Hadoop QA added a comment - -1 overall Vote Subsystem Runtime Comment 0 reexec 0m 15s Docker mode activated. +1 @author 0m 0s The patch does not contain any @author tags. +1 test4tests 0m 0s The patch appears to include 1 new or modified test files. +1 mvninstall 7m 15s trunk passed +1 compile 0m 52s trunk passed with JDK v1.8.0_72 +1 compile 0m 44s trunk passed with JDK v1.7.0_95 +1 checkstyle 0m 21s trunk passed +1 mvnsite 0m 53s trunk passed +1 mvneclipse 0m 12s trunk passed +1 findbugs 1m 57s trunk passed +1 javadoc 1m 15s trunk passed with JDK v1.8.0_72 +1 javadoc 1m 54s trunk passed with JDK v1.7.0_95 +1 mvninstall 0m 49s the patch passed +1 compile 0m 51s the patch passed with JDK v1.8.0_72 +1 javac 0m 51s the patch passed +1 compile 0m 42s the patch passed with JDK v1.7.0_95 +1 javac 0m 42s the patch passed +1 checkstyle 0m 18s the patch passed +1 mvnsite 0m 51s the patch passed +1 mvneclipse 0m 11s the patch passed +1 whitespace 0m 0s Patch has no whitespace issues. +1 findbugs 2m 8s the patch passed +1 javadoc 1m 16s the patch passed with JDK v1.8.0_72 +1 javadoc 1m 50s the patch passed with JDK v1.7.0_95 -1 unit 109m 46s hadoop-hdfs in the patch failed with JDK v1.8.0_72. -1 unit 108m 22s hadoop-hdfs in the patch failed with JDK v1.7.0_95. +1 asflicense 0m 34s Patch does not generate ASF License warnings. 244m 18s Reason Tests JDK v1.8.0_72 Failed junit tests hadoop.hdfs.server.datanode.TestBlockScanner   hadoop.hdfs.server.namenode.ha.TestEditLogTailer   hadoop.hdfs.security.TestDelegationTokenForProxyUser   hadoop.hdfs.server.datanode.TestDataNodeVolumeFailure   hadoop.hdfs.server.datanode.TestBlockReplacement   hadoop.fs.TestHdfsNativeCodeLoader   hadoop.hdfs.server.datanode.TestDirectoryScanner JDK v1.8.0_72 Timed out junit tests org.apache.hadoop.hdfs.TestLeaseRecovery2 JDK v1.7.0_95 Failed junit tests hadoop.hdfs.TestDFSUpgradeFromImage   hadoop.hdfs.server.datanode.TestBlockScanner   hadoop.hdfs.server.datanode.TestDataNodeMultipleRegistrations   hadoop.hdfs.security.TestDelegationTokenForProxyUser   hadoop.hdfs.server.datanode.TestDataNodeVolumeFailure   hadoop.hdfs.server.datanode.TestNNHandlesBlockReportPerStorage   hadoop.hdfs.server.datanode.TestBlockReplacement   hadoop.hdfs.TestDFSStripedOutputStreamWithFailure030   hadoop.fs.TestHdfsNativeCodeLoader   hadoop.hdfs.server.datanode.TestDirectoryScanner Subsystem Report/Notes Docker Image:yetus/hadoop:0ca8df7 JIRA Patch URL https://issues.apache.org/jira/secure/attachment/12787217/HDFS-9637.006.patch JIRA Issue HDFS-9637 Optional Tests asflicense compile javac javadoc mvninstall mvnsite unit findbugs checkstyle uname Linux c439465a7fd7 3.13.0-36-lowlatency #63-Ubuntu SMP PREEMPT Wed Sep 3 21:56:12 UTC 2014 x86_64 x86_64 x86_64 GNU/Linux Build tool maven Personality /testptch/hadoop/patchprocess/precommit/personality/provided.sh git revision trunk / a7fce9a Default Java 1.7.0_95 Multi-JDK versions /usr/lib/jvm/java-8-oracle:1.8.0_72 /usr/lib/jvm/java-7-openjdk-amd64:1.7.0_95 findbugs v3.0.0 unit https://builds.apache.org/job/PreCommit-HDFS-Build/14441/artifact/patchprocess/patch-unit-hadoop-hdfs-project_hadoop-hdfs-jdk1.8.0_72.txt unit https://builds.apache.org/job/PreCommit-HDFS-Build/14441/artifact/patchprocess/patch-unit-hadoop-hdfs-project_hadoop-hdfs-jdk1.7.0_95.txt unit test logs https://builds.apache.org/job/PreCommit-HDFS-Build/14441/artifact/patchprocess/patch-unit-hadoop-hdfs-project_hadoop-hdfs-jdk1.8.0_72.txt https://builds.apache.org/job/PreCommit-HDFS-Build/14441/artifact/patchprocess/patch-unit-hadoop-hdfs-project_hadoop-hdfs-jdk1.7.0_95.txt JDK v1.7.0_95 Test Results https://builds.apache.org/job/PreCommit-HDFS-Build/14441/testReport/ modules C: hadoop-hdfs-project/hadoop-hdfs U: hadoop-hdfs-project/hadoop-hdfs Max memory used 77MB Console output https://builds.apache.org/job/PreCommit-HDFS-Build/14441/console Powered by Apache Yetus 0.2.0-SNAPSHOT http://yetus.apache.org This message was automatically generated.
          Hide
          templedf Daniel Templeton added a comment -

          Here's one more little update. I noticed some formatting that could be cleaner, and I moved the flag resets to the setup method.

          Show
          templedf Daniel Templeton added a comment - Here's one more little update. I noticed some formatting that could be cleaner, and I moved the flag resets to the setup method.
          Hide
          kasha Karthik Kambatla added a comment -

          Looks good. +1. Will check this in tomorrow morning if I don't hear any objections.

          Show
          kasha Karthik Kambatla added a comment - Looks good. +1. Will check this in tomorrow morning if I don't hear any objections.
          Hide
          hadoopqa Hadoop QA added a comment -
          -1 overall



          Vote Subsystem Runtime Comment
          0 reexec 0m 10s Docker mode activated.
          +1 @author 0m 0s The patch does not contain any @author tags.
          +1 test4tests 0m 0s The patch appears to include 1 new or modified test files.
          +1 mvninstall 6m 44s trunk passed
          +1 compile 0m 41s trunk passed with JDK v1.8.0_72
          +1 compile 0m 42s trunk passed with JDK v1.7.0_95
          +1 checkstyle 0m 21s trunk passed
          +1 mvnsite 0m 51s trunk passed
          +1 mvneclipse 0m 14s trunk passed
          +1 findbugs 1m 55s trunk passed
          +1 javadoc 1m 7s trunk passed with JDK v1.8.0_72
          +1 javadoc 1m 47s trunk passed with JDK v1.7.0_95
          +1 mvninstall 0m 46s the patch passed
          +1 compile 0m 34s the patch passed with JDK v1.8.0_72
          +1 javac 0m 34s the patch passed
          +1 compile 0m 37s the patch passed with JDK v1.7.0_95
          +1 javac 0m 37s the patch passed
          +1 checkstyle 0m 17s the patch passed
          +1 mvnsite 0m 49s the patch passed
          +1 mvneclipse 0m 11s the patch passed
          +1 whitespace 0m 0s Patch has no whitespace issues.
          +1 findbugs 2m 3s the patch passed
          +1 javadoc 0m 59s the patch passed with JDK v1.8.0_72
          +1 javadoc 1m 43s the patch passed with JDK v1.7.0_95
          -1 unit 55m 23s hadoop-hdfs in the patch failed with JDK v1.8.0_72.
          -1 unit 50m 5s hadoop-hdfs in the patch failed with JDK v1.7.0_95.
          +1 asflicense 0m 21s Patch does not generate ASF License warnings.
          129m 21s



          Reason Tests
          JDK v1.8.0_72 Failed junit tests hadoop.hdfs.TestFileAppend
            hadoop.hdfs.server.datanode.TestBlockScanner
            hadoop.fs.TestHdfsNativeCodeLoader
          JDK v1.7.0_95 Failed junit tests hadoop.fs.TestHdfsNativeCodeLoader



          Subsystem Report/Notes
          Docker Image:yetus/hadoop:0ca8df7
          JIRA Patch URL https://issues.apache.org/jira/secure/attachment/12787194/HDFS-9637.005.patch
          JIRA Issue HDFS-9637
          Optional Tests asflicense compile javac javadoc mvninstall mvnsite unit findbugs checkstyle
          uname Linux 18ad0c04c7cb 3.13.0-36-lowlatency #63-Ubuntu SMP PREEMPT Wed Sep 3 21:56:12 UTC 2014 x86_64 x86_64 x86_64 GNU/Linux
          Build tool maven
          Personality /testptch/hadoop/patchprocess/precommit/personality/provided.sh
          git revision trunk / a7fce9a
          Default Java 1.7.0_95
          Multi-JDK versions /usr/lib/jvm/java-8-oracle:1.8.0_72 /usr/lib/jvm/java-7-openjdk-amd64:1.7.0_95
          findbugs v3.0.0
          unit https://builds.apache.org/job/PreCommit-HDFS-Build/14439/artifact/patchprocess/patch-unit-hadoop-hdfs-project_hadoop-hdfs-jdk1.8.0_72.txt
          unit https://builds.apache.org/job/PreCommit-HDFS-Build/14439/artifact/patchprocess/patch-unit-hadoop-hdfs-project_hadoop-hdfs-jdk1.7.0_95.txt
          unit test logs https://builds.apache.org/job/PreCommit-HDFS-Build/14439/artifact/patchprocess/patch-unit-hadoop-hdfs-project_hadoop-hdfs-jdk1.8.0_72.txt https://builds.apache.org/job/PreCommit-HDFS-Build/14439/artifact/patchprocess/patch-unit-hadoop-hdfs-project_hadoop-hdfs-jdk1.7.0_95.txt
          JDK v1.7.0_95 Test Results https://builds.apache.org/job/PreCommit-HDFS-Build/14439/testReport/
          modules C: hadoop-hdfs-project/hadoop-hdfs U: hadoop-hdfs-project/hadoop-hdfs
          Max memory used 77MB
          Console output https://builds.apache.org/job/PreCommit-HDFS-Build/14439/console
          Powered by Apache Yetus 0.2.0-SNAPSHOT http://yetus.apache.org

          This message was automatically generated.

          Show
          hadoopqa Hadoop QA added a comment - -1 overall Vote Subsystem Runtime Comment 0 reexec 0m 10s Docker mode activated. +1 @author 0m 0s The patch does not contain any @author tags. +1 test4tests 0m 0s The patch appears to include 1 new or modified test files. +1 mvninstall 6m 44s trunk passed +1 compile 0m 41s trunk passed with JDK v1.8.0_72 +1 compile 0m 42s trunk passed with JDK v1.7.0_95 +1 checkstyle 0m 21s trunk passed +1 mvnsite 0m 51s trunk passed +1 mvneclipse 0m 14s trunk passed +1 findbugs 1m 55s trunk passed +1 javadoc 1m 7s trunk passed with JDK v1.8.0_72 +1 javadoc 1m 47s trunk passed with JDK v1.7.0_95 +1 mvninstall 0m 46s the patch passed +1 compile 0m 34s the patch passed with JDK v1.8.0_72 +1 javac 0m 34s the patch passed +1 compile 0m 37s the patch passed with JDK v1.7.0_95 +1 javac 0m 37s the patch passed +1 checkstyle 0m 17s the patch passed +1 mvnsite 0m 49s the patch passed +1 mvneclipse 0m 11s the patch passed +1 whitespace 0m 0s Patch has no whitespace issues. +1 findbugs 2m 3s the patch passed +1 javadoc 0m 59s the patch passed with JDK v1.8.0_72 +1 javadoc 1m 43s the patch passed with JDK v1.7.0_95 -1 unit 55m 23s hadoop-hdfs in the patch failed with JDK v1.8.0_72. -1 unit 50m 5s hadoop-hdfs in the patch failed with JDK v1.7.0_95. +1 asflicense 0m 21s Patch does not generate ASF License warnings. 129m 21s Reason Tests JDK v1.8.0_72 Failed junit tests hadoop.hdfs.TestFileAppend   hadoop.hdfs.server.datanode.TestBlockScanner   hadoop.fs.TestHdfsNativeCodeLoader JDK v1.7.0_95 Failed junit tests hadoop.fs.TestHdfsNativeCodeLoader Subsystem Report/Notes Docker Image:yetus/hadoop:0ca8df7 JIRA Patch URL https://issues.apache.org/jira/secure/attachment/12787194/HDFS-9637.005.patch JIRA Issue HDFS-9637 Optional Tests asflicense compile javac javadoc mvninstall mvnsite unit findbugs checkstyle uname Linux 18ad0c04c7cb 3.13.0-36-lowlatency #63-Ubuntu SMP PREEMPT Wed Sep 3 21:56:12 UTC 2014 x86_64 x86_64 x86_64 GNU/Linux Build tool maven Personality /testptch/hadoop/patchprocess/precommit/personality/provided.sh git revision trunk / a7fce9a Default Java 1.7.0_95 Multi-JDK versions /usr/lib/jvm/java-8-oracle:1.8.0_72 /usr/lib/jvm/java-7-openjdk-amd64:1.7.0_95 findbugs v3.0.0 unit https://builds.apache.org/job/PreCommit-HDFS-Build/14439/artifact/patchprocess/patch-unit-hadoop-hdfs-project_hadoop-hdfs-jdk1.8.0_72.txt unit https://builds.apache.org/job/PreCommit-HDFS-Build/14439/artifact/patchprocess/patch-unit-hadoop-hdfs-project_hadoop-hdfs-jdk1.7.0_95.txt unit test logs https://builds.apache.org/job/PreCommit-HDFS-Build/14439/artifact/patchprocess/patch-unit-hadoop-hdfs-project_hadoop-hdfs-jdk1.8.0_72.txt https://builds.apache.org/job/PreCommit-HDFS-Build/14439/artifact/patchprocess/patch-unit-hadoop-hdfs-project_hadoop-hdfs-jdk1.7.0_95.txt JDK v1.7.0_95 Test Results https://builds.apache.org/job/PreCommit-HDFS-Build/14439/testReport/ modules C: hadoop-hdfs-project/hadoop-hdfs U: hadoop-hdfs-project/hadoop-hdfs Max memory used 77MB Console output https://builds.apache.org/job/PreCommit-HDFS-Build/14439/console Powered by Apache Yetus 0.2.0-SNAPSHOT http://yetus.apache.org This message was automatically generated.
          Hide
          templedf Daniel Templeton added a comment -

          Huh. Good point, Karthik Kambatla. At one time there was a reason for not using @Before and @After, but clearly that's no longer the case... This new patch removes the try-finally blocks.

          Show
          templedf Daniel Templeton added a comment - Huh. Good point, Karthik Kambatla . At one time there was a reason for not using @Before and @After , but clearly that's no longer the case... This new patch removes the try-finally blocks.
          Hide
          kasha Karthik Kambatla added a comment -

          Reviewing the tests here, following up from the feature added in Common.

          The patch looks pretty good. Nice tests and very happy to see the detailed documentation. My only comment would be: use @Before and @After methods to do the setup and cleanup, that way we don't have to do try-finally blocks.

          Show
          kasha Karthik Kambatla added a comment - Reviewing the tests here, following up from the feature added in Common. The patch looks pretty good. Nice tests and very happy to see the detailed documentation. My only comment would be: use @Before and @After methods to do the setup and cleanup, that way we don't have to do try-finally blocks.
          Hide
          templedf Daniel Templeton added a comment -

          Test failures are unrelated.

          Show
          templedf Daniel Templeton added a comment - Test failures are unrelated.
          Hide
          hadoopqa Hadoop QA added a comment -
          -1 overall



          Vote Subsystem Runtime Comment
          0 reexec 0m 13s Docker mode activated.
          +1 @author 0m 0s The patch does not contain any @author tags.
          +1 test4tests 0m 0s The patch appears to include 1 new or modified test files.
          +1 mvninstall 9m 36s trunk passed
          +1 compile 1m 7s trunk passed with JDK v1.8.0_72
          +1 compile 0m 56s trunk passed with JDK v1.7.0_95
          +1 checkstyle 0m 29s trunk passed
          +1 mvnsite 1m 11s trunk passed
          +1 mvneclipse 0m 19s trunk passed
          +1 findbugs 2m 35s trunk passed
          +1 javadoc 1m 41s trunk passed with JDK v1.8.0_72
          +1 javadoc 2m 28s trunk passed with JDK v1.7.0_95
          +1 mvninstall 1m 5s the patch passed
          +1 compile 1m 5s the patch passed with JDK v1.8.0_72
          +1 javac 1m 5s the patch passed
          +1 compile 0m 55s the patch passed with JDK v1.7.0_95
          +1 javac 0m 55s the patch passed
          +1 checkstyle 0m 24s the patch passed
          +1 mvnsite 1m 10s the patch passed
          +1 mvneclipse 0m 16s the patch passed
          +1 whitespace 0m 0s Patch has no whitespace issues.
          +1 findbugs 2m 53s the patch passed
          +1 javadoc 1m 32s the patch passed with JDK v1.8.0_72
          +1 javadoc 2m 29s the patch passed with JDK v1.7.0_95
          -1 unit 83m 52s hadoop-hdfs in the patch failed with JDK v1.8.0_72.
          -1 unit 80m 53s hadoop-hdfs in the patch failed with JDK v1.7.0_95.
          +1 asflicense 0m 29s Patch does not generate ASF License warnings.
          199m 3s



          Reason Tests
          JDK v1.8.0_72 Failed junit tests hadoop.fs.TestHdfsNativeCodeLoader
            hadoop.hdfs.server.namenode.TestFSImageWithSnapshot
            hadoop.hdfs.TestFileAppend
            hadoop.hdfs.server.datanode.TestBlockScanner
            hadoop.hdfs.server.datanode.TestDirectoryScanner
            hadoop.hdfs.security.TestDelegationTokenForProxyUser
          JDK v1.7.0_95 Failed junit tests hadoop.fs.TestHdfsNativeCodeLoader
            hadoop.hdfs.server.datanode.TestBlockScanner
            hadoop.hdfs.server.datanode.TestDirectoryScanner
          JDK v1.7.0_95 Timed out junit tests org.apache.hadoop.hdfs.TestErasureCodeBenchmarkThroughput



          Subsystem Report/Notes
          Docker Image:yetus/hadoop:0ca8df7
          JIRA Patch URL https://issues.apache.org/jira/secure/attachment/12787035/HDFS-9637.004.patch
          JIRA Issue HDFS-9637
          Optional Tests asflicense compile javac javadoc mvninstall mvnsite unit findbugs checkstyle
          uname Linux 4fc11b25a1ef 3.13.0-36-lowlatency #63-Ubuntu SMP PREEMPT Wed Sep 3 21:56:12 UTC 2014 x86_64 x86_64 x86_64 GNU/Linux
          Build tool maven
          Personality /testptch/hadoop/patchprocess/precommit/personality/provided.sh
          git revision trunk / acac729
          Default Java 1.7.0_95
          Multi-JDK versions /usr/lib/jvm/java-8-oracle:1.8.0_72 /usr/lib/jvm/java-7-openjdk-amd64:1.7.0_95
          findbugs v3.0.0
          unit https://builds.apache.org/job/PreCommit-HDFS-Build/14437/artifact/patchprocess/patch-unit-hadoop-hdfs-project_hadoop-hdfs-jdk1.8.0_72.txt
          unit https://builds.apache.org/job/PreCommit-HDFS-Build/14437/artifact/patchprocess/patch-unit-hadoop-hdfs-project_hadoop-hdfs-jdk1.7.0_95.txt
          unit test logs https://builds.apache.org/job/PreCommit-HDFS-Build/14437/artifact/patchprocess/patch-unit-hadoop-hdfs-project_hadoop-hdfs-jdk1.8.0_72.txt https://builds.apache.org/job/PreCommit-HDFS-Build/14437/artifact/patchprocess/patch-unit-hadoop-hdfs-project_hadoop-hdfs-jdk1.7.0_95.txt
          JDK v1.7.0_95 Test Results https://builds.apache.org/job/PreCommit-HDFS-Build/14437/testReport/
          modules C: hadoop-hdfs-project/hadoop-hdfs U: hadoop-hdfs-project/hadoop-hdfs
          Max memory used 76MB
          Console output https://builds.apache.org/job/PreCommit-HDFS-Build/14437/console
          Powered by Apache Yetus 0.2.0-SNAPSHOT http://yetus.apache.org

          This message was automatically generated.

          Show
          hadoopqa Hadoop QA added a comment - -1 overall Vote Subsystem Runtime Comment 0 reexec 0m 13s Docker mode activated. +1 @author 0m 0s The patch does not contain any @author tags. +1 test4tests 0m 0s The patch appears to include 1 new or modified test files. +1 mvninstall 9m 36s trunk passed +1 compile 1m 7s trunk passed with JDK v1.8.0_72 +1 compile 0m 56s trunk passed with JDK v1.7.0_95 +1 checkstyle 0m 29s trunk passed +1 mvnsite 1m 11s trunk passed +1 mvneclipse 0m 19s trunk passed +1 findbugs 2m 35s trunk passed +1 javadoc 1m 41s trunk passed with JDK v1.8.0_72 +1 javadoc 2m 28s trunk passed with JDK v1.7.0_95 +1 mvninstall 1m 5s the patch passed +1 compile 1m 5s the patch passed with JDK v1.8.0_72 +1 javac 1m 5s the patch passed +1 compile 0m 55s the patch passed with JDK v1.7.0_95 +1 javac 0m 55s the patch passed +1 checkstyle 0m 24s the patch passed +1 mvnsite 1m 10s the patch passed +1 mvneclipse 0m 16s the patch passed +1 whitespace 0m 0s Patch has no whitespace issues. +1 findbugs 2m 53s the patch passed +1 javadoc 1m 32s the patch passed with JDK v1.8.0_72 +1 javadoc 2m 29s the patch passed with JDK v1.7.0_95 -1 unit 83m 52s hadoop-hdfs in the patch failed with JDK v1.8.0_72. -1 unit 80m 53s hadoop-hdfs in the patch failed with JDK v1.7.0_95. +1 asflicense 0m 29s Patch does not generate ASF License warnings. 199m 3s Reason Tests JDK v1.8.0_72 Failed junit tests hadoop.fs.TestHdfsNativeCodeLoader   hadoop.hdfs.server.namenode.TestFSImageWithSnapshot   hadoop.hdfs.TestFileAppend   hadoop.hdfs.server.datanode.TestBlockScanner   hadoop.hdfs.server.datanode.TestDirectoryScanner   hadoop.hdfs.security.TestDelegationTokenForProxyUser JDK v1.7.0_95 Failed junit tests hadoop.fs.TestHdfsNativeCodeLoader   hadoop.hdfs.server.datanode.TestBlockScanner   hadoop.hdfs.server.datanode.TestDirectoryScanner JDK v1.7.0_95 Timed out junit tests org.apache.hadoop.hdfs.TestErasureCodeBenchmarkThroughput Subsystem Report/Notes Docker Image:yetus/hadoop:0ca8df7 JIRA Patch URL https://issues.apache.org/jira/secure/attachment/12787035/HDFS-9637.004.patch JIRA Issue HDFS-9637 Optional Tests asflicense compile javac javadoc mvninstall mvnsite unit findbugs checkstyle uname Linux 4fc11b25a1ef 3.13.0-36-lowlatency #63-Ubuntu SMP PREEMPT Wed Sep 3 21:56:12 UTC 2014 x86_64 x86_64 x86_64 GNU/Linux Build tool maven Personality /testptch/hadoop/patchprocess/precommit/personality/provided.sh git revision trunk / acac729 Default Java 1.7.0_95 Multi-JDK versions /usr/lib/jvm/java-8-oracle:1.8.0_72 /usr/lib/jvm/java-7-openjdk-amd64:1.7.0_95 findbugs v3.0.0 unit https://builds.apache.org/job/PreCommit-HDFS-Build/14437/artifact/patchprocess/patch-unit-hadoop-hdfs-project_hadoop-hdfs-jdk1.8.0_72.txt unit https://builds.apache.org/job/PreCommit-HDFS-Build/14437/artifact/patchprocess/patch-unit-hadoop-hdfs-project_hadoop-hdfs-jdk1.7.0_95.txt unit test logs https://builds.apache.org/job/PreCommit-HDFS-Build/14437/artifact/patchprocess/patch-unit-hadoop-hdfs-project_hadoop-hdfs-jdk1.8.0_72.txt https://builds.apache.org/job/PreCommit-HDFS-Build/14437/artifact/patchprocess/patch-unit-hadoop-hdfs-project_hadoop-hdfs-jdk1.7.0_95.txt JDK v1.7.0_95 Test Results https://builds.apache.org/job/PreCommit-HDFS-Build/14437/testReport/ modules C: hadoop-hdfs-project/hadoop-hdfs U: hadoop-hdfs-project/hadoop-hdfs Max memory used 76MB Console output https://builds.apache.org/job/PreCommit-HDFS-Build/14437/console Powered by Apache Yetus 0.2.0-SNAPSHOT http://yetus.apache.org This message was automatically generated.
          Hide
          templedf Daniel Templeton added a comment -

          Reposting patch 4 as it wasn't the current code.

          Show
          templedf Daniel Templeton added a comment - Reposting patch 4 as it wasn't the current code.
          Hide
          hadoopqa Hadoop QA added a comment -
          -1 overall



          Vote Subsystem Runtime Comment
          0 reexec 0m 11s Docker mode activated.
          +1 @author 0m 0s The patch does not contain any @author tags.
          +1 test4tests 0m 0s The patch appears to include 1 new or modified test files.
          +1 mvninstall 6m 34s trunk passed
          +1 compile 0m 38s trunk passed with JDK v1.8.0_72
          +1 compile 0m 39s trunk passed with JDK v1.7.0_95
          +1 checkstyle 0m 20s trunk passed
          +1 mvnsite 0m 51s trunk passed
          +1 mvneclipse 0m 14s trunk passed
          +1 findbugs 1m 50s trunk passed
          +1 javadoc 1m 4s trunk passed with JDK v1.8.0_72
          +1 javadoc 1m 44s trunk passed with JDK v1.7.0_95
          +1 mvninstall 0m 44s the patch passed
          +1 compile 0m 34s the patch passed with JDK v1.8.0_72
          +1 javac 0m 34s the patch passed
          +1 compile 0m 37s the patch passed with JDK v1.7.0_95
          +1 javac 0m 37s the patch passed
          +1 checkstyle 0m 18s the patch passed
          +1 mvnsite 0m 48s the patch passed
          +1 mvneclipse 0m 11s the patch passed
          +1 whitespace 0m 0s Patch has no whitespace issues.
          +1 findbugs 2m 8s the patch passed
          +1 javadoc 1m 1s the patch passed with JDK v1.8.0_72
          +1 javadoc 1m 43s the patch passed with JDK v1.7.0_95
          -1 unit 51m 44s hadoop-hdfs in the patch failed with JDK v1.8.0_72.
          -1 unit 50m 11s hadoop-hdfs in the patch failed with JDK v1.7.0_95.
          +1 asflicense 0m 21s Patch does not generate ASF License warnings.
          125m 26s



          Reason Tests
          JDK v1.8.0_72 Failed junit tests hadoop.hdfs.web.TestWebHDFS
            hadoop.hdfs.TestDFSUpgradeFromImage
            hadoop.metrics2.sink.TestRollingFileSystemSinkWithHdfs
            hadoop.fs.TestHdfsNativeCodeLoader
          JDK v1.7.0_95 Failed junit tests hadoop.metrics2.sink.TestRollingFileSystemSinkWithHdfs
            hadoop.fs.TestHdfsNativeCodeLoader



          Subsystem Report/Notes
          Docker Image:yetus/hadoop:0ca8df7
          JIRA Patch URL https://issues.apache.org/jira/secure/attachment/12786998/HDFS-9637.004.patch
          JIRA Issue HDFS-9637
          Optional Tests asflicense compile javac javadoc mvninstall mvnsite unit findbugs checkstyle
          uname Linux 9d6c6270b927 3.13.0-36-lowlatency #63-Ubuntu SMP PREEMPT Wed Sep 3 21:56:12 UTC 2014 x86_64 x86_64 x86_64 GNU/Linux
          Build tool maven
          Personality /testptch/hadoop/patchprocess/precommit/personality/provided.sh
          git revision trunk / acac729
          Default Java 1.7.0_95
          Multi-JDK versions /usr/lib/jvm/java-8-oracle:1.8.0_72 /usr/lib/jvm/java-7-openjdk-amd64:1.7.0_95
          findbugs v3.0.0
          unit https://builds.apache.org/job/PreCommit-HDFS-Build/14434/artifact/patchprocess/patch-unit-hadoop-hdfs-project_hadoop-hdfs-jdk1.8.0_72.txt
          unit https://builds.apache.org/job/PreCommit-HDFS-Build/14434/artifact/patchprocess/patch-unit-hadoop-hdfs-project_hadoop-hdfs-jdk1.7.0_95.txt
          unit test logs https://builds.apache.org/job/PreCommit-HDFS-Build/14434/artifact/patchprocess/patch-unit-hadoop-hdfs-project_hadoop-hdfs-jdk1.8.0_72.txt https://builds.apache.org/job/PreCommit-HDFS-Build/14434/artifact/patchprocess/patch-unit-hadoop-hdfs-project_hadoop-hdfs-jdk1.7.0_95.txt
          JDK v1.7.0_95 Test Results https://builds.apache.org/job/PreCommit-HDFS-Build/14434/testReport/
          modules C: hadoop-hdfs-project/hadoop-hdfs U: hadoop-hdfs-project/hadoop-hdfs
          Max memory used 77MB
          Console output https://builds.apache.org/job/PreCommit-HDFS-Build/14434/console
          Powered by Apache Yetus 0.2.0-SNAPSHOT http://yetus.apache.org

          This message was automatically generated.

          Show
          hadoopqa Hadoop QA added a comment - -1 overall Vote Subsystem Runtime Comment 0 reexec 0m 11s Docker mode activated. +1 @author 0m 0s The patch does not contain any @author tags. +1 test4tests 0m 0s The patch appears to include 1 new or modified test files. +1 mvninstall 6m 34s trunk passed +1 compile 0m 38s trunk passed with JDK v1.8.0_72 +1 compile 0m 39s trunk passed with JDK v1.7.0_95 +1 checkstyle 0m 20s trunk passed +1 mvnsite 0m 51s trunk passed +1 mvneclipse 0m 14s trunk passed +1 findbugs 1m 50s trunk passed +1 javadoc 1m 4s trunk passed with JDK v1.8.0_72 +1 javadoc 1m 44s trunk passed with JDK v1.7.0_95 +1 mvninstall 0m 44s the patch passed +1 compile 0m 34s the patch passed with JDK v1.8.0_72 +1 javac 0m 34s the patch passed +1 compile 0m 37s the patch passed with JDK v1.7.0_95 +1 javac 0m 37s the patch passed +1 checkstyle 0m 18s the patch passed +1 mvnsite 0m 48s the patch passed +1 mvneclipse 0m 11s the patch passed +1 whitespace 0m 0s Patch has no whitespace issues. +1 findbugs 2m 8s the patch passed +1 javadoc 1m 1s the patch passed with JDK v1.8.0_72 +1 javadoc 1m 43s the patch passed with JDK v1.7.0_95 -1 unit 51m 44s hadoop-hdfs in the patch failed with JDK v1.8.0_72. -1 unit 50m 11s hadoop-hdfs in the patch failed with JDK v1.7.0_95. +1 asflicense 0m 21s Patch does not generate ASF License warnings. 125m 26s Reason Tests JDK v1.8.0_72 Failed junit tests hadoop.hdfs.web.TestWebHDFS   hadoop.hdfs.TestDFSUpgradeFromImage   hadoop.metrics2.sink.TestRollingFileSystemSinkWithHdfs   hadoop.fs.TestHdfsNativeCodeLoader JDK v1.7.0_95 Failed junit tests hadoop.metrics2.sink.TestRollingFileSystemSinkWithHdfs   hadoop.fs.TestHdfsNativeCodeLoader Subsystem Report/Notes Docker Image:yetus/hadoop:0ca8df7 JIRA Patch URL https://issues.apache.org/jira/secure/attachment/12786998/HDFS-9637.004.patch JIRA Issue HDFS-9637 Optional Tests asflicense compile javac javadoc mvninstall mvnsite unit findbugs checkstyle uname Linux 9d6c6270b927 3.13.0-36-lowlatency #63-Ubuntu SMP PREEMPT Wed Sep 3 21:56:12 UTC 2014 x86_64 x86_64 x86_64 GNU/Linux Build tool maven Personality /testptch/hadoop/patchprocess/precommit/personality/provided.sh git revision trunk / acac729 Default Java 1.7.0_95 Multi-JDK versions /usr/lib/jvm/java-8-oracle:1.8.0_72 /usr/lib/jvm/java-7-openjdk-amd64:1.7.0_95 findbugs v3.0.0 unit https://builds.apache.org/job/PreCommit-HDFS-Build/14434/artifact/patchprocess/patch-unit-hadoop-hdfs-project_hadoop-hdfs-jdk1.8.0_72.txt unit https://builds.apache.org/job/PreCommit-HDFS-Build/14434/artifact/patchprocess/patch-unit-hadoop-hdfs-project_hadoop-hdfs-jdk1.7.0_95.txt unit test logs https://builds.apache.org/job/PreCommit-HDFS-Build/14434/artifact/patchprocess/patch-unit-hadoop-hdfs-project_hadoop-hdfs-jdk1.8.0_72.txt https://builds.apache.org/job/PreCommit-HDFS-Build/14434/artifact/patchprocess/patch-unit-hadoop-hdfs-project_hadoop-hdfs-jdk1.7.0_95.txt JDK v1.7.0_95 Test Results https://builds.apache.org/job/PreCommit-HDFS-Build/14434/testReport/ modules C: hadoop-hdfs-project/hadoop-hdfs U: hadoop-hdfs-project/hadoop-hdfs Max memory used 77MB Console output https://builds.apache.org/job/PreCommit-HDFS-Build/14434/console Powered by Apache Yetus 0.2.0-SNAPSHOT http://yetus.apache.org This message was automatically generated.
          Hide
          templedf Daniel Templeton added a comment -

          Patch should work now.

          Show
          templedf Daniel Templeton added a comment - Patch should work now.
          Hide
          hadoopqa Hadoop QA added a comment -
          -1 overall



          Vote Subsystem Runtime Comment
          0 reexec 11m 52s Docker mode activated.
          +1 @author 0m 0s The patch does not contain any @author tags.
          +1 test4tests 0m 0s The patch appears to include 1 new or modified test files.
          +1 mvninstall 6m 57s trunk passed
          +1 compile 0m 39s trunk passed with JDK v1.8.0_72
          +1 compile 0m 40s trunk passed with JDK v1.7.0_95
          +1 checkstyle 0m 21s trunk passed
          +1 mvnsite 0m 52s trunk passed
          +1 mvneclipse 0m 14s trunk passed
          +1 findbugs 1m 56s trunk passed
          +1 javadoc 1m 8s trunk passed with JDK v1.8.0_72
          +1 javadoc 1m 48s trunk passed with JDK v1.7.0_95
          -1 mvninstall 0m 37s hadoop-hdfs in the patch failed.
          -1 compile 0m 35s hadoop-hdfs in the patch failed with JDK v1.8.0_72.
          -1 javac 0m 35s hadoop-hdfs in the patch failed with JDK v1.8.0_72.
          -1 compile 0m 38s hadoop-hdfs in the patch failed with JDK v1.7.0_95.
          -1 javac 0m 38s hadoop-hdfs in the patch failed with JDK v1.7.0_95.
          +1 checkstyle 0m 18s the patch passed
          -1 mvnsite 0m 39s hadoop-hdfs in the patch failed.
          +1 mvneclipse 0m 10s the patch passed
          +1 whitespace 0m 0s Patch has no whitespace issues.
          -1 findbugs 0m 18s hadoop-hdfs in the patch failed.
          +1 javadoc 1m 3s the patch passed with JDK v1.8.0_72
          +1 javadoc 1m 44s the patch passed with JDK v1.7.0_95
          -1 unit 0m 34s hadoop-hdfs in the patch failed with JDK v1.8.0_72.
          -1 unit 0m 37s hadoop-hdfs in the patch failed with JDK v1.7.0_95.
          +1 asflicense 0m 20s Patch does not generate ASF License warnings.
          35m 51s



          Subsystem Report/Notes
          Docker Image:yetus/hadoop:0ca8df7
          JIRA Patch URL https://issues.apache.org/jira/secure/attachment/12786878/HDFS-9637.003.patch
          JIRA Issue HDFS-9637
          Optional Tests asflicense compile javac javadoc mvninstall mvnsite unit findbugs checkstyle
          uname Linux 9e24b43d34e9 3.13.0-36-lowlatency #63-Ubuntu SMP PREEMPT Wed Sep 3 21:56:12 UTC 2014 x86_64 x86_64 x86_64 GNU/Linux
          Build tool maven
          Personality /testptch/hadoop/patchprocess/precommit/personality/provided.sh
          git revision trunk / 193d27d
          Default Java 1.7.0_95
          Multi-JDK versions /usr/lib/jvm/java-8-oracle:1.8.0_72 /usr/lib/jvm/java-7-openjdk-amd64:1.7.0_95
          findbugs v3.0.0
          mvninstall https://builds.apache.org/job/PreCommit-HDFS-Build/14430/artifact/patchprocess/patch-mvninstall-hadoop-hdfs-project_hadoop-hdfs.txt
          compile https://builds.apache.org/job/PreCommit-HDFS-Build/14430/artifact/patchprocess/patch-compile-hadoop-hdfs-project_hadoop-hdfs-jdk1.8.0_72.txt
          javac https://builds.apache.org/job/PreCommit-HDFS-Build/14430/artifact/patchprocess/patch-compile-hadoop-hdfs-project_hadoop-hdfs-jdk1.8.0_72.txt
          compile https://builds.apache.org/job/PreCommit-HDFS-Build/14430/artifact/patchprocess/patch-compile-hadoop-hdfs-project_hadoop-hdfs-jdk1.7.0_95.txt
          javac https://builds.apache.org/job/PreCommit-HDFS-Build/14430/artifact/patchprocess/patch-compile-hadoop-hdfs-project_hadoop-hdfs-jdk1.7.0_95.txt
          mvnsite https://builds.apache.org/job/PreCommit-HDFS-Build/14430/artifact/patchprocess/patch-mvnsite-hadoop-hdfs-project_hadoop-hdfs.txt
          findbugs https://builds.apache.org/job/PreCommit-HDFS-Build/14430/artifact/patchprocess/patch-findbugs-hadoop-hdfs-project_hadoop-hdfs.txt
          unit https://builds.apache.org/job/PreCommit-HDFS-Build/14430/artifact/patchprocess/patch-unit-hadoop-hdfs-project_hadoop-hdfs-jdk1.8.0_72.txt
          unit https://builds.apache.org/job/PreCommit-HDFS-Build/14430/artifact/patchprocess/patch-unit-hadoop-hdfs-project_hadoop-hdfs-jdk1.7.0_95.txt
          JDK v1.7.0_95 Test Results https://builds.apache.org/job/PreCommit-HDFS-Build/14430/testReport/
          modules C: hadoop-hdfs-project/hadoop-hdfs U: hadoop-hdfs-project/hadoop-hdfs
          Max memory used 77MB
          Console output https://builds.apache.org/job/PreCommit-HDFS-Build/14430/console
          Powered by Apache Yetus 0.2.0-SNAPSHOT http://yetus.apache.org

          This message was automatically generated.

          Show
          hadoopqa Hadoop QA added a comment - -1 overall Vote Subsystem Runtime Comment 0 reexec 11m 52s Docker mode activated. +1 @author 0m 0s The patch does not contain any @author tags. +1 test4tests 0m 0s The patch appears to include 1 new or modified test files. +1 mvninstall 6m 57s trunk passed +1 compile 0m 39s trunk passed with JDK v1.8.0_72 +1 compile 0m 40s trunk passed with JDK v1.7.0_95 +1 checkstyle 0m 21s trunk passed +1 mvnsite 0m 52s trunk passed +1 mvneclipse 0m 14s trunk passed +1 findbugs 1m 56s trunk passed +1 javadoc 1m 8s trunk passed with JDK v1.8.0_72 +1 javadoc 1m 48s trunk passed with JDK v1.7.0_95 -1 mvninstall 0m 37s hadoop-hdfs in the patch failed. -1 compile 0m 35s hadoop-hdfs in the patch failed with JDK v1.8.0_72. -1 javac 0m 35s hadoop-hdfs in the patch failed with JDK v1.8.0_72. -1 compile 0m 38s hadoop-hdfs in the patch failed with JDK v1.7.0_95. -1 javac 0m 38s hadoop-hdfs in the patch failed with JDK v1.7.0_95. +1 checkstyle 0m 18s the patch passed -1 mvnsite 0m 39s hadoop-hdfs in the patch failed. +1 mvneclipse 0m 10s the patch passed +1 whitespace 0m 0s Patch has no whitespace issues. -1 findbugs 0m 18s hadoop-hdfs in the patch failed. +1 javadoc 1m 3s the patch passed with JDK v1.8.0_72 +1 javadoc 1m 44s the patch passed with JDK v1.7.0_95 -1 unit 0m 34s hadoop-hdfs in the patch failed with JDK v1.8.0_72. -1 unit 0m 37s hadoop-hdfs in the patch failed with JDK v1.7.0_95. +1 asflicense 0m 20s Patch does not generate ASF License warnings. 35m 51s Subsystem Report/Notes Docker Image:yetus/hadoop:0ca8df7 JIRA Patch URL https://issues.apache.org/jira/secure/attachment/12786878/HDFS-9637.003.patch JIRA Issue HDFS-9637 Optional Tests asflicense compile javac javadoc mvninstall mvnsite unit findbugs checkstyle uname Linux 9e24b43d34e9 3.13.0-36-lowlatency #63-Ubuntu SMP PREEMPT Wed Sep 3 21:56:12 UTC 2014 x86_64 x86_64 x86_64 GNU/Linux Build tool maven Personality /testptch/hadoop/patchprocess/precommit/personality/provided.sh git revision trunk / 193d27d Default Java 1.7.0_95 Multi-JDK versions /usr/lib/jvm/java-8-oracle:1.8.0_72 /usr/lib/jvm/java-7-openjdk-amd64:1.7.0_95 findbugs v3.0.0 mvninstall https://builds.apache.org/job/PreCommit-HDFS-Build/14430/artifact/patchprocess/patch-mvninstall-hadoop-hdfs-project_hadoop-hdfs.txt compile https://builds.apache.org/job/PreCommit-HDFS-Build/14430/artifact/patchprocess/patch-compile-hadoop-hdfs-project_hadoop-hdfs-jdk1.8.0_72.txt javac https://builds.apache.org/job/PreCommit-HDFS-Build/14430/artifact/patchprocess/patch-compile-hadoop-hdfs-project_hadoop-hdfs-jdk1.8.0_72.txt compile https://builds.apache.org/job/PreCommit-HDFS-Build/14430/artifact/patchprocess/patch-compile-hadoop-hdfs-project_hadoop-hdfs-jdk1.7.0_95.txt javac https://builds.apache.org/job/PreCommit-HDFS-Build/14430/artifact/patchprocess/patch-compile-hadoop-hdfs-project_hadoop-hdfs-jdk1.7.0_95.txt mvnsite https://builds.apache.org/job/PreCommit-HDFS-Build/14430/artifact/patchprocess/patch-mvnsite-hadoop-hdfs-project_hadoop-hdfs.txt findbugs https://builds.apache.org/job/PreCommit-HDFS-Build/14430/artifact/patchprocess/patch-findbugs-hadoop-hdfs-project_hadoop-hdfs.txt unit https://builds.apache.org/job/PreCommit-HDFS-Build/14430/artifact/patchprocess/patch-unit-hadoop-hdfs-project_hadoop-hdfs-jdk1.8.0_72.txt unit https://builds.apache.org/job/PreCommit-HDFS-Build/14430/artifact/patchprocess/patch-unit-hadoop-hdfs-project_hadoop-hdfs-jdk1.7.0_95.txt JDK v1.7.0_95 Test Results https://builds.apache.org/job/PreCommit-HDFS-Build/14430/testReport/ modules C: hadoop-hdfs-project/hadoop-hdfs U: hadoop-hdfs-project/hadoop-hdfs Max memory used 77MB Console output https://builds.apache.org/job/PreCommit-HDFS-Build/14430/console Powered by Apache Yetus 0.2.0-SNAPSHOT http://yetus.apache.org This message was automatically generated.
          Hide
          templedf Daniel Templeton added a comment -

          Based on changes to HADOOP-12775, narrowing this patch back down to HADOOP-12702 and HADOOP-12759. Given that both are already in, this one is ready to go.

          Show
          templedf Daniel Templeton added a comment - Based on changes to HADOOP-12775 , narrowing this patch back down to HADOOP-12702 and HADOOP-12759 . Given that both are already in, this one is ready to go.
          Hide
          hadoopqa Hadoop QA added a comment -
          -1 overall



          Vote Subsystem Runtime Comment
          0 reexec 0m 10s Docker mode activated.
          +1 @author 0m 0s The patch does not contain any @author tags.
          +1 test4tests 0m 0s The patch appears to include 1 new or modified test files.
          0 mvndep 0m 8s Maven dependency ordering for branch
          +1 mvninstall 6m 34s trunk passed
          +1 compile 0m 39s trunk passed with JDK v1.8.0_66
          +1 compile 0m 39s trunk passed with JDK v1.7.0_91
          +1 checkstyle 0m 20s trunk passed
          +1 mvnsite 0m 51s trunk passed
          +1 mvneclipse 0m 14s trunk passed
          +1 findbugs 1m 57s trunk passed
          +1 javadoc 1m 3s trunk passed with JDK v1.8.0_66
          +1 javadoc 1m 45s trunk passed with JDK v1.7.0_91
          0 mvndep 0m 8s Maven dependency ordering for patch
          -1 mvninstall 0m 37s hadoop-hdfs in the patch failed.
          -1 compile 0m 38s hadoop-hdfs in the patch failed with JDK v1.8.0_66.
          -1 javac 0m 38s hadoop-hdfs in the patch failed with JDK v1.8.0_66.
          -1 compile 0m 37s hadoop-hdfs in the patch failed with JDK v1.7.0_91.
          -1 javac 0m 37s hadoop-hdfs in the patch failed with JDK v1.7.0_91.
          +1 checkstyle 0m 18s the patch passed
          -1 mvnsite 0m 40s hadoop-hdfs in the patch failed.
          +1 mvneclipse 0m 11s the patch passed
          +1 whitespace 0m 0s Patch has no whitespace issues.
          -1 findbugs 0m 19s hadoop-hdfs in the patch failed.
          +1 javadoc 1m 4s the patch passed with JDK v1.8.0_66
          +1 javadoc 1m 46s the patch passed with JDK v1.7.0_91
          -1 unit 0m 37s hadoop-hdfs in the patch failed with JDK v1.8.0_66.
          -1 unit 0m 40s hadoop-hdfs in the patch failed with JDK v1.7.0_91.
          +1 asflicense 0m 18s Patch does not generate ASF License warnings.
          24m 8s



          Subsystem Report/Notes
          Docker Image:yetus/hadoop:0ca8df7
          JIRA Patch URL https://issues.apache.org/jira/secure/attachment/12786674/HDFS-9637.002.patch
          JIRA Issue HDFS-9637
          Optional Tests asflicense compile javac javadoc mvninstall mvnsite unit findbugs checkstyle
          uname Linux 8d3225a05716 3.13.0-36-lowlatency #63-Ubuntu SMP PREEMPT Wed Sep 3 21:56:12 UTC 2014 x86_64 x86_64 x86_64 GNU/Linux
          Build tool maven
          Personality /testptch/hadoop/patchprocess/precommit/personality/provided.sh
          git revision trunk / 29ae258
          Default Java 1.7.0_91
          Multi-JDK versions /usr/lib/jvm/java-8-oracle:1.8.0_66 /usr/lib/jvm/java-7-openjdk-amd64:1.7.0_91
          findbugs v3.0.0
          mvninstall https://builds.apache.org/job/PreCommit-HDFS-Build/14419/artifact/patchprocess/patch-mvninstall-hadoop-hdfs-project_hadoop-hdfs.txt
          compile https://builds.apache.org/job/PreCommit-HDFS-Build/14419/artifact/patchprocess/patch-compile-hadoop-hdfs-project_hadoop-hdfs-jdk1.8.0_66.txt
          javac https://builds.apache.org/job/PreCommit-HDFS-Build/14419/artifact/patchprocess/patch-compile-hadoop-hdfs-project_hadoop-hdfs-jdk1.8.0_66.txt
          compile https://builds.apache.org/job/PreCommit-HDFS-Build/14419/artifact/patchprocess/patch-compile-hadoop-hdfs-project_hadoop-hdfs-jdk1.7.0_91.txt
          javac https://builds.apache.org/job/PreCommit-HDFS-Build/14419/artifact/patchprocess/patch-compile-hadoop-hdfs-project_hadoop-hdfs-jdk1.7.0_91.txt
          mvnsite https://builds.apache.org/job/PreCommit-HDFS-Build/14419/artifact/patchprocess/patch-mvnsite-hadoop-hdfs-project_hadoop-hdfs.txt
          findbugs https://builds.apache.org/job/PreCommit-HDFS-Build/14419/artifact/patchprocess/patch-findbugs-hadoop-hdfs-project_hadoop-hdfs.txt
          unit https://builds.apache.org/job/PreCommit-HDFS-Build/14419/artifact/patchprocess/patch-unit-hadoop-hdfs-project_hadoop-hdfs-jdk1.8.0_66.txt
          unit https://builds.apache.org/job/PreCommit-HDFS-Build/14419/artifact/patchprocess/patch-unit-hadoop-hdfs-project_hadoop-hdfs-jdk1.7.0_91.txt
          JDK v1.7.0_91 Test Results https://builds.apache.org/job/PreCommit-HDFS-Build/14419/testReport/
          modules C: hadoop-hdfs-project/hadoop-hdfs U: hadoop-hdfs-project/hadoop-hdfs
          Max memory used 76MB
          Console output https://builds.apache.org/job/PreCommit-HDFS-Build/14419/console
          Powered by Apache Yetus 0.2.0-SNAPSHOT http://yetus.apache.org

          This message was automatically generated.

          Show
          hadoopqa Hadoop QA added a comment - -1 overall Vote Subsystem Runtime Comment 0 reexec 0m 10s Docker mode activated. +1 @author 0m 0s The patch does not contain any @author tags. +1 test4tests 0m 0s The patch appears to include 1 new or modified test files. 0 mvndep 0m 8s Maven dependency ordering for branch +1 mvninstall 6m 34s trunk passed +1 compile 0m 39s trunk passed with JDK v1.8.0_66 +1 compile 0m 39s trunk passed with JDK v1.7.0_91 +1 checkstyle 0m 20s trunk passed +1 mvnsite 0m 51s trunk passed +1 mvneclipse 0m 14s trunk passed +1 findbugs 1m 57s trunk passed +1 javadoc 1m 3s trunk passed with JDK v1.8.0_66 +1 javadoc 1m 45s trunk passed with JDK v1.7.0_91 0 mvndep 0m 8s Maven dependency ordering for patch -1 mvninstall 0m 37s hadoop-hdfs in the patch failed. -1 compile 0m 38s hadoop-hdfs in the patch failed with JDK v1.8.0_66. -1 javac 0m 38s hadoop-hdfs in the patch failed with JDK v1.8.0_66. -1 compile 0m 37s hadoop-hdfs in the patch failed with JDK v1.7.0_91. -1 javac 0m 37s hadoop-hdfs in the patch failed with JDK v1.7.0_91. +1 checkstyle 0m 18s the patch passed -1 mvnsite 0m 40s hadoop-hdfs in the patch failed. +1 mvneclipse 0m 11s the patch passed +1 whitespace 0m 0s Patch has no whitespace issues. -1 findbugs 0m 19s hadoop-hdfs in the patch failed. +1 javadoc 1m 4s the patch passed with JDK v1.8.0_66 +1 javadoc 1m 46s the patch passed with JDK v1.7.0_91 -1 unit 0m 37s hadoop-hdfs in the patch failed with JDK v1.8.0_66. -1 unit 0m 40s hadoop-hdfs in the patch failed with JDK v1.7.0_91. +1 asflicense 0m 18s Patch does not generate ASF License warnings. 24m 8s Subsystem Report/Notes Docker Image:yetus/hadoop:0ca8df7 JIRA Patch URL https://issues.apache.org/jira/secure/attachment/12786674/HDFS-9637.002.patch JIRA Issue HDFS-9637 Optional Tests asflicense compile javac javadoc mvninstall mvnsite unit findbugs checkstyle uname Linux 8d3225a05716 3.13.0-36-lowlatency #63-Ubuntu SMP PREEMPT Wed Sep 3 21:56:12 UTC 2014 x86_64 x86_64 x86_64 GNU/Linux Build tool maven Personality /testptch/hadoop/patchprocess/precommit/personality/provided.sh git revision trunk / 29ae258 Default Java 1.7.0_91 Multi-JDK versions /usr/lib/jvm/java-8-oracle:1.8.0_66 /usr/lib/jvm/java-7-openjdk-amd64:1.7.0_91 findbugs v3.0.0 mvninstall https://builds.apache.org/job/PreCommit-HDFS-Build/14419/artifact/patchprocess/patch-mvninstall-hadoop-hdfs-project_hadoop-hdfs.txt compile https://builds.apache.org/job/PreCommit-HDFS-Build/14419/artifact/patchprocess/patch-compile-hadoop-hdfs-project_hadoop-hdfs-jdk1.8.0_66.txt javac https://builds.apache.org/job/PreCommit-HDFS-Build/14419/artifact/patchprocess/patch-compile-hadoop-hdfs-project_hadoop-hdfs-jdk1.8.0_66.txt compile https://builds.apache.org/job/PreCommit-HDFS-Build/14419/artifact/patchprocess/patch-compile-hadoop-hdfs-project_hadoop-hdfs-jdk1.7.0_91.txt javac https://builds.apache.org/job/PreCommit-HDFS-Build/14419/artifact/patchprocess/patch-compile-hadoop-hdfs-project_hadoop-hdfs-jdk1.7.0_91.txt mvnsite https://builds.apache.org/job/PreCommit-HDFS-Build/14419/artifact/patchprocess/patch-mvnsite-hadoop-hdfs-project_hadoop-hdfs.txt findbugs https://builds.apache.org/job/PreCommit-HDFS-Build/14419/artifact/patchprocess/patch-findbugs-hadoop-hdfs-project_hadoop-hdfs.txt unit https://builds.apache.org/job/PreCommit-HDFS-Build/14419/artifact/patchprocess/patch-unit-hadoop-hdfs-project_hadoop-hdfs-jdk1.8.0_66.txt unit https://builds.apache.org/job/PreCommit-HDFS-Build/14419/artifact/patchprocess/patch-unit-hadoop-hdfs-project_hadoop-hdfs-jdk1.7.0_91.txt JDK v1.7.0_91 Test Results https://builds.apache.org/job/PreCommit-HDFS-Build/14419/testReport/ modules C: hadoop-hdfs-project/hadoop-hdfs U: hadoop-hdfs-project/hadoop-hdfs Max memory used 76MB Console output https://builds.apache.org/job/PreCommit-HDFS-Build/14419/console Powered by Apache Yetus 0.2.0-SNAPSHOT http://yetus.apache.org This message was automatically generated.
          Hide
          hadoopqa Hadoop QA added a comment -
          -1 overall



          Vote Subsystem Runtime Comment
          0 reexec 0m 0s Docker mode activated.
          -1 patch 0m 4s HDFS-9637 does not apply to trunk. Rebase required? Wrong Branch? See https://wiki.apache.org/hadoop/HowToContribute for help.



          Subsystem Report/Notes
          JIRA Patch URL https://issues.apache.org/jira/secure/attachment/12786603/HDFS-9637.002.patch
          JIRA Issue HDFS-9637
          Console output https://builds.apache.org/job/PreCommit-HDFS-Build/14415/console
          Powered by Apache Yetus 0.2.0-SNAPSHOT http://yetus.apache.org

          This message was automatically generated.

          Show
          hadoopqa Hadoop QA added a comment - -1 overall Vote Subsystem Runtime Comment 0 reexec 0m 0s Docker mode activated. -1 patch 0m 4s HDFS-9637 does not apply to trunk. Rebase required? Wrong Branch? See https://wiki.apache.org/hadoop/HowToContribute for help. Subsystem Report/Notes JIRA Patch URL https://issues.apache.org/jira/secure/attachment/12786603/HDFS-9637.002.patch JIRA Issue HDFS-9637 Console output https://builds.apache.org/job/PreCommit-HDFS-Build/14415/console Powered by Apache Yetus 0.2.0-SNAPSHOT http://yetus.apache.org This message was automatically generated.
          Hide
          templedf Daniel Templeton added a comment -

          For the sake of reviewing HADOOP-12759 and HADOOP-12775, I'm updating this patch, but the build will fail until those two patches are committed.

          Show
          templedf Daniel Templeton added a comment - For the sake of reviewing HADOOP-12759 and HADOOP-12775 , I'm updating this patch, but the build will fail until those two patches are committed.
          Hide
          templedf Daniel Templeton added a comment -

          This patch will also need to be updated after HADOOP-12775 goes in.

          Show
          templedf Daniel Templeton added a comment - This patch will also need to be updated after HADOOP-12775 goes in.
          Hide
          templedf Daniel Templeton added a comment -

          This patch will need to be updated after HADOOP-12759 goes in.

          Show
          templedf Daniel Templeton added a comment - This patch will need to be updated after HADOOP-12759 goes in.
          Hide
          hadoopqa Hadoop QA added a comment -
          -1 overall



          Vote Subsystem Runtime Comment
          0 reexec 0m 0s Docker mode activated.
          +1 @author 0m 0s The patch does not contain any @author tags.
          +1 test4tests 0m 0s The patch appears to include 1 new or modified test files.
          0 mvndep 0m 13s Maven dependency ordering for branch
          +1 mvninstall 11m 28s trunk passed
          +1 compile 1m 48s trunk passed with JDK v1.8.0_66
          +1 compile 1m 16s trunk passed with JDK v1.7.0_91
          +1 checkstyle 0m 32s trunk passed
          +1 mvnsite 1m 32s trunk passed
          +1 mvneclipse 0m 22s trunk passed
          +1 findbugs 3m 11s trunk passed
          +1 javadoc 2m 18s trunk passed with JDK v1.8.0_66
          +1 javadoc 3m 29s trunk passed with JDK v1.7.0_91
          0 mvndep 0m 13s Maven dependency ordering for patch
          +1 mvninstall 1m 25s the patch passed
          +1 compile 1m 49s the patch passed with JDK v1.8.0_66
          +1 javac 1m 49s the patch passed
          +1 compile 1m 16s the patch passed with JDK v1.7.0_91
          +1 javac 1m 16s the patch passed
          +1 checkstyle 0m 32s the patch passed
          +1 mvnsite 1m 33s the patch passed
          +1 mvneclipse 0m 18s the patch passed
          +1 whitespace 0m 0s Patch has no whitespace issues.
          +1 findbugs 3m 35s the patch passed
          +1 javadoc 2m 18s the patch passed with JDK v1.8.0_66
          +1 javadoc 3m 18s the patch passed with JDK v1.7.0_91
          -1 unit 93m 57s hadoop-hdfs in the patch failed with JDK v1.8.0_66.
          -1 unit 93m 32s hadoop-hdfs in the patch failed with JDK v1.7.0_91.
          +1 asflicense 0m 32s Patch does not generate ASF License warnings.
          235m 13s



          Reason Tests
          JDK v1.8.0_66 Failed junit tests hadoop.hdfs.server.namenode.TestNamenodeCapacityReport
            hadoop.tracing.TestTracing
            hadoop.hdfs.server.datanode.TestBlockScanner
            hadoop.hdfs.server.namenode.ha.TestEditLogTailer
            hadoop.hdfs.server.datanode.TestDirectoryScanner
            hadoop.hdfs.security.TestDelegationTokenForProxyUser
          JDK v1.8.0_66 Timed out junit tests org.apache.hadoop.hdfs.TestDFSStripedOutputStreamWithFailure
            org.apache.hadoop.hdfs.TestDFSStripedOutputStreamWithFailure130
            org.apache.hadoop.hdfs.TestDFSInotifyEventInputStream
            org.apache.hadoop.hdfs.server.datanode.TestDirectoryScanner
          JDK v1.7.0_91 Failed junit tests hadoop.hdfs.qjournal.TestSecureNNWithQJM
            hadoop.hdfs.TestBlockStoragePolicy
            hadoop.hdfs.TestDFSUpgradeFromImage
            hadoop.hdfs.server.datanode.TestBlockScanner
            hadoop.hdfs.server.datanode.TestDirectoryScanner
            hadoop.hdfs.TestEncryptionZones
            hadoop.hdfs.security.TestDelegationTokenForProxyUser



          Subsystem Report/Notes
          Docker Image:yetus/hadoop:0ca8df7
          JIRA Patch URL https://issues.apache.org/jira/secure/attachment/12785553/HDFS-9637.001.patch
          JIRA Issue HDFS-9637
          Optional Tests asflicense compile javac javadoc mvninstall mvnsite unit findbugs checkstyle
          uname Linux dd2b2c3aaf77 3.13.0-36-lowlatency #63-Ubuntu SMP PREEMPT Wed Sep 3 21:56:12 UTC 2014 x86_64 x86_64 x86_64 GNU/Linux
          Build tool maven
          Personality /testptch/hadoop/patchprocess/precommit/personality/provided.sh
          git revision trunk / 59a212b
          Default Java 1.7.0_91
          Multi-JDK versions /usr/lib/jvm/java-8-oracle:1.8.0_66 /usr/lib/jvm/java-7-openjdk-amd64:1.7.0_91
          findbugs v3.0.0
          unit https://builds.apache.org/job/PreCommit-HDFS-Build/14322/artifact/patchprocess/patch-unit-hadoop-hdfs-project_hadoop-hdfs-jdk1.8.0_66.txt
          unit https://builds.apache.org/job/PreCommit-HDFS-Build/14322/artifact/patchprocess/patch-unit-hadoop-hdfs-project_hadoop-hdfs-jdk1.7.0_91.txt
          unit test logs https://builds.apache.org/job/PreCommit-HDFS-Build/14322/artifact/patchprocess/patch-unit-hadoop-hdfs-project_hadoop-hdfs-jdk1.8.0_66.txt https://builds.apache.org/job/PreCommit-HDFS-Build/14322/artifact/patchprocess/patch-unit-hadoop-hdfs-project_hadoop-hdfs-jdk1.7.0_91.txt
          JDK v1.7.0_91 Test Results https://builds.apache.org/job/PreCommit-HDFS-Build/14322/testReport/
          modules C: hadoop-hdfs-project/hadoop-hdfs U: hadoop-hdfs-project/hadoop-hdfs
          Max memory used 77MB
          Powered by Apache Yetus 0.2.0-SNAPSHOT http://yetus.apache.org
          Console output https://builds.apache.org/job/PreCommit-HDFS-Build/14322/console

          This message was automatically generated.

          Show
          hadoopqa Hadoop QA added a comment - -1 overall Vote Subsystem Runtime Comment 0 reexec 0m 0s Docker mode activated. +1 @author 0m 0s The patch does not contain any @author tags. +1 test4tests 0m 0s The patch appears to include 1 new or modified test files. 0 mvndep 0m 13s Maven dependency ordering for branch +1 mvninstall 11m 28s trunk passed +1 compile 1m 48s trunk passed with JDK v1.8.0_66 +1 compile 1m 16s trunk passed with JDK v1.7.0_91 +1 checkstyle 0m 32s trunk passed +1 mvnsite 1m 32s trunk passed +1 mvneclipse 0m 22s trunk passed +1 findbugs 3m 11s trunk passed +1 javadoc 2m 18s trunk passed with JDK v1.8.0_66 +1 javadoc 3m 29s trunk passed with JDK v1.7.0_91 0 mvndep 0m 13s Maven dependency ordering for patch +1 mvninstall 1m 25s the patch passed +1 compile 1m 49s the patch passed with JDK v1.8.0_66 +1 javac 1m 49s the patch passed +1 compile 1m 16s the patch passed with JDK v1.7.0_91 +1 javac 1m 16s the patch passed +1 checkstyle 0m 32s the patch passed +1 mvnsite 1m 33s the patch passed +1 mvneclipse 0m 18s the patch passed +1 whitespace 0m 0s Patch has no whitespace issues. +1 findbugs 3m 35s the patch passed +1 javadoc 2m 18s the patch passed with JDK v1.8.0_66 +1 javadoc 3m 18s the patch passed with JDK v1.7.0_91 -1 unit 93m 57s hadoop-hdfs in the patch failed with JDK v1.8.0_66. -1 unit 93m 32s hadoop-hdfs in the patch failed with JDK v1.7.0_91. +1 asflicense 0m 32s Patch does not generate ASF License warnings. 235m 13s Reason Tests JDK v1.8.0_66 Failed junit tests hadoop.hdfs.server.namenode.TestNamenodeCapacityReport   hadoop.tracing.TestTracing   hadoop.hdfs.server.datanode.TestBlockScanner   hadoop.hdfs.server.namenode.ha.TestEditLogTailer   hadoop.hdfs.server.datanode.TestDirectoryScanner   hadoop.hdfs.security.TestDelegationTokenForProxyUser JDK v1.8.0_66 Timed out junit tests org.apache.hadoop.hdfs.TestDFSStripedOutputStreamWithFailure   org.apache.hadoop.hdfs.TestDFSStripedOutputStreamWithFailure130   org.apache.hadoop.hdfs.TestDFSInotifyEventInputStream   org.apache.hadoop.hdfs.server.datanode.TestDirectoryScanner JDK v1.7.0_91 Failed junit tests hadoop.hdfs.qjournal.TestSecureNNWithQJM   hadoop.hdfs.TestBlockStoragePolicy   hadoop.hdfs.TestDFSUpgradeFromImage   hadoop.hdfs.server.datanode.TestBlockScanner   hadoop.hdfs.server.datanode.TestDirectoryScanner   hadoop.hdfs.TestEncryptionZones   hadoop.hdfs.security.TestDelegationTokenForProxyUser Subsystem Report/Notes Docker Image:yetus/hadoop:0ca8df7 JIRA Patch URL https://issues.apache.org/jira/secure/attachment/12785553/HDFS-9637.001.patch JIRA Issue HDFS-9637 Optional Tests asflicense compile javac javadoc mvninstall mvnsite unit findbugs checkstyle uname Linux dd2b2c3aaf77 3.13.0-36-lowlatency #63-Ubuntu SMP PREEMPT Wed Sep 3 21:56:12 UTC 2014 x86_64 x86_64 x86_64 GNU/Linux Build tool maven Personality /testptch/hadoop/patchprocess/precommit/personality/provided.sh git revision trunk / 59a212b Default Java 1.7.0_91 Multi-JDK versions /usr/lib/jvm/java-8-oracle:1.8.0_66 /usr/lib/jvm/java-7-openjdk-amd64:1.7.0_91 findbugs v3.0.0 unit https://builds.apache.org/job/PreCommit-HDFS-Build/14322/artifact/patchprocess/patch-unit-hadoop-hdfs-project_hadoop-hdfs-jdk1.8.0_66.txt unit https://builds.apache.org/job/PreCommit-HDFS-Build/14322/artifact/patchprocess/patch-unit-hadoop-hdfs-project_hadoop-hdfs-jdk1.7.0_91.txt unit test logs https://builds.apache.org/job/PreCommit-HDFS-Build/14322/artifact/patchprocess/patch-unit-hadoop-hdfs-project_hadoop-hdfs-jdk1.8.0_66.txt https://builds.apache.org/job/PreCommit-HDFS-Build/14322/artifact/patchprocess/patch-unit-hadoop-hdfs-project_hadoop-hdfs-jdk1.7.0_91.txt JDK v1.7.0_91 Test Results https://builds.apache.org/job/PreCommit-HDFS-Build/14322/testReport/ modules C: hadoop-hdfs-project/hadoop-hdfs U: hadoop-hdfs-project/hadoop-hdfs Max memory used 77MB Powered by Apache Yetus 0.2.0-SNAPSHOT http://yetus.apache.org Console output https://builds.apache.org/job/PreCommit-HDFS-Build/14322/console This message was automatically generated.

            People

            • Assignee:
              templedf Daniel Templeton
              Reporter:
              templedf Daniel Templeton
            • Votes:
              0 Vote for this issue
              Watchers:
              5 Start watching this issue

              Dates

              • Created:
                Updated:
                Resolved:

                Development