Uploaded image for project: 'HBase'
  1. HBase
  2. HBASE-6891 Hadoop 2 unit test failures
  3. HBASE-6892

TestImportExport tests failing due to jar manifest issues on Hadoop 2

    Details

    • Type: Sub-task
    • Status: Resolved
    • Priority: Major
    • Resolution: Cannot Reproduce
    • Affects Version/s: None
    • Fix Version/s: None
    • Component/s: None
    • Labels:
      None

      Description

      Seen in recent Hadoop 2 test failures:

      -------------------------------------------------------
       T E S T S
      -------------------------------------------------------
      Running org.apache.hadoop.hbase.mapreduce.TestImportExport
      2012-09-27 15:57:27.192 java[62016:1903] Unable to load realm info from SCDynamicStore
      2012-09-27 15:57:27.325 java[62016:1903] Unable to load realm info from SCDynamicStore
      Tests run: 3, Failures: 0, Errors: 3, Skipped: 0, Time elapsed: 46.22 sec <<< FAILURE!
      
      Results :
      
      Tests in error: 
        testSimpleCase(org.apache.hadoop.hbase.mapreduce.TestImportExport): java.lang.RuntimeException: java.util.zip.ZipException: duplicate entry: META-INF/MANIFEST.MF
        testMetaExport(org.apache.hadoop.hbase.mapreduce.TestImportExport): java.lang.RuntimeException: java.util.zip.ZipException: duplicate entry: META-INF/MANIFEST.MF
      

      Moved over from HBASE-6601.

        Attachments

          Activity

            People

            • Assignee:
              jmhsieh Jonathan Hsieh
              Reporter:
              apurtell Andrew Purtell
            • Votes:
              0 Vote for this issue
              Watchers:
              3 Start watching this issue

              Dates

              • Created:
                Updated:
                Resolved: