Uploaded image for project: 'Hadoop Common'
  1. Hadoop Common
  2. HADOOP-11922

Misspelling of threshold in log4j.properties for tests in hadoop-tools

    Details

    • Type: Bug
    • Status: Resolved
    • Priority: Minor
    • Resolution: Fixed
    • Affects Version/s: 2.7.0
    • Fix Version/s: 2.8.0, 3.0.0-alpha1
    • Component/s: None
    • Labels:
      None
    • Target Version/s:
    • Hadoop Flags:
      Reviewed

      Description

      log4j.properties file for test contains misspelling "log4j.threshhold".
      We should use "log4j.threshold" correctly.

      1. HADOOP-11922.patch
        16 kB
        Gabor Liptak
      2. HADOOP-11922.hadoop-nfs.patch
        0.7 kB
        Gabor Liptak
      3. HADOOP-11922.hadoop-azure.patch
        0.6 kB
        Gabor Liptak
      4. HADOOP-11922.hadoop-aws.patch
        0.6 kB
        Gabor Liptak
      5. HADOOP-11922.002.patch
        1 kB
        Akira Ajisaka

        Issue Links

          Activity

          Hide
          hadoopqa Hadoop QA added a comment -



          -1 overall



          Vote Subsystem Runtime Comment
          0 pre-patch 5m 20s Pre-patch trunk compilation is healthy.
          +1 @author 0m 0s The patch does not contain any @author tags.
          +1 tests included 0m 0s The patch appears to include 20 new or modified test files.
          +1 javac 7m 38s There were no new javac warning messages.
          +1 release audit 0m 19s The applied patch does not increase the total number of release audit warnings.
          +1 whitespace 0m 0s The patch has no lines that end in whitespace.
          +1 install 1m 34s mvn install still works.
          +1 eclipse:eclipse 0m 31s The patch built with eclipse:eclipse.
          +1 common tests 23m 31s Tests passed in hadoop-common.
          +1 common tests 0m 22s Tests passed in hadoop-nfs.
          +1 mapreduce tests 9m 50s Tests passed in hadoop-mapreduce-client-app.
          +1 mapreduce tests 0m 46s Tests passed in hadoop-mapreduce-client-common.
          +1 mapreduce tests 1m 40s Tests passed in hadoop-mapreduce-client-core.
          +1 mapreduce tests 5m 44s Tests passed in hadoop-mapreduce-client-hs.
          -1 mapreduce tests 89m 48s Tests failed in hadoop-mapreduce-client-jobclient.
          +1 mapreduce tests 10m 32s Tests passed in hadoop-mapreduce-client-nativetask.
          +1 mapreduce tests 0m 23s Tests passed in hadoop-mapreduce-client-shuffle.
          +1 tools/hadoop tests 0m 18s Tests passed in hadoop-aws.
          +1 tools/hadoop tests 1m 12s Tests passed in hadoop-azure.
          +1 yarn tests 7m 3s Tests passed in hadoop-yarn-applications-distributedshell.
          +1 yarn tests 0m 43s Tests passed in hadoop-yarn-applications-unmanaged-am-launcher.
          +1 yarn tests 2m 2s Tests passed in hadoop-yarn-common.
          +1 yarn tests 1m 4s Tests passed in hadoop-yarn-registry.
          +1 yarn tests 0m 28s Tests passed in hadoop-yarn-server-common.
          +1 yarn tests 6m 9s Tests passed in hadoop-yarn-server-nodemanager.
          +1 yarn tests 52m 49s Tests passed in hadoop-yarn-server-resourcemanager.
          +1 yarn tests 2m 39s Tests passed in hadoop-yarn-server-tests.
          -1 hdfs tests 171m 5s Tests failed in hadoop-hdfs.
              403m 33s  



          Reason Tests
          Failed unit tests hadoop.mapred.TestJobName
            hadoop.mapred.TestMRIntermediateDataEncryption
            hadoop.hdfs.server.namenode.TestFileTruncate
            hadoop.hdfs.TestEncryptionZonesWithKMS
          Timed out tests org.apache.hadoop.mapred.TestMiniMRClasspath



          Subsystem Report/Notes
          Patch URL http://issues.apache.org/jira/secure/attachment/12730622/HADOOP-11922.patch
          Optional Tests javac unit
          git revision trunk / 9809a16
          hadoop-common test log https://builds.apache.org/job/PreCommit-HADOOP-Build/6493/artifact/patchprocess/testrun_hadoop-common.txt
          hadoop-nfs test log https://builds.apache.org/job/PreCommit-HADOOP-Build/6493/artifact/patchprocess/testrun_hadoop-nfs.txt
          hadoop-mapreduce-client-app test log https://builds.apache.org/job/PreCommit-HADOOP-Build/6493/artifact/patchprocess/testrun_hadoop-mapreduce-client-app.txt
          hadoop-mapreduce-client-common test log https://builds.apache.org/job/PreCommit-HADOOP-Build/6493/artifact/patchprocess/testrun_hadoop-mapreduce-client-common.txt
          hadoop-mapreduce-client-core test log https://builds.apache.org/job/PreCommit-HADOOP-Build/6493/artifact/patchprocess/testrun_hadoop-mapreduce-client-core.txt
          hadoop-mapreduce-client-hs test log https://builds.apache.org/job/PreCommit-HADOOP-Build/6493/artifact/patchprocess/testrun_hadoop-mapreduce-client-hs.txt
          hadoop-mapreduce-client-jobclient test log https://builds.apache.org/job/PreCommit-HADOOP-Build/6493/artifact/patchprocess/testrun_hadoop-mapreduce-client-jobclient.txt
          hadoop-mapreduce-client-nativetask test log https://builds.apache.org/job/PreCommit-HADOOP-Build/6493/artifact/patchprocess/testrun_hadoop-mapreduce-client-nativetask.txt
          hadoop-mapreduce-client-shuffle test log https://builds.apache.org/job/PreCommit-HADOOP-Build/6493/artifact/patchprocess/testrun_hadoop-mapreduce-client-shuffle.txt
          hadoop-aws test log https://builds.apache.org/job/PreCommit-HADOOP-Build/6493/artifact/patchprocess/testrun_hadoop-aws.txt
          hadoop-azure test log https://builds.apache.org/job/PreCommit-HADOOP-Build/6493/artifact/patchprocess/testrun_hadoop-azure.txt
          hadoop-yarn-applications-distributedshell test log https://builds.apache.org/job/PreCommit-HADOOP-Build/6493/artifact/patchprocess/testrun_hadoop-yarn-applications-distributedshell.txt
          hadoop-yarn-applications-unmanaged-am-launcher test log https://builds.apache.org/job/PreCommit-HADOOP-Build/6493/artifact/patchprocess/testrun_hadoop-yarn-applications-unmanaged-am-launcher.txt
          hadoop-yarn-common test log https://builds.apache.org/job/PreCommit-HADOOP-Build/6493/artifact/patchprocess/testrun_hadoop-yarn-common.txt
          hadoop-yarn-registry test log https://builds.apache.org/job/PreCommit-HADOOP-Build/6493/artifact/patchprocess/testrun_hadoop-yarn-registry.txt
          hadoop-yarn-server-common test log https://builds.apache.org/job/PreCommit-HADOOP-Build/6493/artifact/patchprocess/testrun_hadoop-yarn-server-common.txt
          hadoop-yarn-server-nodemanager test log https://builds.apache.org/job/PreCommit-HADOOP-Build/6493/artifact/patchprocess/testrun_hadoop-yarn-server-nodemanager.txt
          hadoop-yarn-server-resourcemanager test log https://builds.apache.org/job/PreCommit-HADOOP-Build/6493/artifact/patchprocess/testrun_hadoop-yarn-server-resourcemanager.txt
          hadoop-yarn-server-tests test log https://builds.apache.org/job/PreCommit-HADOOP-Build/6493/artifact/patchprocess/testrun_hadoop-yarn-server-tests.txt
          hadoop-hdfs test log https://builds.apache.org/job/PreCommit-HADOOP-Build/6493/artifact/patchprocess/testrun_hadoop-hdfs.txt
          Test Results https://builds.apache.org/job/PreCommit-HADOOP-Build/6493/testReport/
          Java 1.7.0_55
          uname Linux asf904.gq1.ygridcore.net 3.13.0-36-lowlatency #63-Ubuntu SMP PREEMPT Wed Sep 3 21:56:12 UTC 2014 x86_64 x86_64 x86_64 GNU/Linux
          Console output https://builds.apache.org/job/PreCommit-HADOOP-Build/6493/console

          This message was automatically generated.

          Show
          hadoopqa Hadoop QA added a comment - -1 overall Vote Subsystem Runtime Comment 0 pre-patch 5m 20s Pre-patch trunk compilation is healthy. +1 @author 0m 0s The patch does not contain any @author tags. +1 tests included 0m 0s The patch appears to include 20 new or modified test files. +1 javac 7m 38s There were no new javac warning messages. +1 release audit 0m 19s The applied patch does not increase the total number of release audit warnings. +1 whitespace 0m 0s The patch has no lines that end in whitespace. +1 install 1m 34s mvn install still works. +1 eclipse:eclipse 0m 31s The patch built with eclipse:eclipse. +1 common tests 23m 31s Tests passed in hadoop-common. +1 common tests 0m 22s Tests passed in hadoop-nfs. +1 mapreduce tests 9m 50s Tests passed in hadoop-mapreduce-client-app. +1 mapreduce tests 0m 46s Tests passed in hadoop-mapreduce-client-common. +1 mapreduce tests 1m 40s Tests passed in hadoop-mapreduce-client-core. +1 mapreduce tests 5m 44s Tests passed in hadoop-mapreduce-client-hs. -1 mapreduce tests 89m 48s Tests failed in hadoop-mapreduce-client-jobclient. +1 mapreduce tests 10m 32s Tests passed in hadoop-mapreduce-client-nativetask. +1 mapreduce tests 0m 23s Tests passed in hadoop-mapreduce-client-shuffle. +1 tools/hadoop tests 0m 18s Tests passed in hadoop-aws. +1 tools/hadoop tests 1m 12s Tests passed in hadoop-azure. +1 yarn tests 7m 3s Tests passed in hadoop-yarn-applications-distributedshell. +1 yarn tests 0m 43s Tests passed in hadoop-yarn-applications-unmanaged-am-launcher. +1 yarn tests 2m 2s Tests passed in hadoop-yarn-common. +1 yarn tests 1m 4s Tests passed in hadoop-yarn-registry. +1 yarn tests 0m 28s Tests passed in hadoop-yarn-server-common. +1 yarn tests 6m 9s Tests passed in hadoop-yarn-server-nodemanager. +1 yarn tests 52m 49s Tests passed in hadoop-yarn-server-resourcemanager. +1 yarn tests 2m 39s Tests passed in hadoop-yarn-server-tests. -1 hdfs tests 171m 5s Tests failed in hadoop-hdfs.     403m 33s   Reason Tests Failed unit tests hadoop.mapred.TestJobName   hadoop.mapred.TestMRIntermediateDataEncryption   hadoop.hdfs.server.namenode.TestFileTruncate   hadoop.hdfs.TestEncryptionZonesWithKMS Timed out tests org.apache.hadoop.mapred.TestMiniMRClasspath Subsystem Report/Notes Patch URL http://issues.apache.org/jira/secure/attachment/12730622/HADOOP-11922.patch Optional Tests javac unit git revision trunk / 9809a16 hadoop-common test log https://builds.apache.org/job/PreCommit-HADOOP-Build/6493/artifact/patchprocess/testrun_hadoop-common.txt hadoop-nfs test log https://builds.apache.org/job/PreCommit-HADOOP-Build/6493/artifact/patchprocess/testrun_hadoop-nfs.txt hadoop-mapreduce-client-app test log https://builds.apache.org/job/PreCommit-HADOOP-Build/6493/artifact/patchprocess/testrun_hadoop-mapreduce-client-app.txt hadoop-mapreduce-client-common test log https://builds.apache.org/job/PreCommit-HADOOP-Build/6493/artifact/patchprocess/testrun_hadoop-mapreduce-client-common.txt hadoop-mapreduce-client-core test log https://builds.apache.org/job/PreCommit-HADOOP-Build/6493/artifact/patchprocess/testrun_hadoop-mapreduce-client-core.txt hadoop-mapreduce-client-hs test log https://builds.apache.org/job/PreCommit-HADOOP-Build/6493/artifact/patchprocess/testrun_hadoop-mapreduce-client-hs.txt hadoop-mapreduce-client-jobclient test log https://builds.apache.org/job/PreCommit-HADOOP-Build/6493/artifact/patchprocess/testrun_hadoop-mapreduce-client-jobclient.txt hadoop-mapreduce-client-nativetask test log https://builds.apache.org/job/PreCommit-HADOOP-Build/6493/artifact/patchprocess/testrun_hadoop-mapreduce-client-nativetask.txt hadoop-mapreduce-client-shuffle test log https://builds.apache.org/job/PreCommit-HADOOP-Build/6493/artifact/patchprocess/testrun_hadoop-mapreduce-client-shuffle.txt hadoop-aws test log https://builds.apache.org/job/PreCommit-HADOOP-Build/6493/artifact/patchprocess/testrun_hadoop-aws.txt hadoop-azure test log https://builds.apache.org/job/PreCommit-HADOOP-Build/6493/artifact/patchprocess/testrun_hadoop-azure.txt hadoop-yarn-applications-distributedshell test log https://builds.apache.org/job/PreCommit-HADOOP-Build/6493/artifact/patchprocess/testrun_hadoop-yarn-applications-distributedshell.txt hadoop-yarn-applications-unmanaged-am-launcher test log https://builds.apache.org/job/PreCommit-HADOOP-Build/6493/artifact/patchprocess/testrun_hadoop-yarn-applications-unmanaged-am-launcher.txt hadoop-yarn-common test log https://builds.apache.org/job/PreCommit-HADOOP-Build/6493/artifact/patchprocess/testrun_hadoop-yarn-common.txt hadoop-yarn-registry test log https://builds.apache.org/job/PreCommit-HADOOP-Build/6493/artifact/patchprocess/testrun_hadoop-yarn-registry.txt hadoop-yarn-server-common test log https://builds.apache.org/job/PreCommit-HADOOP-Build/6493/artifact/patchprocess/testrun_hadoop-yarn-server-common.txt hadoop-yarn-server-nodemanager test log https://builds.apache.org/job/PreCommit-HADOOP-Build/6493/artifact/patchprocess/testrun_hadoop-yarn-server-nodemanager.txt hadoop-yarn-server-resourcemanager test log https://builds.apache.org/job/PreCommit-HADOOP-Build/6493/artifact/patchprocess/testrun_hadoop-yarn-server-resourcemanager.txt hadoop-yarn-server-tests test log https://builds.apache.org/job/PreCommit-HADOOP-Build/6493/artifact/patchprocess/testrun_hadoop-yarn-server-tests.txt hadoop-hdfs test log https://builds.apache.org/job/PreCommit-HADOOP-Build/6493/artifact/patchprocess/testrun_hadoop-hdfs.txt Test Results https://builds.apache.org/job/PreCommit-HADOOP-Build/6493/testReport/ Java 1.7.0_55 uname Linux asf904.gq1.ygridcore.net 3.13.0-36-lowlatency #63-Ubuntu SMP PREEMPT Wed Sep 3 21:56:12 UTC 2014 x86_64 x86_64 x86_64 GNU/Linux Console output https://builds.apache.org/job/PreCommit-HADOOP-Build/6493/console This message was automatically generated.
          Hide
          brahmareddy Brahma Reddy Battula added a comment -

          Gabor Liptak thanks for picking up this jira..As parent jira ( HADOOP-10387) brokeup into project level,you need to give patch to only hadoop-nfs project.

          Show
          brahmareddy Brahma Reddy Battula added a comment - Gabor Liptak thanks for picking up this jira..As parent jira ( HADOOP-10387 ) brokeup into project level,you need to give patch to only hadoop-nfs project.
          Hide
          brahmareddy Brahma Reddy Battula added a comment -

          Gabor Liptak, you can give patch for hadoop-aws and hadoop-azure projects..

          Show
          brahmareddy Brahma Reddy Battula added a comment - Gabor Liptak , you can give patch for hadoop-aws and hadoop-azure projects..
          Hide
          gliptak Gabor Liptak added a comment -

          Uploaded separate patches.

          Show
          gliptak Gabor Liptak added a comment - Uploaded separate patches.
          Hide
          hadoopqa Hadoop QA added a comment -



          -1 overall



          Vote Subsystem Runtime Comment
          -1 patch 0m 0s The patch command could not apply the patch during dryrun.



          Subsystem Report/Notes
          Patch URL http://issues.apache.org/jira/secure/attachment/12731278/HADOOP-11922.hadoop-nfs.patch
          Optional Tests javac unit
          git revision trunk / b88700d
          Console output https://builds.apache.org/job/PreCommit-HADOOP-Build/6525/console

          This message was automatically generated.

          Show
          hadoopqa Hadoop QA added a comment - -1 overall Vote Subsystem Runtime Comment -1 patch 0m 0s The patch command could not apply the patch during dryrun. Subsystem Report/Notes Patch URL http://issues.apache.org/jira/secure/attachment/12731278/HADOOP-11922.hadoop-nfs.patch Optional Tests javac unit git revision trunk / b88700d Console output https://builds.apache.org/job/PreCommit-HADOOP-Build/6525/console This message was automatically generated.
          Hide
          ajisakaa Akira Ajisaka added a comment -

          As hadoop-nfs was fixed by HADOOP-10387, we need only hadoop-azure and hadoop-aws. Combined these two patches and attaching it.

          Show
          ajisakaa Akira Ajisaka added a comment - As hadoop-nfs was fixed by HADOOP-10387 , we need only hadoop-azure and hadoop-aws. Combined these two patches and attaching it.
          Hide
          ajisakaa Akira Ajisaka added a comment -

          +1 pending Jenkins.

          Show
          ajisakaa Akira Ajisaka added a comment - +1 pending Jenkins.
          Hide
          vinayrpet Vinayakumar B added a comment -

          Jenkins passed this test. It was unable to put comment back to Jira.

          https://builds.apache.org/job/PreCommit-HADOOP-Build/6529/console

          Committing soon

          Show
          vinayrpet Vinayakumar B added a comment - Jenkins passed this test. It was unable to put comment back to Jira. https://builds.apache.org/job/PreCommit-HADOOP-Build/6529/console Committing soon
          Hide
          vinayrpet Vinayakumar B added a comment -

          Committed to trunk and branch-2.
          Thanks Gabor Liptak, Brahma Reddy Battula and Akira Ajisaka

          Show
          vinayrpet Vinayakumar B added a comment - Committed to trunk and branch-2. Thanks Gabor Liptak , Brahma Reddy Battula and Akira Ajisaka
          Hide
          hudson Hudson added a comment -

          FAILURE: Integrated in Hadoop-trunk-Commit #7767 (See https://builds.apache.org/job/Hadoop-trunk-Commit/7767/)
          HADOOP-11922. Misspelling of threshold in log4j.properties for tests in hadoop-tools (Contributed by Gabor Liptak) (vinayakumarb: rev f33efbc82709e75d9b4c4ed9835629668dbade7d)

          • hadoop-tools/hadoop-azure/src/test/resources/log4j.properties
          • hadoop-tools/hadoop-aws/src/test/resources/log4j.properties
          • hadoop-common-project/hadoop-common/CHANGES.txt
          Show
          hudson Hudson added a comment - FAILURE: Integrated in Hadoop-trunk-Commit #7767 (See https://builds.apache.org/job/Hadoop-trunk-Commit/7767/ ) HADOOP-11922 . Misspelling of threshold in log4j.properties for tests in hadoop-tools (Contributed by Gabor Liptak) (vinayakumarb: rev f33efbc82709e75d9b4c4ed9835629668dbade7d) hadoop-tools/hadoop-azure/src/test/resources/log4j.properties hadoop-tools/hadoop-aws/src/test/resources/log4j.properties hadoop-common-project/hadoop-common/CHANGES.txt
          Hide
          hudson Hudson added a comment -

          SUCCESS: Integrated in Hadoop-Yarn-trunk #921 (See https://builds.apache.org/job/Hadoop-Yarn-trunk/921/)
          HADOOP-11922. Misspelling of threshold in log4j.properties for tests in hadoop-tools (Contributed by Gabor Liptak) (vinayakumarb: rev f33efbc82709e75d9b4c4ed9835629668dbade7d)

          • hadoop-tools/hadoop-azure/src/test/resources/log4j.properties
          • hadoop-common-project/hadoop-common/CHANGES.txt
          • hadoop-tools/hadoop-aws/src/test/resources/log4j.properties
          Show
          hudson Hudson added a comment - SUCCESS: Integrated in Hadoop-Yarn-trunk #921 (See https://builds.apache.org/job/Hadoop-Yarn-trunk/921/ ) HADOOP-11922 . Misspelling of threshold in log4j.properties for tests in hadoop-tools (Contributed by Gabor Liptak) (vinayakumarb: rev f33efbc82709e75d9b4c4ed9835629668dbade7d) hadoop-tools/hadoop-azure/src/test/resources/log4j.properties hadoop-common-project/hadoop-common/CHANGES.txt hadoop-tools/hadoop-aws/src/test/resources/log4j.properties
          Hide
          hudson Hudson added a comment -

          SUCCESS: Integrated in Hadoop-Yarn-trunk-Java8 #190 (See https://builds.apache.org/job/Hadoop-Yarn-trunk-Java8/190/)
          HADOOP-11922. Misspelling of threshold in log4j.properties for tests in hadoop-tools (Contributed by Gabor Liptak) (vinayakumarb: rev f33efbc82709e75d9b4c4ed9835629668dbade7d)

          • hadoop-common-project/hadoop-common/CHANGES.txt
          • hadoop-tools/hadoop-aws/src/test/resources/log4j.properties
          • hadoop-tools/hadoop-azure/src/test/resources/log4j.properties
          Show
          hudson Hudson added a comment - SUCCESS: Integrated in Hadoop-Yarn-trunk-Java8 #190 (See https://builds.apache.org/job/Hadoop-Yarn-trunk-Java8/190/ ) HADOOP-11922 . Misspelling of threshold in log4j.properties for tests in hadoop-tools (Contributed by Gabor Liptak) (vinayakumarb: rev f33efbc82709e75d9b4c4ed9835629668dbade7d) hadoop-common-project/hadoop-common/CHANGES.txt hadoop-tools/hadoop-aws/src/test/resources/log4j.properties hadoop-tools/hadoop-azure/src/test/resources/log4j.properties
          Hide
          hudson Hudson added a comment -

          FAILURE: Integrated in Hadoop-Hdfs-trunk #2119 (See https://builds.apache.org/job/Hadoop-Hdfs-trunk/2119/)
          HADOOP-11922. Misspelling of threshold in log4j.properties for tests in hadoop-tools (Contributed by Gabor Liptak) (vinayakumarb: rev f33efbc82709e75d9b4c4ed9835629668dbade7d)

          • hadoop-tools/hadoop-azure/src/test/resources/log4j.properties
          • hadoop-tools/hadoop-aws/src/test/resources/log4j.properties
          • hadoop-common-project/hadoop-common/CHANGES.txt
          Show
          hudson Hudson added a comment - FAILURE: Integrated in Hadoop-Hdfs-trunk #2119 (See https://builds.apache.org/job/Hadoop-Hdfs-trunk/2119/ ) HADOOP-11922 . Misspelling of threshold in log4j.properties for tests in hadoop-tools (Contributed by Gabor Liptak) (vinayakumarb: rev f33efbc82709e75d9b4c4ed9835629668dbade7d) hadoop-tools/hadoop-azure/src/test/resources/log4j.properties hadoop-tools/hadoop-aws/src/test/resources/log4j.properties hadoop-common-project/hadoop-common/CHANGES.txt
          Hide
          hudson Hudson added a comment -

          FAILURE: Integrated in Hadoop-Hdfs-trunk-Java8 #179 (See https://builds.apache.org/job/Hadoop-Hdfs-trunk-Java8/179/)
          HADOOP-11922. Misspelling of threshold in log4j.properties for tests in hadoop-tools (Contributed by Gabor Liptak) (vinayakumarb: rev f33efbc82709e75d9b4c4ed9835629668dbade7d)

          • hadoop-tools/hadoop-aws/src/test/resources/log4j.properties
          • hadoop-tools/hadoop-azure/src/test/resources/log4j.properties
          • hadoop-common-project/hadoop-common/CHANGES.txt
          Show
          hudson Hudson added a comment - FAILURE: Integrated in Hadoop-Hdfs-trunk-Java8 #179 (See https://builds.apache.org/job/Hadoop-Hdfs-trunk-Java8/179/ ) HADOOP-11922 . Misspelling of threshold in log4j.properties for tests in hadoop-tools (Contributed by Gabor Liptak) (vinayakumarb: rev f33efbc82709e75d9b4c4ed9835629668dbade7d) hadoop-tools/hadoop-aws/src/test/resources/log4j.properties hadoop-tools/hadoop-azure/src/test/resources/log4j.properties hadoop-common-project/hadoop-common/CHANGES.txt
          Hide
          hudson Hudson added a comment -

          FAILURE: Integrated in Hadoop-Mapreduce-trunk #2137 (See https://builds.apache.org/job/Hadoop-Mapreduce-trunk/2137/)
          HADOOP-11922. Misspelling of threshold in log4j.properties for tests in hadoop-tools (Contributed by Gabor Liptak) (vinayakumarb: rev f33efbc82709e75d9b4c4ed9835629668dbade7d)

          • hadoop-common-project/hadoop-common/CHANGES.txt
          • hadoop-tools/hadoop-azure/src/test/resources/log4j.properties
          • hadoop-tools/hadoop-aws/src/test/resources/log4j.properties
          Show
          hudson Hudson added a comment - FAILURE: Integrated in Hadoop-Mapreduce-trunk #2137 (See https://builds.apache.org/job/Hadoop-Mapreduce-trunk/2137/ ) HADOOP-11922 . Misspelling of threshold in log4j.properties for tests in hadoop-tools (Contributed by Gabor Liptak) (vinayakumarb: rev f33efbc82709e75d9b4c4ed9835629668dbade7d) hadoop-common-project/hadoop-common/CHANGES.txt hadoop-tools/hadoop-azure/src/test/resources/log4j.properties hadoop-tools/hadoop-aws/src/test/resources/log4j.properties
          Hide
          hudson Hudson added a comment -

          SUCCESS: Integrated in Hadoop-Mapreduce-trunk-Java8 #189 (See https://builds.apache.org/job/Hadoop-Mapreduce-trunk-Java8/189/)
          HADOOP-11922. Misspelling of threshold in log4j.properties for tests in hadoop-tools (Contributed by Gabor Liptak) (vinayakumarb: rev f33efbc82709e75d9b4c4ed9835629668dbade7d)

          • hadoop-common-project/hadoop-common/CHANGES.txt
          • hadoop-tools/hadoop-aws/src/test/resources/log4j.properties
          • hadoop-tools/hadoop-azure/src/test/resources/log4j.properties
          Show
          hudson Hudson added a comment - SUCCESS: Integrated in Hadoop-Mapreduce-trunk-Java8 #189 (See https://builds.apache.org/job/Hadoop-Mapreduce-trunk-Java8/189/ ) HADOOP-11922 . Misspelling of threshold in log4j.properties for tests in hadoop-tools (Contributed by Gabor Liptak) (vinayakumarb: rev f33efbc82709e75d9b4c4ed9835629668dbade7d) hadoop-common-project/hadoop-common/CHANGES.txt hadoop-tools/hadoop-aws/src/test/resources/log4j.properties hadoop-tools/hadoop-azure/src/test/resources/log4j.properties

            People

            • Assignee:
              gliptak Gabor Liptak
              Reporter:
              brahmareddy Brahma Reddy Battula
            • Votes:
              0 Vote for this issue
              Watchers:
              5 Start watching this issue

              Dates

              • Created:
                Updated:
                Resolved:

                Development