Uploaded image for project: 'ZooKeeper'
  1. ZooKeeper
  2. ZOOKEEPER-4308

Flaky test: EagerACLFilterTest.testSetDataFail

    XMLWordPrintableJSON

Details

    Description

      URL:https://github.com/apache/zookeeper/pull/1425/checks?check_run_id=2702959273

      [INFO] 
      947[ERROR] Failures: 
      948[ERROR]   EagerACLFilterTest.testSetDataFail:222->assertTransactionState:115 Server State: OBSERVING Check Enabled: true Transaction state on Leader after failed setData ==> expected: <4294967298> but was: <4294967299>
      949[INFO] 
      950[ERROR] Tests run: 2913, Failures: 1, Errors: 0, Skipped: 4
      951[INFO] 

      Attachments

        Issue Links

          Activity

            People

              kezhuw Kezhu Wang
              maoling Ling Mao
              Votes:
              0 Vote for this issue
              Watchers:
              4 Start watching this issue

              Dates

                Created:
                Updated:
                Resolved:

                Time Tracking

                  Estimated:
                  Original Estimate - Not Specified
                  Not Specified
                  Remaining:
                  Remaining Estimate - 0h
                  0h
                  Logged:
                  Time Spent - 1h 20m
                  1h 20m