Uploaded image for project: 'Zeppelin'
  1. Zeppelin
  2. ZEPPELIN-5652

Unable to build Zeppelin on ppc64le

Attach filesAttach ScreenshotAdd voteVotersWatch issueWatchersCreate sub-taskLinkCloneUpdate Comment AuthorReplace String in CommentUpdate Comment VisibilityDelete Comments
    XMLWordPrintableJSON

Details

    • Bug
    • Status: Open
    • Major
    • Resolution: Unresolved
    • 0.11.0
    • None
    • build
    • None
    • Debian 11 (Bullseye) ppc64le

      Apache Maven 3.6.3

      OpenJDK 11 (11.0.14)

    Description

      Trying to build Apache Zeppelin with 

      mvn clean package -DskipTests -e

      I am getting the following errors:

      [INFO] Compiling 6 source files to /path/abc/zeppelin/zeppelin-display/target/classes at 1644957684498
      [ERROR] error: error while loading package, Missing dependency 'object java.lang.Object in compiler mirror', required by /path/abc/.m2/repository/org/scala-lang/scala-library/2.10.5/scala-library-2.10.5.jar(scala/package.class)
      [ERROR] error: error while loading package, Missing dependency 'object java.lang.Object in compiler mirror', required by /path/abc/.m2/repository/org/scala-lang/scala-library/2.10.5/scala-library-2.10.5.jar(scala/runtime/package.class)
      [ERROR] error: scala.reflect.internal.MissingRequirementError: object java.lang.Object in compiler mirror not found.
      [ERROR]     at scala.reflect.internal.MissingRequirementError$.signal(MissingRequirementError.scala:16)
      [ERROR]     at scala.reflect.internal.MissingRequirementError$.notFound(MissingRequirementError.scala:17)
      [INFO]     at scala.reflect.internal.Mirrors$RootsBase.getModuleOrClass(Mirrors.scala:48)
      [INFO]     at scala.reflect.internal.Mirrors$RootsBase.getModuleOrClass(Mirrors.scala:40)
      [INFO]     at scala.reflect.internal.Mirrors$RootsBase.getModuleOrClass(Mirrors.scala:40)
      [INFO]     at scala.reflect.internal.Mirrors$RootsBase.getModuleOrClass(Mirrors.scala:61)
      [INFO]     at scala.reflect.internal.Mirrors$RootsBase.getClassByName(Mirrors.scala:99)
      [INFO]     at scala.reflect.internal.Mirrors$RootsBase.getRequiredClass(Mirrors.scala:102)
      [INFO]     at scala.reflect.internal.Definitions$DefinitionsClass.ObjectClass$lzycompute(Definitions.scala:264)
      [INFO]     at scala.reflect.internal.Definitions$DefinitionsClass.ObjectClass(Definitions.scala:264)
      [INFO]     at scala.reflect.internal.Definitions$DefinitionsClass.AnyRefClass$lzycompute(Definitions.scala:263)
      [INFO]     at scala.reflect.internal.Definitions$DefinitionsClass.AnyRefClass(Definitions.scala:263)
      [INFO]     at scala.reflect.internal.Definitions$DefinitionsClass.specialPolyClass(Definitions.scala:1120)
      [INFO]     at scala.reflect.internal.Definitions$DefinitionsClass.RepeatedParamClass$lzycompute(Definitions.scala:407)
      [INFO]     at scala.reflect.internal.Definitions$DefinitionsClass.RepeatedParamClass(Definitions.scala:407)
      [INFO]     at scala.reflect.internal.Definitions$DefinitionsClass.syntheticCoreClasses$lzycompute(Definitions.scala:1154)
      [INFO]     at scala.reflect.internal.Definitions$DefinitionsClass.syntheticCoreClasses(Definitions.scala:1152)
      [INFO]     at scala.reflect.internal.Definitions$DefinitionsClass.symbolsNotPresentInBytecode$lzycompute(Definitions.scala:1196)
      [INFO]     at scala.reflect.internal.Definitions$DefinitionsClass.symbolsNotPresentInBytecode(Definitions.scala:1196)
      [INFO]     at scala.reflect.internal.Definitions$DefinitionsClass.init(Definitions.scala:1261)
      [INFO]     at scala.tools.nsc.Global$Run.<init>(Global.scala:1290)
      [INFO]     at scala.tools.nsc.Driver.doCompile(Driver.scala:32)
      [INFO]     at scala.tools.nsc.Main$.doCompile(Main.scala:79)
      [INFO]     at scala.tools.nsc.Driver.process(Driver.scala:54)
      [INFO]     at scala.tools.nsc.Driver.main(Driver.scala:67)
      [INFO]     at scala.tools.nsc.Main.main(Main.scala)
      [INFO]     at java.base/jdk.internal.reflect.NativeMethodAccessorImpl.invoke0(Native Method)
      [INFO]     at java.base/jdk.internal.reflect.NativeMethodAccessorImpl.invoke(NativeMethodAccessorImpl.java:62)
      [INFO]     at java.base/jdk.internal.reflect.DelegatingMethodAccessorImpl.invoke(DelegatingMethodAccessorImpl.java:43)
      [INFO]     at java.base/java.lang.reflect.Method.invoke(Method.java:566)
      [INFO]     at org_scala_tools_maven_executions.MainHelper.runMain(MainHelper.java:161)
      [INFO]     at org_scala_tools_maven_executions.MainWithArgsInFile.main(MainWithArgsInFile.java:26)
      [INFO] 
      [INFO] ------------------------------------------------------------------------
      [INFO] Reactor Summary for Zeppelin 0.11.0-SNAPSHOT:
      [INFO] 
      [INFO] Zeppelin ........................................... SUCCESS [  4.027 s]
      [INFO] Zeppelin: Common ................................... SUCCESS [  2.648 s]
      [INFO] Zeppelin: Interpreter .............................. SUCCESS [ 13.025 s]
      [INFO] Zeppelin: Interpreter Shaded ....................... SUCCESS [ 53.718 s]
      [INFO] Zeppelin: Interpreter Parent ....................... SUCCESS [  1.643 s]
      [INFO] Zeppelin: Jupyter Support .......................... SUCCESS [  2.045 s]
      [INFO] Zeppelin: Zengine .................................. SUCCESS [  8.156 s]
      [INFO] Zeppelin: Display system apis ...................... FAILURE [  2.621 s]
      [INFO] Zeppelin: Jupyter Interpreter ...................... SKIPPED
      [INFO] Zeppelin: Jupyter Interpreter Shaded ............... SKIPPED
      [INFO] Zeppelin: R ........................................ SKIPPED
      [INFO] Zeppelin: Kotlin interpreter ....................... SKIPPED
      [INFO] Zeppelin: Groovy interpreter ....................... SKIPPED
      [INFO] Zeppelin: Spark Parent ............................. SKIPPED
      [INFO] Zeppelin: Spark Shims .............................. SKIPPED
      [INFO] Zeppelin: Spark2 Shims ............................. SKIPPED
      [INFO] Zeppelin: Spark3 Shims ............................. SKIPPED
      [INFO] Zeppelin: Python interpreter ....................... SKIPPED
      [INFO] Zeppelin: Spark Interpreter ........................ SKIPPED
      [INFO] Zeppelin: Spark Scala Parent ....................... SKIPPED
      [INFO] Zeppelin: Spark Interpreter Scala_2.11 ............. SKIPPED
      [INFO] Zeppelin: Spark Interpreter Scala_2.12 ............. SKIPPED
      [INFO] Zeppelin: Spark dependencies ....................... SKIPPED
      [INFO] Zeppelin: Shell interpreter ........................ SKIPPED
      [INFO] Zeppelin: Spark-Submit interpreter ................. SKIPPED
      [INFO] Zeppelin: Submarine interpreter .................... SKIPPED
      [INFO] Zeppelin: Markdown interpreter ..................... SKIPPED
      [INFO] Zeppelin: MongoDB interpreter ...................... SKIPPED
      [INFO] Zeppelin: Angular interpreter ...................... SKIPPED
      [INFO] Zeppelin: Livy interpreter ......................... SKIPPED
      [INFO] Zeppelin: HBase interpreter ........................ SKIPPED
      [INFO] Zeppelin: Apache Pig Interpreter ................... SKIPPED
      [INFO] Zeppelin: JDBC interpreter ......................... SKIPPED
      [INFO] Zeppelin: File System Interpreters ................. SKIPPED
      [INFO] Zeppelin: Flink Parent ............................. SKIPPED
      [INFO] Zeppelin: Flink Shims .............................. SKIPPED
      [INFO] Zeppelin: Flink1.12 Shims .......................... SKIPPED
      [INFO] Zeppelin: Flink1.13 Shims .......................... SKIPPED
      [INFO] Zeppelin: Flink1.14 Shims .......................... SKIPPED
      [INFO] Zeppelin: Flink Scala Parent ....................... SKIPPED
      [INFO] Zeppelin: Flink Interpreter Scala_2.11 ............. SKIPPED
      [INFO] Zeppelin: Flink Interpreter Scala_2.12 ............. SKIPPED
      [INFO] Zeppelin: Flink-Cmd interpreter .................... SKIPPED
      [INFO] Zeppelin: Apache Ignite interpreter ................ SKIPPED
      [INFO] Zeppelin: InfluxDB interpreter ..................... SKIPPED
      [INFO] Zeppelin: Kylin interpreter ........................ SKIPPED
      [INFO] Zeppelin: Apache Cassandra interpreter ............. SKIPPED
      [INFO] Zeppelin: Elasticsearch interpreter ................ SKIPPED
      [INFO] Zeppelin: BigQuery interpreter ..................... SKIPPED
      [INFO] Zeppelin: Alluxio interpreter ...................... SKIPPED
      [INFO] Zeppelin: Scio ..................................... SKIPPED
      [INFO] Zeppelin: Neo4j interpreter ........................ SKIPPED
      [INFO] Zeppelin: Sap ...................................... SKIPPED
      [INFO] Zeppelin: Scalding interpreter ..................... SKIPPED
      [INFO] Zeppelin: Java interpreter ......................... SKIPPED
      [INFO] Zeppelin: Beam interpreter ......................... SKIPPED
      [INFO] Zeppelin: Hazelcast Jet interpreter ................ SKIPPED
      [INFO] Zeppelin: Apache Geode interpreter ................. SKIPPED
      [INFO] Zeppelin: Kafka SQL interpreter .................... SKIPPED
      [INFO] Zeppelin: Sparql interpreter ....................... SKIPPED
      [INFO] Zeppelin: Client ................................... SKIPPED
      [INFO] Zeppelin: Client Examples .......................... SKIPPED
      [INFO] Zeppelin: web Application .......................... SKIPPED
      [INFO] Zeppelin: Server ................................... SKIPPED
      [INFO] Zeppelin: Plugins Parent ........................... SKIPPED
      [INFO] Zeppelin: Plugin S3NotebookRepo .................... SKIPPED
      [INFO] Zeppelin: Plugin GitHubNotebookRepo ................ SKIPPED
      [INFO] Zeppelin: Plugin AzureNotebookRepo ................. SKIPPED
      [INFO] Zeppelin: Plugin GCSNotebookRepo ................... SKIPPED
      [INFO] Zeppelin: Plugin FileSystemNotebookRepo ............ SKIPPED
      [INFO] Zeppelin: Plugin MongoNotebookRepo ................. SKIPPED
      [INFO] Zeppelin: Plugin OSSNotebookRepo ................... SKIPPED
      [INFO] Zeppelin: Plugin Kubernetes StandardLauncher ....... SKIPPED
      [INFO] Zeppelin: Plugin Flink Launcher .................... SKIPPED
      [INFO] Zeppelin: Plugin Docker Launcher ................... SKIPPED
      [INFO] Zeppelin: Plugin Cluster Launcher .................. SKIPPED
      [INFO] Zeppelin: Plugin Yarn Launcher ..................... SKIPPED
      [INFO] Zeppelin: Packaging distribution ................... SKIPPED
      [INFO] ------------------------------------------------------------------------
      [INFO] BUILD FAILURE
      [INFO] ------------------------------------------------------------------------
      [INFO] Total time:  01:28 min
      [INFO] Finished at: 2022-02-15T21:41:25+01:00
      [INFO] ------------------------------------------------------------------------
      [ERROR] Failed to execute goal org.scala-tools:maven-scala-plugin:2.15.2:compile (default) on project zeppelin-display: wrap: org.apache.commons.exec.ExecuteException: Process exited with an error: 1(Exit value: 1) -> [Help 1]
      org.apache.maven.lifecycle.LifecycleExecutionException: Failed to execute goal org.scala-tools:maven-scala-plugin:2.15.2:compile (default) on project zeppelin-display: wrap: org.apache.commons.exec.ExecuteException: Process exited with an error: 1(Exit value: 1)
          at org.apache.maven.lifecycle.internal.MojoExecutor.execute (MojoExecutor.java:215)
          at org.apache.maven.lifecycle.internal.MojoExecutor.execute (MojoExecutor.java:156)
          at org.apache.maven.lifecycle.internal.MojoExecutor.execute (MojoExecutor.java:148)
          at org.apache.maven.lifecycle.internal.LifecycleModuleBuilder.buildProject (LifecycleModuleBuilder.java:117)
          at org.apache.maven.lifecycle.internal.LifecycleModuleBuilder.buildProject (LifecycleModuleBuilder.java:81)
          at org.apache.maven.lifecycle.internal.builder.singlethreaded.SingleThreadedBuilder.build (SingleThreadedBuilder.java:56)
          at org.apache.maven.lifecycle.internal.LifecycleStarter.execute (LifecycleStarter.java:128)
          at org.apache.maven.DefaultMaven.doExecute (DefaultMaven.java:305)
          at org.apache.maven.DefaultMaven.doExecute (DefaultMaven.java:192)
          at org.apache.maven.DefaultMaven.execute (DefaultMaven.java:105)
          at org.apache.maven.cli.MavenCli.execute (MavenCli.java:957)
          at org.apache.maven.cli.MavenCli.doMain (MavenCli.java:289)
          at org.apache.maven.cli.MavenCli.main (MavenCli.java:193)
          at jdk.internal.reflect.NativeMethodAccessorImpl.invoke0 (Native Method)
          at jdk.internal.reflect.NativeMethodAccessorImpl.invoke (NativeMethodAccessorImpl.java:62)
          at jdk.internal.reflect.DelegatingMethodAccessorImpl.invoke (DelegatingMethodAccessorImpl.java:43)
          at java.lang.reflect.Method.invoke (Method.java:566)
          at org.codehaus.plexus.classworlds.launcher.Launcher.launchEnhanced (Launcher.java:282)
          at org.codehaus.plexus.classworlds.launcher.Launcher.launch (Launcher.java:225)
          at org.codehaus.plexus.classworlds.launcher.Launcher.mainWithExitCode (Launcher.java:406)
          at org.codehaus.plexus.classworlds.launcher.Launcher.main (Launcher.java:347)
      Caused by: org.apache.maven.plugin.MojoExecutionException: wrap: org.apache.commons.exec.ExecuteException: Process exited with an error: 1(Exit value: 1)
          at org_scala_tools_maven.ScalaMojoSupport.execute (ScalaMojoSupport.java:350)
          at org.apache.maven.plugin.DefaultBuildPluginManager.executeMojo (DefaultBuildPluginManager.java:137)
          at org.apache.maven.lifecycle.internal.MojoExecutor.execute (MojoExecutor.java:210)
          at org.apache.maven.lifecycle.internal.MojoExecutor.execute (MojoExecutor.java:156)
          at org.apache.maven.lifecycle.internal.MojoExecutor.execute (MojoExecutor.java:148)
          at org.apache.maven.lifecycle.internal.LifecycleModuleBuilder.buildProject (LifecycleModuleBuilder.java:117)
          at org.apache.maven.lifecycle.internal.LifecycleModuleBuilder.buildProject (LifecycleModuleBuilder.java:81)
          at org.apache.maven.lifecycle.internal.builder.singlethreaded.SingleThreadedBuilder.build (SingleThreadedBuilder.java:56)
          at org.apache.maven.lifecycle.internal.LifecycleStarter.execute (LifecycleStarter.java:128)
          at org.apache.maven.DefaultMaven.doExecute (DefaultMaven.java:305)
          at org.apache.maven.DefaultMaven.doExecute (DefaultMaven.java:192)
          at org.apache.maven.DefaultMaven.execute (DefaultMaven.java:105)
          at org.apache.maven.cli.MavenCli.execute (MavenCli.java:957)
          at org.apache.maven.cli.MavenCli.doMain (MavenCli.java:289)
          at org.apache.maven.cli.MavenCli.main (MavenCli.java:193)
          at jdk.internal.reflect.NativeMethodAccessorImpl.invoke0 (Native Method)
          at jdk.internal.reflect.NativeMethodAccessorImpl.invoke (NativeMethodAccessorImpl.java:62)
          at jdk.internal.reflect.DelegatingMethodAccessorImpl.invoke (DelegatingMethodAccessorImpl.java:43)
          at java.lang.reflect.Method.invoke (Method.java:566)
          at org.codehaus.plexus.classworlds.launcher.Launcher.launchEnhanced (Launcher.java:282)
          at org.codehaus.plexus.classworlds.launcher.Launcher.launch (Launcher.java:225)
          at org.codehaus.plexus.classworlds.launcher.Launcher.mainWithExitCode (Launcher.java:406)
          at org.codehaus.plexus.classworlds.launcher.Launcher.main (Launcher.java:347)
      Caused by: org.apache.commons.exec.ExecuteException: Process exited with an error: 1(Exit value: 1)
          at org.apache.commons.exec.DefaultExecutor.executeInternal (DefaultExecutor.java:346)
          at org.apache.commons.exec.DefaultExecutor.execute (DefaultExecutor.java:149)
          at org.apache.commons.exec.DefaultExecutor.execute (DefaultExecutor.java:136)
          at org_scala_tools_maven_executions.JavaMainCallerByFork.run (JavaMainCallerByFork.java:80)
          at org_scala_tools_maven.ScalaCompilerSupport.compile (ScalaCompilerSupport.java:124)
          at org_scala_tools_maven.ScalaCompilerSupport.doExecute (ScalaCompilerSupport.java:80)
          at org_scala_tools_maven.ScalaMojoSupport.execute (ScalaMojoSupport.java:342)
          at org.apache.maven.plugin.DefaultBuildPluginManager.executeMojo (DefaultBuildPluginManager.java:137)
          at org.apache.maven.lifecycle.internal.MojoExecutor.execute (MojoExecutor.java:210)
          at org.apache.maven.lifecycle.internal.MojoExecutor.execute (MojoExecutor.java:156)
          at org.apache.maven.lifecycle.internal.MojoExecutor.execute (MojoExecutor.java:148)
          at org.apache.maven.lifecycle.internal.LifecycleModuleBuilder.buildProject (LifecycleModuleBuilder.java:117)
          at org.apache.maven.lifecycle.internal.LifecycleModuleBuilder.buildProject (LifecycleModuleBuilder.java:81)
          at org.apache.maven.lifecycle.internal.builder.singlethreaded.SingleThreadedBuilder.build (SingleThreadedBuilder.java:56)
          at org.apache.maven.lifecycle.internal.LifecycleStarter.execute (LifecycleStarter.java:128)
          at org.apache.maven.DefaultMaven.doExecute (DefaultMaven.java:305)
          at org.apache.maven.DefaultMaven.doExecute (DefaultMaven.java:192)
          at org.apache.maven.DefaultMaven.execute (DefaultMaven.java:105)
          at org.apache.maven.cli.MavenCli.execute (MavenCli.java:957)
          at org.apache.maven.cli.MavenCli.doMain (MavenCli.java:289)
          at org.apache.maven.cli.MavenCli.main (MavenCli.java:193)
          at jdk.internal.reflect.NativeMethodAccessorImpl.invoke0 (Native Method)
          at jdk.internal.reflect.NativeMethodAccessorImpl.invoke (NativeMethodAccessorImpl.java:62)
          at jdk.internal.reflect.DelegatingMethodAccessorImpl.invoke (DelegatingMethodAccessorImpl.java:43)
          at java.lang.reflect.Method.invoke (Method.java:566)
          at org.codehaus.plexus.classworlds.launcher.Launcher.launchEnhanced (Launcher.java:282)
          at org.codehaus.plexus.classworlds.launcher.Launcher.launch (Launcher.java:225)
          at org.codehaus.plexus.classworlds.launcher.Launcher.mainWithExitCode (Launcher.java:406)
          at org.codehaus.plexus.classworlds.launcher.Launcher.main (Launcher.java:347)
      [ERROR] 
      [ERROR] Re-run Maven using the -X switch to enable full debug logging.
      [ERROR] 
      [ERROR] For more information about the errors and possible solutions, please read the following articles:
      [ERROR] [Help 1] http://cwiki.apache.org/confluence/display/MAVEN/MojoExecutionException
      [ERROR] 
      [ERROR] After correcting the problems, you can resume the build with the command
      [ERROR]   mvn <args> -rf :zeppelin-display

      {}Am I missing some dependencies? How can I further debug this error?

       

      Attachments

        Activity

          This comment will be Viewable by All Users Viewable by All Users
          Cancel

          People

            Unassigned Unassigned
            makino makino

            Dates

              Created:
              Updated:

              Slack

                Issue deployment