XMLWordPrintableJSON

    Details

      Description

      CI fails on test failure https://s3.amazonaws.com/archive.travis-ci.org/jobs/98064341/log.txt

      Failed tests: 
        RemoteSchedulerTest.test:136 expected:<0> but was:<1>
      
      Tests run: 35, Failures: 1, Errors: 0, Skipped: 0
      
      [INFO] ------------------------------------------------------------------------
      [INFO] Reactor Summary:
      [INFO] 
      [INFO] Zeppelin: Interpreter .............................. FAILURE [01:22 min]
      [INFO] Zeppelin: Spark dependencies ....................... SKIPPED
      [INFO] ------------------------------------------------------------------------
      [INFO] BUILD FAILURE
      .....
      
      [ERROR] Failed to execute goal org.apache.maven.plugins:maven-surefire-plugin:2.17:test (default-test) on project zeppelin-interpreter: There are test failures.
      
      The command "mvn package -Pspark-1.2 -Phadoop-2.3 -Ppyspark -B -pl 'zeppelin-interpreter,spark-dependencies,spark'" exited with 1
      

        Attachments

          Issue Links

            Activity

              People

              • Assignee:
                AlexanderShoshin Alexander Shoshin
                Reporter:
                bzz Alexander Bezzubov
              • Votes:
                0 Vote for this issue
                Watchers:
                6 Start watching this issue

                Dates

                • Created:
                  Updated:
                  Resolved: