Uploaded image for project: 'Zeppelin'
  1. Zeppelin
  2. ZEPPELIN-1981 [Umbrella] Fix all flaky tests
  3. ZEPPELIN-2007

Flaky test: ShellInterpreterTest#testShellTimeout

Attach filesAttach ScreenshotVotersWatch issueWatchersLinkCloneUpdate Comment AuthorReplace String in CommentUpdate Comment VisibilityDelete Comments
    XMLWordPrintableJSON

Details

    • Sub-task
    • Status: Resolved
    • Major
    • Resolution: Fixed
    • 0.7.0
    • 0.7.0, 0.8.0
    • None
    • None

    Description

      https://s3.amazonaws.com/archive.travis-ci.org/jobs/194747330/log.txt

      Tests run: 3, Failures: 1, Errors: 0, Skipped: 0, Time elapsed: 90.27 sec <<< FAILURE! - in org.apache.zeppelin.shell.ShellInterpreterTest
      testShellTimeout(org.apache.zeppelin.shell.ShellInterpreterTest)  Time elapsed: 90.082 sec  <<< FAILURE!
      java.lang.AssertionError: expected:<INCOMPLETE> but was:<SUCCESS>
          at org.junit.Assert.fail(Assert.java:88)
          at org.junit.Assert.failNotEquals(Assert.java:834)
          at org.junit.Assert.assertEquals(Assert.java:118)
          at org.junit.Assert.assertEquals(Assert.java:144)
          at org.apache.zeppelin.shell.ShellInterpreterTest.testShellTimeout(ShellInterpreterTest.java:85)
      

      Attachments

        Activity

          This comment will be Viewable by All Users Viewable by All Users
          Cancel

          People

            moon Lee Moon Soo
            zjffdu Jeff Zhang
            Votes:
            0 Vote for this issue
            Watchers:
            3 Start watching this issue

            Dates

              Created:
              Updated:
              Resolved:

              Slack

                Issue deployment