Uploaded image for project: 'Hadoop YARN'
  1. Hadoop YARN
  2. YARN-9006

TestNodeLabelContainerAllocation fails in branch-3.0

    XMLWordPrintableJSON

    Details

    • Type: Bug
    • Status: Open
    • Priority: Major
    • Resolution: Unresolved
    • Affects Version/s: None
    • Fix Version/s: None
    • Component/s: test
    • Labels:
      None
    • Target Version/s:

      Description

      [ERROR] Failures: 
      [ERROR]   TestNodeLabelContainerAllocation.testPreferenceOfNeedyPrioritiesUnderSameAppTowardsNodePartitions:848->checkPendingResource:619 expected:<1024> but was:<0>
      [ERROR]   TestNodeLabelContainerAllocation.testPreferenceOfQueuesTowardsNodePartitions:1047->checkPendingResource:619 expected:<5120> but was:<0>
      [ERROR]   TestNodeLabelContainerAllocation.testQueueMetricsWithLabels:2024 expected:<0> but was:<1024>
      [ERROR]   TestNodeLabelContainerAllocation.testQueueMetricsWithLabelsOnDefaultLabelNode:2127 expected:<1024> but was:<2048>
      [INFO] 
      [ERROR] Tests run: 21, Failures: 4, Errors: 0, Skipped: 0
      

        Attachments

          Issue Links

            Activity

              People

              • Assignee:
                Unassigned
                Reporter:
                aajisaka Akira Ajisaka
              • Votes:
                0 Vote for this issue
                Watchers:
                4 Start watching this issue

                Dates

                • Created:
                  Updated: