Details

    • Type: Bug
    • Status: Resolved
    • Priority: Major
    • Resolution: Fixed
    • Affects Version/s: None
    • Fix Version/s: 2.9.0, 3.0.0
    • Component/s: None
    • Labels:
      None

      Description

      TestDistributedScheduler has been failing consistently in trunk:

      Running org.apache.hadoop.yarn.server.nodemanager.scheduler.TestDistributedScheduler
      Tests run: 1, Failures: 1, Errors: 0, Skipped: 0, Time elapsed: 0.75 sec <<< FAILURE! - in org.apache.hadoop.yarn.server.nodemanager.scheduler.TestDistributedScheduler
      testDistributedScheduler(org.apache.hadoop.yarn.server.nodemanager.scheduler.TestDistributedScheduler)  Time elapsed: 0.67 sec  <<< FAILURE!
      java.lang.AssertionError: expected:<4> but was:<2>
      	at org.junit.Assert.fail(Assert.java:88)
      	at org.junit.Assert.failNotEquals(Assert.java:743)
      	at org.junit.Assert.assertEquals(Assert.java:118)
      	at org.junit.Assert.assertEquals(Assert.java:555)
      	at org.junit.Assert.assertEquals(Assert.java:542)
      	at org.apache.hadoop.yarn.server.nodemanager.scheduler.TestDistributedScheduler.testDistributedScheduler(TestDistributedScheduler.java:118)
      

        Attachments

          Issue Links

            Activity

              People

              • Assignee:
                asuresh Arun Suresh
                Reporter:
                jlowe Jason Lowe
              • Votes:
                0 Vote for this issue
                Watchers:
                6 Start watching this issue

                Dates

                • Created:
                  Updated:
                  Resolved: