Uploaded image for project: 'Hadoop YARN'
  1. Hadoop YARN
  2. YARN-5037

TestRMRestart#testQueueMetricsOnRMRestart random failure

    Details

    • Type: Test
    • Status: Resolved
    • Priority: Major
    • Resolution: Fixed
    • Affects Version/s: None
    • Fix Version/s: 2.8.0, 3.0.0-alpha1
    • Component/s: None
    • Labels:
      None
    • Hadoop Flags:
      Reviewed

      Description

      https://builds.apache.org/job/PreCommit-YARN-Build/11326/artifact/patchprocess/patch-unit-hadoop-yarn-project_hadoop-yarn_hadoop-yarn-server_hadoop-yarn-server-resourcemanager-jdk1.7.0_95.txt

      Tests run: 28, Failures: 1, Errors: 0, Skipped: 0, Time elapsed: 67.159 sec <<< FAILURE! - in org.apache.hadoop.yarn.server.resourcemanager.TestRMRestart
      testQueueMetricsOnRMRestart(org.apache.hadoop.yarn.server.resourcemanager.TestRMRestart)  Time elapsed: 2.561 sec  <<< FAILURE!
      java.lang.AssertionError: expected:<2> but was:<1>
      	at org.junit.Assert.fail(Assert.java:88)
      	at org.junit.Assert.failNotEquals(Assert.java:743)
      	at org.junit.Assert.assertEquals(Assert.java:118)
      	at org.junit.Assert.assertEquals(Assert.java:555)
      	at org.junit.Assert.assertEquals(Assert.java:542)
      	at org.apache.hadoop.yarn.server.resourcemanager.TestRMRestart.assertQueueMetrics(TestRMRestart.java:1874)
      	at org.apache.hadoop.yarn.server.resourcemanager.TestRMRestart.testQueueMetricsOnRMRestart(TestRMRestart.java:1849)
      

        Attachments

        1. YARN-5037.01.patch
          2 kB
          sandflee
        2. YARN-5037.02.patch
          6 kB
          sandflee
        3. YARN-5037.03.patch
          5 kB
          sandflee
        4. YARN-5037.04.patch
          5 kB
          sandflee

          Issue Links

            Activity

              People

              • Assignee:
                sandflee sandflee
                Reporter:
                sandflee sandflee
              • Votes:
                0 Vote for this issue
                Watchers:
                7 Start watching this issue

                Dates

                • Created:
                  Updated:
                  Resolved: