Uploaded image for project: 'Hadoop YARN'
  1. Hadoop YARN
  2. YARN-4940

yarn node -list -all failed if RM start with decommissioned node

    Details

    • Type: Bug
    • Status: Closed
    • Priority: Major
    • Resolution: Fixed
    • Affects Version/s: None
    • Fix Version/s: 2.8.0, 2.7.3, 3.0.0-alpha1
    • Component/s: None
    • Labels:
      None
    • Hadoop Flags:
      Reviewed

      Description

      1, add a node to exclude file
      2, start RM
      3, run yarn node -list -all , see the following exception

      Exception in thread "main" java.lang.ClassCastException: org.apache.hadoop.yarn.server.resourcemanager.NodesListManager$UnknownNodeId cannot be cast to org.apache.hadoop.yarn.api.records.impl.pb.NodeIdPBImpl
      at org.apache.hadoop.yarn.api.records.impl.pb.NodeReportPBImpl.mergeLocalToBuilder(NodeReportPBImpl.java:251)
      at org.apache.hadoop.yarn.api.records.impl.pb.NodeReportPBImpl.mergeLocalToProto(NodeReportPBImpl.java:287)
      at org.apache.hadoop.yarn.api.records.impl.pb.NodeReportPBImpl.getProto(NodeReportPBImpl.java:224)
      at org.apache.hadoop.yarn.api.protocolrecords.impl.pb.GetClusterNodesResponsePBImpl.convertToProtoFormat(GetClusterNodesResponsePBImpl.java:172)
      at org.apache.hadoop.yarn.api.protocolrecords.impl.pb.GetClusterNodesResponsePBImpl.access$000(GetClusterNodesResponsePBImpl.java:38)
      at org.apache.hadoop.yarn.api.protocolrecords.impl.pb.GetClusterNodesResponsePBImpl$1$1.next(GetClusterNodesResponsePBImpl.java:152)
      at org.apache.hadoop.yarn.api.protocolrecords.impl.pb.GetClusterNodesResponsePBImpl$1$1.next(GetClusterNodesResponsePBImpl.java:141)
      at com.google.protobuf.AbstractMessageLite$Builder.checkForNullValues(AbstractMessageLite.java:336)
      at com.google.protobuf.AbstractMessageLite$Builder.addAll(AbstractMessageLite.java:323)
      at org.apache.hadoop.yarn.proto.YarnServiceProtos$GetClusterNodesResponseProto$Builder.addAllNodeReports(YarnServiceProtos.java:21485)
      at org.apache.hadoop.yarn.api.protocolrecords.impl.pb.GetClusterNodesResponsePBImpl.addLocalNodeManagerInfosToProto(GetClusterNodesResponsePBImpl.java:164)
      at org.apache.hadoop.yarn.api.protocolrecords.impl.pb.GetClusterNodesResponsePBImpl.mergeLocalToBuilder(GetClusterNodesResponsePBImpl.java:99)
      at org.apache.hadoop.yarn.api.protocolrecords.impl.pb.GetClusterNodesResponsePBImpl.mergeLocalToProto(GetClusterNodesResponsePBImpl.java:106)
      at org.apache.hadoop.yarn.api.protocolrecords.impl.pb.GetClusterNodesResponsePBImpl.getProto(GetClusterNodesResponsePBImpl.java:71)
      at org.apache.hadoop.yarn.api.impl.pb.service.ApplicationClientProtocolPBServiceImpl.getClusterNodes(ApplicationClientProtocolPBServiceImpl.java:284)
      at org.apache.hadoop.yarn.proto.ApplicationClientProtocol$ApplicationClientProtocolService$2.callBlockingMethod(ApplicationClientProtocol.java:493)
      at org.apache.hadoop.ipc.ProtobufRpcEngine$Server$ProtoBufRpcInvoker.call(ProtobufRpcEngine.java:637)
      at org.apache.hadoop.ipc.RPC$Server.call(RPC.java:989)
      at org.apache.hadoop.ipc.Server$Handler$1.run(Server.java:2422)
      at org.apache.hadoop.ipc.Server$Handler$1.run(Server.java:2418)
      at java.security.AccessController.doPrivileged(Native Method)
      at javax.security.auth.Subject.doAs(Subject.java:415)
      at org.apache.hadoop.security.UserGroupInformation.doAs(UserGroupInformation.java:1742)
      at org.apache.hadoop.ipc.Server$Handler.run(Server.java:2416)

      at sun.reflect.NativeConstructorAccessorImpl.newInstance0(Native Method)
      at sun.reflect.NativeConstructorAccessorImpl.newInstance(NativeConstructorAccessorImpl.java:57)
      at sun.reflect.DelegatingConstructorAccessorImpl.newInstance(DelegatingConstructorAccessorImpl.java:45)
      at java.lang.reflect.Constructor.newInstance(Constructor.java:526)
      at org.apache.hadoop.yarn.ipc.RPCUtil.instantiateException(RPCUtil.java:53)
      at org.apache.hadoop.yarn.ipc.RPCUtil.instantiateRuntimeException(RPCUtil.java:85)
      at org.apache.hadoop.yarn.ipc.RPCUtil.unwrapAndThrowException(RPCUtil.java:122)
      at org.apache.hadoop.yarn.api.impl.pb.client.ApplicationClientProtocolPBClientImpl.getClusterNodes(ApplicationClientProtocolPBClientImpl.java:302)
      at sun.reflect.NativeMethodAccessorImpl.invoke0(Native Method)
      at sun.reflect.NativeMethodAccessorImpl.invoke(NativeMethodAccessorImpl.java:57)
      at sun.reflect.DelegatingMethodAccessorImpl.invoke(DelegatingMethodAccessorImpl.java:43)
      at java.lang.reflect.Method.invoke(Method.java:606)
      at org.apache.hadoop.io.retry.RetryInvocationHandler.invokeMethod(RetryInvocationHandler.java:257)
      at org.apache.hadoop.io.retry.RetryInvocationHandler.invoke(RetryInvocationHandler.java:103)
      at com.sun.proxy.$Proxy8.getClusterNodes(Unknown Source)
      at org.apache.hadoop.yarn.client.api.impl.YarnClientImpl.getNodeReports(YarnClientImpl.java:532)
      at org.apache.hadoop.yarn.client.cli.NodeCLI.listClusterNodes(NodeCLI.java:164)
      at org.apache.hadoop.yarn.client.cli.NodeCLI.run(NodeCLI.java:132)
      at org.apache.hadoop.util.ToolRunner.run(ToolRunner.java:76)
      at org.apache.hadoop.util.ToolRunner.run(ToolRunner.java:90)
      at org.apache.hadoop.yarn.client.cli.NodeCLI.main(NodeCLI.java:63)

      1. YARN-4940.05.patch
        8 kB
        sandflee
      2. YARN-4940.04.patch
        8 kB
        sandflee
      3. YARN-4940.03.patch
        8 kB
        sandflee
      4. YARN-4940.02.patch
        4 kB
        sandflee
      5. YARN-4940.01.patch
        4 kB
        sandflee

        Issue Links

          Activity

          Hide
          vinodkv Vinod Kumar Vavilapalli added a comment -

          Closing the JIRA as part of 2.7.3 release.

          Show
          vinodkv Vinod Kumar Vavilapalli added a comment - Closing the JIRA as part of 2.7.3 release.
          Hide
          hudson Hudson added a comment -

          FAILURE: Integrated in Hadoop-trunk-Commit #9620 (See https://builds.apache.org/job/Hadoop-trunk-Commit/9620/)
          YARN-4940. yarn node -list -all failed if RM start with decommissioned (jlowe: rev 69f3d428d5c3ab0c79cacffc22b1f59408622ae7)

          • hadoop-yarn-project/hadoop-yarn/hadoop-yarn-server/hadoop-yarn-server-resourcemanager/src/main/java/org/apache/hadoop/yarn/server/resourcemanager/rmnode/RMNodeImpl.java
          • hadoop-yarn-project/hadoop-yarn/hadoop-yarn-server/hadoop-yarn-server-resourcemanager/src/test/java/org/apache/hadoop/yarn/server/resourcemanager/TestClientRMService.java
          • hadoop-yarn-project/hadoop-yarn/hadoop-yarn-server/hadoop-yarn-server-resourcemanager/src/main/java/org/apache/hadoop/yarn/server/resourcemanager/NodesListManager.java
          • hadoop-yarn-project/hadoop-yarn/hadoop-yarn-server/hadoop-yarn-server-resourcemanager/src/test/java/org/apache/hadoop/yarn/server/resourcemanager/TestRMNodeTransitions.java
          Show
          hudson Hudson added a comment - FAILURE: Integrated in Hadoop-trunk-Commit #9620 (See https://builds.apache.org/job/Hadoop-trunk-Commit/9620/ ) YARN-4940 . yarn node -list -all failed if RM start with decommissioned (jlowe: rev 69f3d428d5c3ab0c79cacffc22b1f59408622ae7) hadoop-yarn-project/hadoop-yarn/hadoop-yarn-server/hadoop-yarn-server-resourcemanager/src/main/java/org/apache/hadoop/yarn/server/resourcemanager/rmnode/RMNodeImpl.java hadoop-yarn-project/hadoop-yarn/hadoop-yarn-server/hadoop-yarn-server-resourcemanager/src/test/java/org/apache/hadoop/yarn/server/resourcemanager/TestClientRMService.java hadoop-yarn-project/hadoop-yarn/hadoop-yarn-server/hadoop-yarn-server-resourcemanager/src/main/java/org/apache/hadoop/yarn/server/resourcemanager/NodesListManager.java hadoop-yarn-project/hadoop-yarn/hadoop-yarn-server/hadoop-yarn-server-resourcemanager/src/test/java/org/apache/hadoop/yarn/server/resourcemanager/TestRMNodeTransitions.java
          Hide
          jlowe Jason Lowe added a comment -

          Thanks to sandflee for the contribution and to Kuhu Shukla and Daniel Templeton for additional review! I committed this to trunk, branch-2, branch-2.8, and branch-2.7.

          Show
          jlowe Jason Lowe added a comment - Thanks to sandflee for the contribution and to Kuhu Shukla and Daniel Templeton for additional review! I committed this to trunk, branch-2, branch-2.8, and branch-2.7.
          Hide
          jlowe Jason Lowe added a comment -

          +1 lgtm. The test failures appear to be unrelated.

          Committing this.

          Show
          jlowe Jason Lowe added a comment - +1 lgtm. The test failures appear to be unrelated. Committing this.
          Hide
          kshukla Kuhu Shukla added a comment -

          +1 lgtm (non-binding).

          Show
          kshukla Kuhu Shukla added a comment - +1 lgtm (non-binding).
          Hide
          hadoopqa Hadoop QA added a comment -
          -1 overall



          Vote Subsystem Runtime Comment
          0 reexec 0m 8s Docker mode activated.
          +1 @author 0m 0s The patch does not contain any @author tags.
          +1 test4tests 0m 0s The patch appears to include 2 new or modified test files.
          +1 mvninstall 6m 36s trunk passed
          +1 compile 0m 25s trunk passed with JDK v1.8.0_77
          +1 compile 0m 28s trunk passed with JDK v1.7.0_95
          +1 checkstyle 0m 18s trunk passed
          +1 mvnsite 0m 34s trunk passed
          +1 mvneclipse 0m 15s trunk passed
          +1 findbugs 1m 5s trunk passed
          +1 javadoc 0m 20s trunk passed with JDK v1.8.0_77
          +1 javadoc 0m 25s trunk passed with JDK v1.7.0_95
          +1 mvninstall 0m 29s the patch passed
          +1 compile 0m 23s the patch passed with JDK v1.8.0_77
          +1 javac 0m 23s the patch passed
          +1 compile 0m 26s the patch passed with JDK v1.7.0_95
          +1 javac 0m 27s the patch passed
          +1 checkstyle 0m 16s the patch passed
          +1 mvnsite 0m 31s the patch passed
          +1 mvneclipse 0m 12s the patch passed
          +1 whitespace 0m 0s Patch has no whitespace issues.
          +1 findbugs 1m 14s the patch passed
          +1 javadoc 0m 18s the patch passed with JDK v1.8.0_77
          +1 javadoc 0m 24s the patch passed with JDK v1.7.0_95
          -1 unit 67m 13s hadoop-yarn-server-resourcemanager in the patch failed with JDK v1.8.0_77.
          -1 unit 49m 36s hadoop-yarn-server-resourcemanager in the patch failed with JDK v1.7.0_95.
          +1 asflicense 0m 18s Patch does not generate ASF License warnings.
          132m 52s



          Reason Tests
          JDK v1.8.0_77 Failed junit tests hadoop.yarn.server.resourcemanager.TestAMAuthorization
            hadoop.yarn.server.resourcemanager.webapp.TestRMWebServicesDelegationTokens
            hadoop.yarn.server.resourcemanager.webapp.TestRMWebServicesApps
            hadoop.yarn.webapp.TestRMWithCSRFFilter
            hadoop.yarn.server.resourcemanager.webapp.TestRMWebServices
            hadoop.yarn.server.resourcemanager.TestClientRMTokens
            hadoop.yarn.server.resourcemanager.webapp.TestRMWebServicesReservation
          JDK v1.8.0_77 Timed out junit tests org.apache.hadoop.yarn.server.resourcemanager.webapp.TestRMWebServicesNodes
          JDK v1.7.0_95 Failed junit tests hadoop.yarn.server.resourcemanager.scheduler.capacity.TestNodeLabelContainerAllocation
            hadoop.yarn.server.resourcemanager.TestAMAuthorization
            hadoop.yarn.server.resourcemanager.webapp.TestRMWebServicesAppsModification
            hadoop.yarn.server.resourcemanager.webapp.TestRMWebServicesDelegationTokens
            hadoop.yarn.server.resourcemanager.webapp.TestRMWebServicesCapacitySched
            hadoop.yarn.server.resourcemanager.webapp.TestRMWebServicesFairScheduler
            hadoop.yarn.server.resourcemanager.webapp.TestRMWebServicesNodeLabels
            hadoop.yarn.server.resourcemanager.webapp.TestRMWebServicesForCSWithPartitions
            hadoop.yarn.server.resourcemanager.webapp.TestRMWebServicesApps
            hadoop.yarn.webapp.TestRMWithCSRFFilter
            hadoop.yarn.server.resourcemanager.webapp.TestRMWebServices
            hadoop.yarn.server.resourcemanager.webapp.TestRMWebServicesNodes
            hadoop.yarn.server.resourcemanager.TestClientRMTokens
            hadoop.yarn.server.resourcemanager.webapp.TestRMWebServicesReservation



          Subsystem Report/Notes
          Docker Image:yetus/hadoop:fbe3e86
          JIRA Patch URL https://issues.apache.org/jira/secure/attachment/12798938/YARN-4940.05.patch
          JIRA Issue YARN-4940
          Optional Tests asflicense compile javac javadoc mvninstall mvnsite unit findbugs checkstyle
          uname Linux 12d5c4f246da 3.13.0-36-lowlatency #63-Ubuntu SMP PREEMPT Wed Sep 3 21:56:12 UTC 2014 x86_64 x86_64 x86_64 GNU/Linux
          Build tool maven
          Personality /testptch/hadoop/patchprocess/precommit/personality/provided.sh
          git revision trunk / 6e6b6dd
          Default Java 1.7.0_95
          Multi-JDK versions /usr/lib/jvm/java-8-oracle:1.8.0_77 /usr/lib/jvm/java-7-openjdk-amd64:1.7.0_95
          findbugs v3.0.0
          unit https://builds.apache.org/job/PreCommit-YARN-Build/11096/artifact/patchprocess/patch-unit-hadoop-yarn-project_hadoop-yarn_hadoop-yarn-server_hadoop-yarn-server-resourcemanager-jdk1.8.0_77.txt
          unit https://builds.apache.org/job/PreCommit-YARN-Build/11096/artifact/patchprocess/patch-unit-hadoop-yarn-project_hadoop-yarn_hadoop-yarn-server_hadoop-yarn-server-resourcemanager-jdk1.7.0_95.txt
          unit test logs https://builds.apache.org/job/PreCommit-YARN-Build/11096/artifact/patchprocess/patch-unit-hadoop-yarn-project_hadoop-yarn_hadoop-yarn-server_hadoop-yarn-server-resourcemanager-jdk1.8.0_77.txt https://builds.apache.org/job/PreCommit-YARN-Build/11096/artifact/patchprocess/patch-unit-hadoop-yarn-project_hadoop-yarn_hadoop-yarn-server_hadoop-yarn-server-resourcemanager-jdk1.7.0_95.txt
          JDK v1.7.0_95 Test Results https://builds.apache.org/job/PreCommit-YARN-Build/11096/testReport/
          modules C: hadoop-yarn-project/hadoop-yarn/hadoop-yarn-server/hadoop-yarn-server-resourcemanager U: hadoop-yarn-project/hadoop-yarn/hadoop-yarn-server/hadoop-yarn-server-resourcemanager
          Console output https://builds.apache.org/job/PreCommit-YARN-Build/11096/console
          Powered by Apache Yetus 0.2.0 http://yetus.apache.org

          This message was automatically generated.

          Show
          hadoopqa Hadoop QA added a comment - -1 overall Vote Subsystem Runtime Comment 0 reexec 0m 8s Docker mode activated. +1 @author 0m 0s The patch does not contain any @author tags. +1 test4tests 0m 0s The patch appears to include 2 new or modified test files. +1 mvninstall 6m 36s trunk passed +1 compile 0m 25s trunk passed with JDK v1.8.0_77 +1 compile 0m 28s trunk passed with JDK v1.7.0_95 +1 checkstyle 0m 18s trunk passed +1 mvnsite 0m 34s trunk passed +1 mvneclipse 0m 15s trunk passed +1 findbugs 1m 5s trunk passed +1 javadoc 0m 20s trunk passed with JDK v1.8.0_77 +1 javadoc 0m 25s trunk passed with JDK v1.7.0_95 +1 mvninstall 0m 29s the patch passed +1 compile 0m 23s the patch passed with JDK v1.8.0_77 +1 javac 0m 23s the patch passed +1 compile 0m 26s the patch passed with JDK v1.7.0_95 +1 javac 0m 27s the patch passed +1 checkstyle 0m 16s the patch passed +1 mvnsite 0m 31s the patch passed +1 mvneclipse 0m 12s the patch passed +1 whitespace 0m 0s Patch has no whitespace issues. +1 findbugs 1m 14s the patch passed +1 javadoc 0m 18s the patch passed with JDK v1.8.0_77 +1 javadoc 0m 24s the patch passed with JDK v1.7.0_95 -1 unit 67m 13s hadoop-yarn-server-resourcemanager in the patch failed with JDK v1.8.0_77. -1 unit 49m 36s hadoop-yarn-server-resourcemanager in the patch failed with JDK v1.7.0_95. +1 asflicense 0m 18s Patch does not generate ASF License warnings. 132m 52s Reason Tests JDK v1.8.0_77 Failed junit tests hadoop.yarn.server.resourcemanager.TestAMAuthorization   hadoop.yarn.server.resourcemanager.webapp.TestRMWebServicesDelegationTokens   hadoop.yarn.server.resourcemanager.webapp.TestRMWebServicesApps   hadoop.yarn.webapp.TestRMWithCSRFFilter   hadoop.yarn.server.resourcemanager.webapp.TestRMWebServices   hadoop.yarn.server.resourcemanager.TestClientRMTokens   hadoop.yarn.server.resourcemanager.webapp.TestRMWebServicesReservation JDK v1.8.0_77 Timed out junit tests org.apache.hadoop.yarn.server.resourcemanager.webapp.TestRMWebServicesNodes JDK v1.7.0_95 Failed junit tests hadoop.yarn.server.resourcemanager.scheduler.capacity.TestNodeLabelContainerAllocation   hadoop.yarn.server.resourcemanager.TestAMAuthorization   hadoop.yarn.server.resourcemanager.webapp.TestRMWebServicesAppsModification   hadoop.yarn.server.resourcemanager.webapp.TestRMWebServicesDelegationTokens   hadoop.yarn.server.resourcemanager.webapp.TestRMWebServicesCapacitySched   hadoop.yarn.server.resourcemanager.webapp.TestRMWebServicesFairScheduler   hadoop.yarn.server.resourcemanager.webapp.TestRMWebServicesNodeLabels   hadoop.yarn.server.resourcemanager.webapp.TestRMWebServicesForCSWithPartitions   hadoop.yarn.server.resourcemanager.webapp.TestRMWebServicesApps   hadoop.yarn.webapp.TestRMWithCSRFFilter   hadoop.yarn.server.resourcemanager.webapp.TestRMWebServices   hadoop.yarn.server.resourcemanager.webapp.TestRMWebServicesNodes   hadoop.yarn.server.resourcemanager.TestClientRMTokens   hadoop.yarn.server.resourcemanager.webapp.TestRMWebServicesReservation Subsystem Report/Notes Docker Image:yetus/hadoop:fbe3e86 JIRA Patch URL https://issues.apache.org/jira/secure/attachment/12798938/YARN-4940.05.patch JIRA Issue YARN-4940 Optional Tests asflicense compile javac javadoc mvninstall mvnsite unit findbugs checkstyle uname Linux 12d5c4f246da 3.13.0-36-lowlatency #63-Ubuntu SMP PREEMPT Wed Sep 3 21:56:12 UTC 2014 x86_64 x86_64 x86_64 GNU/Linux Build tool maven Personality /testptch/hadoop/patchprocess/precommit/personality/provided.sh git revision trunk / 6e6b6dd Default Java 1.7.0_95 Multi-JDK versions /usr/lib/jvm/java-8-oracle:1.8.0_77 /usr/lib/jvm/java-7-openjdk-amd64:1.7.0_95 findbugs v3.0.0 unit https://builds.apache.org/job/PreCommit-YARN-Build/11096/artifact/patchprocess/patch-unit-hadoop-yarn-project_hadoop-yarn_hadoop-yarn-server_hadoop-yarn-server-resourcemanager-jdk1.8.0_77.txt unit https://builds.apache.org/job/PreCommit-YARN-Build/11096/artifact/patchprocess/patch-unit-hadoop-yarn-project_hadoop-yarn_hadoop-yarn-server_hadoop-yarn-server-resourcemanager-jdk1.7.0_95.txt unit test logs https://builds.apache.org/job/PreCommit-YARN-Build/11096/artifact/patchprocess/patch-unit-hadoop-yarn-project_hadoop-yarn_hadoop-yarn-server_hadoop-yarn-server-resourcemanager-jdk1.8.0_77.txt https://builds.apache.org/job/PreCommit-YARN-Build/11096/artifact/patchprocess/patch-unit-hadoop-yarn-project_hadoop-yarn_hadoop-yarn-server_hadoop-yarn-server-resourcemanager-jdk1.7.0_95.txt JDK v1.7.0_95 Test Results https://builds.apache.org/job/PreCommit-YARN-Build/11096/testReport/ modules C: hadoop-yarn-project/hadoop-yarn/hadoop-yarn-server/hadoop-yarn-server-resourcemanager U: hadoop-yarn-project/hadoop-yarn/hadoop-yarn-server/hadoop-yarn-server-resourcemanager Console output https://builds.apache.org/job/PreCommit-YARN-Build/11096/console Powered by Apache Yetus 0.2.0 http://yetus.apache.org This message was automatically generated.
          Hide
          hadoopqa Hadoop QA added a comment -
          -1 overall



          Vote Subsystem Runtime Comment
          0 reexec 0m 8s Docker mode activated.
          +1 @author 0m 0s The patch does not contain any @author tags.
          +1 test4tests 0m 0s The patch appears to include 2 new or modified test files.
          +1 mvninstall 6m 22s trunk passed
          +1 compile 0m 26s trunk passed with JDK v1.8.0_77
          +1 compile 0m 28s trunk passed with JDK v1.7.0_95
          +1 checkstyle 0m 18s trunk passed
          +1 mvnsite 0m 33s trunk passed
          +1 mvneclipse 0m 14s trunk passed
          +1 findbugs 1m 3s trunk passed
          +1 javadoc 0m 22s trunk passed with JDK v1.8.0_77
          +1 javadoc 0m 25s trunk passed with JDK v1.7.0_95
          +1 mvninstall 0m 30s the patch passed
          +1 compile 0m 24s the patch passed with JDK v1.8.0_77
          +1 javac 0m 24s the patch passed
          +1 compile 0m 27s the patch passed with JDK v1.7.0_95
          +1 javac 0m 27s the patch passed
          +1 checkstyle 0m 15s the patch passed
          +1 mvnsite 0m 33s the patch passed
          +1 mvneclipse 0m 13s the patch passed
          +1 whitespace 0m 0s Patch has no whitespace issues.
          +1 findbugs 1m 15s the patch passed
          +1 javadoc 0m 20s the patch passed with JDK v1.8.0_77
          +1 javadoc 0m 24s the patch passed with JDK v1.7.0_95
          -1 unit 67m 35s hadoop-yarn-server-resourcemanager in the patch failed with JDK v1.8.0_77.
          -1 unit 49m 41s hadoop-yarn-server-resourcemanager in the patch failed with JDK v1.7.0_95.
          +1 asflicense 0m 17s Patch does not generate ASF License warnings.
          133m 6s



          Reason Tests
          JDK v1.8.0_77 Failed junit tests hadoop.yarn.server.resourcemanager.TestAMAuthorization
            hadoop.yarn.server.resourcemanager.webapp.TestRMWebServicesDelegationTokens
            hadoop.yarn.server.resourcemanager.webapp.TestRMWebServicesApps
            hadoop.yarn.webapp.TestRMWithCSRFFilter
            hadoop.yarn.server.resourcemanager.webapp.TestRMWebServices
            hadoop.yarn.server.resourcemanager.TestClientRMTokens
            hadoop.yarn.server.resourcemanager.webapp.TestRMWebServicesReservation
          JDK v1.8.0_77 Timed out junit tests org.apache.hadoop.yarn.server.resourcemanager.webapp.TestRMWebServicesNodes
          JDK v1.7.0_95 Failed junit tests hadoop.yarn.server.resourcemanager.scheduler.capacity.TestNodeLabelContainerAllocation
            hadoop.yarn.server.resourcemanager.TestAMAuthorization
            hadoop.yarn.server.resourcemanager.webapp.TestRMWebServicesAppsModification
            hadoop.yarn.server.resourcemanager.webapp.TestRMWebServicesDelegationTokens
            hadoop.yarn.server.resourcemanager.webapp.TestRMWebServicesCapacitySched
            hadoop.yarn.server.resourcemanager.webapp.TestRMWebServicesFairScheduler
            hadoop.yarn.server.resourcemanager.webapp.TestRMWebServicesNodeLabels
            hadoop.yarn.server.resourcemanager.webapp.TestRMWebServicesForCSWithPartitions
            hadoop.yarn.server.resourcemanager.webapp.TestRMWebServicesApps
            hadoop.yarn.webapp.TestRMWithCSRFFilter
            hadoop.yarn.server.resourcemanager.webapp.TestRMWebServices
            hadoop.yarn.server.resourcemanager.webapp.TestRMWebServicesNodes
            hadoop.yarn.server.resourcemanager.TestClientRMTokens
            hadoop.yarn.server.resourcemanager.webapp.TestRMWebServicesReservation



          Subsystem Report/Notes
          Docker Image:yetus/hadoop:fbe3e86
          JIRA Patch URL https://issues.apache.org/jira/secure/attachment/12798919/YARN-4940.04.patch
          JIRA Issue YARN-4940
          Optional Tests asflicense compile javac javadoc mvninstall mvnsite unit findbugs checkstyle
          uname Linux 6aad384d37ba 3.13.0-36-lowlatency #63-Ubuntu SMP PREEMPT Wed Sep 3 21:56:12 UTC 2014 x86_64 x86_64 x86_64 GNU/Linux
          Build tool maven
          Personality /testptch/hadoop/patchprocess/precommit/personality/provided.sh
          git revision trunk / 6e6b6dd
          Default Java 1.7.0_95
          Multi-JDK versions /usr/lib/jvm/java-8-oracle:1.8.0_77 /usr/lib/jvm/java-7-openjdk-amd64:1.7.0_95
          findbugs v3.0.0
          unit https://builds.apache.org/job/PreCommit-YARN-Build/11095/artifact/patchprocess/patch-unit-hadoop-yarn-project_hadoop-yarn_hadoop-yarn-server_hadoop-yarn-server-resourcemanager-jdk1.8.0_77.txt
          unit https://builds.apache.org/job/PreCommit-YARN-Build/11095/artifact/patchprocess/patch-unit-hadoop-yarn-project_hadoop-yarn_hadoop-yarn-server_hadoop-yarn-server-resourcemanager-jdk1.7.0_95.txt
          unit test logs https://builds.apache.org/job/PreCommit-YARN-Build/11095/artifact/patchprocess/patch-unit-hadoop-yarn-project_hadoop-yarn_hadoop-yarn-server_hadoop-yarn-server-resourcemanager-jdk1.8.0_77.txt https://builds.apache.org/job/PreCommit-YARN-Build/11095/artifact/patchprocess/patch-unit-hadoop-yarn-project_hadoop-yarn_hadoop-yarn-server_hadoop-yarn-server-resourcemanager-jdk1.7.0_95.txt
          JDK v1.7.0_95 Test Results https://builds.apache.org/job/PreCommit-YARN-Build/11095/testReport/
          modules C: hadoop-yarn-project/hadoop-yarn/hadoop-yarn-server/hadoop-yarn-server-resourcemanager U: hadoop-yarn-project/hadoop-yarn/hadoop-yarn-server/hadoop-yarn-server-resourcemanager
          Console output https://builds.apache.org/job/PreCommit-YARN-Build/11095/console
          Powered by Apache Yetus 0.2.0 http://yetus.apache.org

          This message was automatically generated.

          Show
          hadoopqa Hadoop QA added a comment - -1 overall Vote Subsystem Runtime Comment 0 reexec 0m 8s Docker mode activated. +1 @author 0m 0s The patch does not contain any @author tags. +1 test4tests 0m 0s The patch appears to include 2 new or modified test files. +1 mvninstall 6m 22s trunk passed +1 compile 0m 26s trunk passed with JDK v1.8.0_77 +1 compile 0m 28s trunk passed with JDK v1.7.0_95 +1 checkstyle 0m 18s trunk passed +1 mvnsite 0m 33s trunk passed +1 mvneclipse 0m 14s trunk passed +1 findbugs 1m 3s trunk passed +1 javadoc 0m 22s trunk passed with JDK v1.8.0_77 +1 javadoc 0m 25s trunk passed with JDK v1.7.0_95 +1 mvninstall 0m 30s the patch passed +1 compile 0m 24s the patch passed with JDK v1.8.0_77 +1 javac 0m 24s the patch passed +1 compile 0m 27s the patch passed with JDK v1.7.0_95 +1 javac 0m 27s the patch passed +1 checkstyle 0m 15s the patch passed +1 mvnsite 0m 33s the patch passed +1 mvneclipse 0m 13s the patch passed +1 whitespace 0m 0s Patch has no whitespace issues. +1 findbugs 1m 15s the patch passed +1 javadoc 0m 20s the patch passed with JDK v1.8.0_77 +1 javadoc 0m 24s the patch passed with JDK v1.7.0_95 -1 unit 67m 35s hadoop-yarn-server-resourcemanager in the patch failed with JDK v1.8.0_77. -1 unit 49m 41s hadoop-yarn-server-resourcemanager in the patch failed with JDK v1.7.0_95. +1 asflicense 0m 17s Patch does not generate ASF License warnings. 133m 6s Reason Tests JDK v1.8.0_77 Failed junit tests hadoop.yarn.server.resourcemanager.TestAMAuthorization   hadoop.yarn.server.resourcemanager.webapp.TestRMWebServicesDelegationTokens   hadoop.yarn.server.resourcemanager.webapp.TestRMWebServicesApps   hadoop.yarn.webapp.TestRMWithCSRFFilter   hadoop.yarn.server.resourcemanager.webapp.TestRMWebServices   hadoop.yarn.server.resourcemanager.TestClientRMTokens   hadoop.yarn.server.resourcemanager.webapp.TestRMWebServicesReservation JDK v1.8.0_77 Timed out junit tests org.apache.hadoop.yarn.server.resourcemanager.webapp.TestRMWebServicesNodes JDK v1.7.0_95 Failed junit tests hadoop.yarn.server.resourcemanager.scheduler.capacity.TestNodeLabelContainerAllocation   hadoop.yarn.server.resourcemanager.TestAMAuthorization   hadoop.yarn.server.resourcemanager.webapp.TestRMWebServicesAppsModification   hadoop.yarn.server.resourcemanager.webapp.TestRMWebServicesDelegationTokens   hadoop.yarn.server.resourcemanager.webapp.TestRMWebServicesCapacitySched   hadoop.yarn.server.resourcemanager.webapp.TestRMWebServicesFairScheduler   hadoop.yarn.server.resourcemanager.webapp.TestRMWebServicesNodeLabels   hadoop.yarn.server.resourcemanager.webapp.TestRMWebServicesForCSWithPartitions   hadoop.yarn.server.resourcemanager.webapp.TestRMWebServicesApps   hadoop.yarn.webapp.TestRMWithCSRFFilter   hadoop.yarn.server.resourcemanager.webapp.TestRMWebServices   hadoop.yarn.server.resourcemanager.webapp.TestRMWebServicesNodes   hadoop.yarn.server.resourcemanager.TestClientRMTokens   hadoop.yarn.server.resourcemanager.webapp.TestRMWebServicesReservation Subsystem Report/Notes Docker Image:yetus/hadoop:fbe3e86 JIRA Patch URL https://issues.apache.org/jira/secure/attachment/12798919/YARN-4940.04.patch JIRA Issue YARN-4940 Optional Tests asflicense compile javac javadoc mvninstall mvnsite unit findbugs checkstyle uname Linux 6aad384d37ba 3.13.0-36-lowlatency #63-Ubuntu SMP PREEMPT Wed Sep 3 21:56:12 UTC 2014 x86_64 x86_64 x86_64 GNU/Linux Build tool maven Personality /testptch/hadoop/patchprocess/precommit/personality/provided.sh git revision trunk / 6e6b6dd Default Java 1.7.0_95 Multi-JDK versions /usr/lib/jvm/java-8-oracle:1.8.0_77 /usr/lib/jvm/java-7-openjdk-amd64:1.7.0_95 findbugs v3.0.0 unit https://builds.apache.org/job/PreCommit-YARN-Build/11095/artifact/patchprocess/patch-unit-hadoop-yarn-project_hadoop-yarn_hadoop-yarn-server_hadoop-yarn-server-resourcemanager-jdk1.8.0_77.txt unit https://builds.apache.org/job/PreCommit-YARN-Build/11095/artifact/patchprocess/patch-unit-hadoop-yarn-project_hadoop-yarn_hadoop-yarn-server_hadoop-yarn-server-resourcemanager-jdk1.7.0_95.txt unit test logs https://builds.apache.org/job/PreCommit-YARN-Build/11095/artifact/patchprocess/patch-unit-hadoop-yarn-project_hadoop-yarn_hadoop-yarn-server_hadoop-yarn-server-resourcemanager-jdk1.8.0_77.txt https://builds.apache.org/job/PreCommit-YARN-Build/11095/artifact/patchprocess/patch-unit-hadoop-yarn-project_hadoop-yarn_hadoop-yarn-server_hadoop-yarn-server-resourcemanager-jdk1.7.0_95.txt JDK v1.7.0_95 Test Results https://builds.apache.org/job/PreCommit-YARN-Build/11095/testReport/ modules C: hadoop-yarn-project/hadoop-yarn/hadoop-yarn-server/hadoop-yarn-server-resourcemanager U: hadoop-yarn-project/hadoop-yarn/hadoop-yarn-server/hadoop-yarn-server-resourcemanager Console output https://builds.apache.org/job/PreCommit-YARN-Build/11095/console Powered by Apache Yetus 0.2.0 http://yetus.apache.org This message was automatically generated.
          Hide
          sandflee sandflee added a comment -

          Thanks Daniel Templeton Kuhu Shukla, update the patch, and I don't think the test failure related to this issue.

          Show
          sandflee sandflee added a comment - Thanks Daniel Templeton Kuhu Shukla , update the patch, and I don't think the test failure related to this issue.
          Hide
          kshukla Kuhu Shukla added a comment -

          Latest patch looking good with the minute nit of extra line before createExcludeFile. Most test failures seem unrelated.

          Show
          kshukla Kuhu Shukla added a comment - Latest patch looking good with the minute nit of extra line before createExcludeFile . Most test failures seem unrelated.
          Hide
          hadoopqa Hadoop QA added a comment -
          -1 overall



          Vote Subsystem Runtime Comment
          0 reexec 0m 12s Docker mode activated.
          +1 @author 0m 0s The patch does not contain any @author tags.
          +1 test4tests 0m 0s The patch appears to include 2 new or modified test files.
          +1 mvninstall 6m 43s trunk passed
          +1 compile 0m 29s trunk passed with JDK v1.8.0_77
          +1 compile 0m 27s trunk passed with JDK v1.7.0_95
          +1 checkstyle 0m 17s trunk passed
          +1 mvnsite 0m 34s trunk passed
          +1 mvneclipse 0m 14s trunk passed
          +1 findbugs 1m 3s trunk passed
          +1 javadoc 0m 24s trunk passed with JDK v1.8.0_77
          +1 javadoc 0m 25s trunk passed with JDK v1.7.0_95
          +1 mvninstall 0m 29s the patch passed
          +1 compile 0m 28s the patch passed with JDK v1.8.0_77
          +1 javac 0m 28s the patch passed
          +1 compile 0m 27s the patch passed with JDK v1.7.0_95
          +1 javac 0m 27s the patch passed
          +1 checkstyle 0m 17s the patch passed
          +1 mvnsite 0m 33s the patch passed
          +1 mvneclipse 0m 12s the patch passed
          +1 whitespace 0m 0s Patch has no whitespace issues.
          +1 findbugs 1m 17s the patch passed
          +1 javadoc 0m 22s the patch passed with JDK v1.8.0_77
          +1 javadoc 0m 25s the patch passed with JDK v1.7.0_95
          -1 unit 67m 29s hadoop-yarn-server-resourcemanager in the patch failed with JDK v1.8.0_77.
          -1 unit 49m 47s hadoop-yarn-server-resourcemanager in the patch failed with JDK v1.7.0_95.
          +1 asflicense 0m 15s Patch does not generate ASF License warnings.
          133m 46s



          Reason Tests
          JDK v1.8.0_77 Failed junit tests hadoop.yarn.server.resourcemanager.TestAMAuthorization
            hadoop.yarn.server.resourcemanager.webapp.TestRMWebServicesDelegationTokens
            hadoop.yarn.server.resourcemanager.TestClientRMService
            hadoop.yarn.server.resourcemanager.webapp.TestRMWebServicesApps
            hadoop.yarn.webapp.TestRMWithCSRFFilter
            hadoop.yarn.server.resourcemanager.webapp.TestRMWebServices
            hadoop.yarn.server.resourcemanager.TestClientRMTokens
            hadoop.yarn.server.resourcemanager.webapp.TestRMWebServicesReservation
          JDK v1.8.0_77 Timed out junit tests org.apache.hadoop.yarn.server.resourcemanager.webapp.TestRMWebServicesNodes
          JDK v1.7.0_95 Failed junit tests hadoop.yarn.server.resourcemanager.scheduler.capacity.TestNodeLabelContainerAllocation
            hadoop.yarn.server.resourcemanager.TestAMAuthorization
            hadoop.yarn.server.resourcemanager.webapp.TestRMWebServicesAppsModification
            hadoop.yarn.server.resourcemanager.webapp.TestRMWebServicesDelegationTokens
            hadoop.yarn.server.resourcemanager.webapp.TestRMWebServicesCapacitySched
            hadoop.yarn.server.resourcemanager.webapp.TestRMWebServicesFairScheduler
            hadoop.yarn.server.resourcemanager.TestClientRMService
            hadoop.yarn.server.resourcemanager.webapp.TestRMWebServicesNodeLabels
            hadoop.yarn.server.resourcemanager.webapp.TestRMWebServicesForCSWithPartitions
            hadoop.yarn.server.resourcemanager.webapp.TestRMWebServicesApps
            hadoop.yarn.webapp.TestRMWithCSRFFilter
            hadoop.yarn.server.resourcemanager.webapp.TestRMWebServices
            hadoop.yarn.server.resourcemanager.webapp.TestRMWebServicesNodes
            hadoop.yarn.server.resourcemanager.TestClientRMTokens
            hadoop.yarn.server.resourcemanager.webapp.TestRMWebServicesReservation



          Subsystem Report/Notes
          Docker Image:yetus/hadoop:fbe3e86
          JIRA Patch URL https://issues.apache.org/jira/secure/attachment/12798765/YARN-4940.03.patch
          JIRA Issue YARN-4940
          Optional Tests asflicense compile javac javadoc mvninstall mvnsite unit findbugs checkstyle
          uname Linux 1d3b38410629 3.13.0-36-lowlatency #63-Ubuntu SMP PREEMPT Wed Sep 3 21:56:12 UTC 2014 x86_64 x86_64 x86_64 GNU/Linux
          Build tool maven
          Personality /testptch/hadoop/patchprocess/precommit/personality/provided.sh
          git revision trunk / 0d1c115
          Default Java 1.7.0_95
          Multi-JDK versions /usr/lib/jvm/java-8-oracle:1.8.0_77 /usr/lib/jvm/java-7-openjdk-amd64:1.7.0_95
          findbugs v3.0.0
          unit https://builds.apache.org/job/PreCommit-YARN-Build/11077/artifact/patchprocess/patch-unit-hadoop-yarn-project_hadoop-yarn_hadoop-yarn-server_hadoop-yarn-server-resourcemanager-jdk1.8.0_77.txt
          unit https://builds.apache.org/job/PreCommit-YARN-Build/11077/artifact/patchprocess/patch-unit-hadoop-yarn-project_hadoop-yarn_hadoop-yarn-server_hadoop-yarn-server-resourcemanager-jdk1.7.0_95.txt
          unit test logs https://builds.apache.org/job/PreCommit-YARN-Build/11077/artifact/patchprocess/patch-unit-hadoop-yarn-project_hadoop-yarn_hadoop-yarn-server_hadoop-yarn-server-resourcemanager-jdk1.8.0_77.txt https://builds.apache.org/job/PreCommit-YARN-Build/11077/artifact/patchprocess/patch-unit-hadoop-yarn-project_hadoop-yarn_hadoop-yarn-server_hadoop-yarn-server-resourcemanager-jdk1.7.0_95.txt
          JDK v1.7.0_95 Test Results https://builds.apache.org/job/PreCommit-YARN-Build/11077/testReport/
          modules C: hadoop-yarn-project/hadoop-yarn/hadoop-yarn-server/hadoop-yarn-server-resourcemanager U: hadoop-yarn-project/hadoop-yarn/hadoop-yarn-server/hadoop-yarn-server-resourcemanager
          Console output https://builds.apache.org/job/PreCommit-YARN-Build/11077/console
          Powered by Apache Yetus 0.2.0 http://yetus.apache.org

          This message was automatically generated.

          Show
          hadoopqa Hadoop QA added a comment - -1 overall Vote Subsystem Runtime Comment 0 reexec 0m 12s Docker mode activated. +1 @author 0m 0s The patch does not contain any @author tags. +1 test4tests 0m 0s The patch appears to include 2 new or modified test files. +1 mvninstall 6m 43s trunk passed +1 compile 0m 29s trunk passed with JDK v1.8.0_77 +1 compile 0m 27s trunk passed with JDK v1.7.0_95 +1 checkstyle 0m 17s trunk passed +1 mvnsite 0m 34s trunk passed +1 mvneclipse 0m 14s trunk passed +1 findbugs 1m 3s trunk passed +1 javadoc 0m 24s trunk passed with JDK v1.8.0_77 +1 javadoc 0m 25s trunk passed with JDK v1.7.0_95 +1 mvninstall 0m 29s the patch passed +1 compile 0m 28s the patch passed with JDK v1.8.0_77 +1 javac 0m 28s the patch passed +1 compile 0m 27s the patch passed with JDK v1.7.0_95 +1 javac 0m 27s the patch passed +1 checkstyle 0m 17s the patch passed +1 mvnsite 0m 33s the patch passed +1 mvneclipse 0m 12s the patch passed +1 whitespace 0m 0s Patch has no whitespace issues. +1 findbugs 1m 17s the patch passed +1 javadoc 0m 22s the patch passed with JDK v1.8.0_77 +1 javadoc 0m 25s the patch passed with JDK v1.7.0_95 -1 unit 67m 29s hadoop-yarn-server-resourcemanager in the patch failed with JDK v1.8.0_77. -1 unit 49m 47s hadoop-yarn-server-resourcemanager in the patch failed with JDK v1.7.0_95. +1 asflicense 0m 15s Patch does not generate ASF License warnings. 133m 46s Reason Tests JDK v1.8.0_77 Failed junit tests hadoop.yarn.server.resourcemanager.TestAMAuthorization   hadoop.yarn.server.resourcemanager.webapp.TestRMWebServicesDelegationTokens   hadoop.yarn.server.resourcemanager.TestClientRMService   hadoop.yarn.server.resourcemanager.webapp.TestRMWebServicesApps   hadoop.yarn.webapp.TestRMWithCSRFFilter   hadoop.yarn.server.resourcemanager.webapp.TestRMWebServices   hadoop.yarn.server.resourcemanager.TestClientRMTokens   hadoop.yarn.server.resourcemanager.webapp.TestRMWebServicesReservation JDK v1.8.0_77 Timed out junit tests org.apache.hadoop.yarn.server.resourcemanager.webapp.TestRMWebServicesNodes JDK v1.7.0_95 Failed junit tests hadoop.yarn.server.resourcemanager.scheduler.capacity.TestNodeLabelContainerAllocation   hadoop.yarn.server.resourcemanager.TestAMAuthorization   hadoop.yarn.server.resourcemanager.webapp.TestRMWebServicesAppsModification   hadoop.yarn.server.resourcemanager.webapp.TestRMWebServicesDelegationTokens   hadoop.yarn.server.resourcemanager.webapp.TestRMWebServicesCapacitySched   hadoop.yarn.server.resourcemanager.webapp.TestRMWebServicesFairScheduler   hadoop.yarn.server.resourcemanager.TestClientRMService   hadoop.yarn.server.resourcemanager.webapp.TestRMWebServicesNodeLabels   hadoop.yarn.server.resourcemanager.webapp.TestRMWebServicesForCSWithPartitions   hadoop.yarn.server.resourcemanager.webapp.TestRMWebServicesApps   hadoop.yarn.webapp.TestRMWithCSRFFilter   hadoop.yarn.server.resourcemanager.webapp.TestRMWebServices   hadoop.yarn.server.resourcemanager.webapp.TestRMWebServicesNodes   hadoop.yarn.server.resourcemanager.TestClientRMTokens   hadoop.yarn.server.resourcemanager.webapp.TestRMWebServicesReservation Subsystem Report/Notes Docker Image:yetus/hadoop:fbe3e86 JIRA Patch URL https://issues.apache.org/jira/secure/attachment/12798765/YARN-4940.03.patch JIRA Issue YARN-4940 Optional Tests asflicense compile javac javadoc mvninstall mvnsite unit findbugs checkstyle uname Linux 1d3b38410629 3.13.0-36-lowlatency #63-Ubuntu SMP PREEMPT Wed Sep 3 21:56:12 UTC 2014 x86_64 x86_64 x86_64 GNU/Linux Build tool maven Personality /testptch/hadoop/patchprocess/precommit/personality/provided.sh git revision trunk / 0d1c115 Default Java 1.7.0_95 Multi-JDK versions /usr/lib/jvm/java-8-oracle:1.8.0_77 /usr/lib/jvm/java-7-openjdk-amd64:1.7.0_95 findbugs v3.0.0 unit https://builds.apache.org/job/PreCommit-YARN-Build/11077/artifact/patchprocess/patch-unit-hadoop-yarn-project_hadoop-yarn_hadoop-yarn-server_hadoop-yarn-server-resourcemanager-jdk1.8.0_77.txt unit https://builds.apache.org/job/PreCommit-YARN-Build/11077/artifact/patchprocess/patch-unit-hadoop-yarn-project_hadoop-yarn_hadoop-yarn-server_hadoop-yarn-server-resourcemanager-jdk1.7.0_95.txt unit test logs https://builds.apache.org/job/PreCommit-YARN-Build/11077/artifact/patchprocess/patch-unit-hadoop-yarn-project_hadoop-yarn_hadoop-yarn-server_hadoop-yarn-server-resourcemanager-jdk1.8.0_77.txt https://builds.apache.org/job/PreCommit-YARN-Build/11077/artifact/patchprocess/patch-unit-hadoop-yarn-project_hadoop-yarn_hadoop-yarn-server_hadoop-yarn-server-resourcemanager-jdk1.7.0_95.txt JDK v1.7.0_95 Test Results https://builds.apache.org/job/PreCommit-YARN-Build/11077/testReport/ modules C: hadoop-yarn-project/hadoop-yarn/hadoop-yarn-server/hadoop-yarn-server-resourcemanager U: hadoop-yarn-project/hadoop-yarn/hadoop-yarn-server/hadoop-yarn-server-resourcemanager Console output https://builds.apache.org/job/PreCommit-YARN-Build/11077/console Powered by Apache Yetus 0.2.0 http://yetus.apache.org This message was automatically generated.
          Hide
          templedf Daniel Templeton added a comment -

          I agree with Kuhu Shukla on both counts. The fix seems sound, and I like that it gets rid of the extra UnknownNodeId class. The patch needs to add tests to test the scenario that caused the issue.

          Show
          templedf Daniel Templeton added a comment - I agree with Kuhu Shukla on both counts. The fix seems sound, and I like that it gets rid of the extra UnknownNodeId class. The patch needs to add tests to test the scenario that caused the issue.
          Hide
          sandflee sandflee added a comment -

          thanks Kuhu Shukla, the test failures seems not related, I'll check it later and I'll add a test

          Show
          sandflee sandflee added a comment - thanks Kuhu Shukla , the test failures seems not related, I'll check it later and I'll add a test
          Hide
          kshukla Kuhu Shukla added a comment -

          The fix in the patch looks good. I have not looked at all the test failures yet. Just one comment, it might be nice to have a specific test to cover this failure besides the testUnknownNodeId since AFAICT the test did not catch this specific failure.

          Show
          kshukla Kuhu Shukla added a comment - The fix in the patch looks good. I have not looked at all the test failures yet. Just one comment, it might be nice to have a specific test to cover this failure besides the testUnknownNodeId since AFAICT the test did not catch this specific failure.
          Hide
          kshukla Kuhu Shukla added a comment -

          Thank you for reporting this sandflee. Did the fix for YARN-4723 not fix the issue for you?

          Show
          kshukla Kuhu Shukla added a comment - Thank you for reporting this sandflee . Did the fix for YARN-4723 not fix the issue for you?
          Hide
          hadoopqa Hadoop QA added a comment -
          -1 overall



          Vote Subsystem Runtime Comment
          0 reexec 0m 25s Docker mode activated.
          +1 @author 0m 0s The patch does not contain any @author tags.
          +1 test4tests 0m 0s The patch appears to include 1 new or modified test files.
          +1 mvninstall 8m 35s trunk passed
          +1 compile 1m 16s trunk passed with JDK v1.8.0_77
          +1 compile 0m 53s trunk passed with JDK v1.7.0_95
          +1 checkstyle 0m 30s trunk passed
          +1 mvnsite 0m 59s trunk passed
          +1 mvneclipse 0m 26s trunk passed
          +1 findbugs 1m 50s trunk passed
          +1 javadoc 1m 1s trunk passed with JDK v1.8.0_77
          +1 javadoc 0m 49s trunk passed with JDK v1.7.0_95
          +1 mvninstall 0m 52s the patch passed
          +1 compile 0m 48s the patch passed with JDK v1.8.0_77
          +1 javac 0m 48s the patch passed
          +1 compile 0m 39s the patch passed with JDK v1.7.0_95
          +1 javac 0m 39s the patch passed
          +1 checkstyle 0m 20s the patch passed
          +1 mvnsite 0m 52s the patch passed
          +1 mvneclipse 0m 21s the patch passed
          +1 whitespace 0m 0s Patch has no whitespace issues.
          +1 findbugs 1m 53s the patch passed
          +1 javadoc 0m 57s the patch passed with JDK v1.8.0_77
          +1 javadoc 0m 45s the patch passed with JDK v1.7.0_95
          -1 unit 76m 10s hadoop-yarn-server-resourcemanager in the patch failed with JDK v1.8.0_77.
          -1 unit 61m 52s hadoop-yarn-server-resourcemanager in the patch failed with JDK v1.7.0_95.
          +1 asflicense 0m 22s Patch does not generate ASF License warnings.
          164m 24s



          Reason Tests
          JDK v1.8.0_77 Failed junit tests hadoop.yarn.server.resourcemanager.webapp.TestRMWebServicesNodeLabels
            hadoop.yarn.webapp.TestRMWithCSRFFilter
            hadoop.yarn.server.resourcemanager.webapp.TestRMWebServicesFairScheduler
            hadoop.yarn.server.resourcemanager.webapp.TestRMWebServicesAppsModification
            hadoop.yarn.server.resourcemanager.webapp.TestRMWebServicesApps
            hadoop.yarn.server.resourcemanager.webapp.TestRMWebServices
            hadoop.yarn.server.resourcemanager.webapp.TestRMWebServicesCapacitySched
            hadoop.yarn.server.resourcemanager.webapp.TestRMWebServicesDelegationTokens
            hadoop.yarn.server.resourcemanager.webapp.TestRMWebServicesReservation
            hadoop.yarn.server.resourcemanager.TestClientRMTokens
            hadoop.yarn.server.resourcemanager.webapp.TestRMWebServicesForCSWithPartitions
            hadoop.yarn.server.resourcemanager.TestAMAuthorization
          JDK v1.8.0_77 Timed out junit tests org.apache.hadoop.yarn.server.resourcemanager.webapp.TestRMWebServicesNodes
          JDK v1.7.0_95 Failed junit tests hadoop.yarn.server.resourcemanager.webapp.TestRMWebServicesNodeLabels
            hadoop.yarn.webapp.TestRMWithCSRFFilter
            hadoop.yarn.server.resourcemanager.webapp.TestRMWebServicesFairScheduler
            hadoop.yarn.server.resourcemanager.webapp.TestRMWebServicesAppsModification
            hadoop.yarn.server.resourcemanager.webapp.TestRMWebServicesApps
            hadoop.yarn.server.resourcemanager.webapp.TestRMWebServices
            hadoop.yarn.server.resourcemanager.webapp.TestRMWebServicesCapacitySched
            hadoop.yarn.server.resourcemanager.webapp.TestRMWebServicesDelegationTokens
            hadoop.yarn.server.resourcemanager.webapp.TestRMWebServicesReservation
            hadoop.yarn.server.resourcemanager.TestClientRMTokens
            hadoop.yarn.server.resourcemanager.webapp.TestRMWebServicesNodes
            hadoop.yarn.server.resourcemanager.webapp.TestRMWebServicesForCSWithPartitions
            hadoop.yarn.server.resourcemanager.TestAMAuthorization
            hadoop.yarn.server.resourcemanager.scheduler.fair.TestSchedulingPolicy



          Subsystem Report/Notes
          Docker Image:yetus/hadoop:fbe3e86
          JIRA Patch URL https://issues.apache.org/jira/secure/attachment/12798244/YARN-4940.02.patch
          JIRA Issue YARN-4940
          Optional Tests asflicense compile javac javadoc mvninstall mvnsite unit findbugs checkstyle
          uname Linux 078bc08208ea 3.13.0-36-lowlatency #63-Ubuntu SMP PREEMPT Wed Sep 3 21:56:12 UTC 2014 x86_64 x86_64 x86_64 GNU/Linux
          Build tool maven
          Personality /testptch/hadoop/patchprocess/precommit/personality/provided.sh
          git revision trunk / 209303b
          Default Java 1.7.0_95
          Multi-JDK versions /usr/lib/jvm/java-8-oracle:1.8.0_77 /usr/lib/jvm/java-7-openjdk-amd64:1.7.0_95
          findbugs v3.0.0
          unit https://builds.apache.org/job/PreCommit-YARN-Build/11049/artifact/patchprocess/patch-unit-hadoop-yarn-project_hadoop-yarn_hadoop-yarn-server_hadoop-yarn-server-resourcemanager-jdk1.8.0_77.txt
          unit https://builds.apache.org/job/PreCommit-YARN-Build/11049/artifact/patchprocess/patch-unit-hadoop-yarn-project_hadoop-yarn_hadoop-yarn-server_hadoop-yarn-server-resourcemanager-jdk1.7.0_95.txt
          unit test logs https://builds.apache.org/job/PreCommit-YARN-Build/11049/artifact/patchprocess/patch-unit-hadoop-yarn-project_hadoop-yarn_hadoop-yarn-server_hadoop-yarn-server-resourcemanager-jdk1.8.0_77.txt https://builds.apache.org/job/PreCommit-YARN-Build/11049/artifact/patchprocess/patch-unit-hadoop-yarn-project_hadoop-yarn_hadoop-yarn-server_hadoop-yarn-server-resourcemanager-jdk1.7.0_95.txt
          JDK v1.7.0_95 Test Results https://builds.apache.org/job/PreCommit-YARN-Build/11049/testReport/
          modules C: hadoop-yarn-project/hadoop-yarn/hadoop-yarn-server/hadoop-yarn-server-resourcemanager U: hadoop-yarn-project/hadoop-yarn/hadoop-yarn-server/hadoop-yarn-server-resourcemanager
          Console output https://builds.apache.org/job/PreCommit-YARN-Build/11049/console
          Powered by Apache Yetus 0.2.0 http://yetus.apache.org

          This message was automatically generated.

          Show
          hadoopqa Hadoop QA added a comment - -1 overall Vote Subsystem Runtime Comment 0 reexec 0m 25s Docker mode activated. +1 @author 0m 0s The patch does not contain any @author tags. +1 test4tests 0m 0s The patch appears to include 1 new or modified test files. +1 mvninstall 8m 35s trunk passed +1 compile 1m 16s trunk passed with JDK v1.8.0_77 +1 compile 0m 53s trunk passed with JDK v1.7.0_95 +1 checkstyle 0m 30s trunk passed +1 mvnsite 0m 59s trunk passed +1 mvneclipse 0m 26s trunk passed +1 findbugs 1m 50s trunk passed +1 javadoc 1m 1s trunk passed with JDK v1.8.0_77 +1 javadoc 0m 49s trunk passed with JDK v1.7.0_95 +1 mvninstall 0m 52s the patch passed +1 compile 0m 48s the patch passed with JDK v1.8.0_77 +1 javac 0m 48s the patch passed +1 compile 0m 39s the patch passed with JDK v1.7.0_95 +1 javac 0m 39s the patch passed +1 checkstyle 0m 20s the patch passed +1 mvnsite 0m 52s the patch passed +1 mvneclipse 0m 21s the patch passed +1 whitespace 0m 0s Patch has no whitespace issues. +1 findbugs 1m 53s the patch passed +1 javadoc 0m 57s the patch passed with JDK v1.8.0_77 +1 javadoc 0m 45s the patch passed with JDK v1.7.0_95 -1 unit 76m 10s hadoop-yarn-server-resourcemanager in the patch failed with JDK v1.8.0_77. -1 unit 61m 52s hadoop-yarn-server-resourcemanager in the patch failed with JDK v1.7.0_95. +1 asflicense 0m 22s Patch does not generate ASF License warnings. 164m 24s Reason Tests JDK v1.8.0_77 Failed junit tests hadoop.yarn.server.resourcemanager.webapp.TestRMWebServicesNodeLabels   hadoop.yarn.webapp.TestRMWithCSRFFilter   hadoop.yarn.server.resourcemanager.webapp.TestRMWebServicesFairScheduler   hadoop.yarn.server.resourcemanager.webapp.TestRMWebServicesAppsModification   hadoop.yarn.server.resourcemanager.webapp.TestRMWebServicesApps   hadoop.yarn.server.resourcemanager.webapp.TestRMWebServices   hadoop.yarn.server.resourcemanager.webapp.TestRMWebServicesCapacitySched   hadoop.yarn.server.resourcemanager.webapp.TestRMWebServicesDelegationTokens   hadoop.yarn.server.resourcemanager.webapp.TestRMWebServicesReservation   hadoop.yarn.server.resourcemanager.TestClientRMTokens   hadoop.yarn.server.resourcemanager.webapp.TestRMWebServicesForCSWithPartitions   hadoop.yarn.server.resourcemanager.TestAMAuthorization JDK v1.8.0_77 Timed out junit tests org.apache.hadoop.yarn.server.resourcemanager.webapp.TestRMWebServicesNodes JDK v1.7.0_95 Failed junit tests hadoop.yarn.server.resourcemanager.webapp.TestRMWebServicesNodeLabels   hadoop.yarn.webapp.TestRMWithCSRFFilter   hadoop.yarn.server.resourcemanager.webapp.TestRMWebServicesFairScheduler   hadoop.yarn.server.resourcemanager.webapp.TestRMWebServicesAppsModification   hadoop.yarn.server.resourcemanager.webapp.TestRMWebServicesApps   hadoop.yarn.server.resourcemanager.webapp.TestRMWebServices   hadoop.yarn.server.resourcemanager.webapp.TestRMWebServicesCapacitySched   hadoop.yarn.server.resourcemanager.webapp.TestRMWebServicesDelegationTokens   hadoop.yarn.server.resourcemanager.webapp.TestRMWebServicesReservation   hadoop.yarn.server.resourcemanager.TestClientRMTokens   hadoop.yarn.server.resourcemanager.webapp.TestRMWebServicesNodes   hadoop.yarn.server.resourcemanager.webapp.TestRMWebServicesForCSWithPartitions   hadoop.yarn.server.resourcemanager.TestAMAuthorization   hadoop.yarn.server.resourcemanager.scheduler.fair.TestSchedulingPolicy Subsystem Report/Notes Docker Image:yetus/hadoop:fbe3e86 JIRA Patch URL https://issues.apache.org/jira/secure/attachment/12798244/YARN-4940.02.patch JIRA Issue YARN-4940 Optional Tests asflicense compile javac javadoc mvninstall mvnsite unit findbugs checkstyle uname Linux 078bc08208ea 3.13.0-36-lowlatency #63-Ubuntu SMP PREEMPT Wed Sep 3 21:56:12 UTC 2014 x86_64 x86_64 x86_64 GNU/Linux Build tool maven Personality /testptch/hadoop/patchprocess/precommit/personality/provided.sh git revision trunk / 209303b Default Java 1.7.0_95 Multi-JDK versions /usr/lib/jvm/java-8-oracle:1.8.0_77 /usr/lib/jvm/java-7-openjdk-amd64:1.7.0_95 findbugs v3.0.0 unit https://builds.apache.org/job/PreCommit-YARN-Build/11049/artifact/patchprocess/patch-unit-hadoop-yarn-project_hadoop-yarn_hadoop-yarn-server_hadoop-yarn-server-resourcemanager-jdk1.8.0_77.txt unit https://builds.apache.org/job/PreCommit-YARN-Build/11049/artifact/patchprocess/patch-unit-hadoop-yarn-project_hadoop-yarn_hadoop-yarn-server_hadoop-yarn-server-resourcemanager-jdk1.7.0_95.txt unit test logs https://builds.apache.org/job/PreCommit-YARN-Build/11049/artifact/patchprocess/patch-unit-hadoop-yarn-project_hadoop-yarn_hadoop-yarn-server_hadoop-yarn-server-resourcemanager-jdk1.8.0_77.txt https://builds.apache.org/job/PreCommit-YARN-Build/11049/artifact/patchprocess/patch-unit-hadoop-yarn-project_hadoop-yarn_hadoop-yarn-server_hadoop-yarn-server-resourcemanager-jdk1.7.0_95.txt JDK v1.7.0_95 Test Results https://builds.apache.org/job/PreCommit-YARN-Build/11049/testReport/ modules C: hadoop-yarn-project/hadoop-yarn/hadoop-yarn-server/hadoop-yarn-server-resourcemanager U: hadoop-yarn-project/hadoop-yarn/hadoop-yarn-server/hadoop-yarn-server-resourcemanager Console output https://builds.apache.org/job/PreCommit-YARN-Build/11049/console Powered by Apache Yetus 0.2.0 http://yetus.apache.org This message was automatically generated.
          Hide
          hadoopqa Hadoop QA added a comment -
          -1 overall



          Vote Subsystem Runtime Comment
          0 reexec 0m 11s Docker mode activated.
          +1 @author 0m 0s The patch does not contain any @author tags.
          +1 test4tests 0m 0s The patch appears to include 1 new or modified test files.
          +1 mvninstall 6m 59s trunk passed
          +1 compile 0m 29s trunk passed with JDK v1.8.0_77
          +1 compile 0m 28s trunk passed with JDK v1.7.0_95
          +1 checkstyle 0m 19s trunk passed
          +1 mvnsite 0m 34s trunk passed
          +1 mvneclipse 0m 14s trunk passed
          +1 findbugs 1m 6s trunk passed
          +1 javadoc 0m 22s trunk passed with JDK v1.8.0_77
          +1 javadoc 0m 25s trunk passed with JDK v1.7.0_95
          +1 mvninstall 0m 30s the patch passed
          +1 compile 0m 24s the patch passed with JDK v1.8.0_77
          +1 javac 0m 24s the patch passed
          +1 compile 0m 27s the patch passed with JDK v1.7.0_95
          +1 javac 0m 27s the patch passed
          -1 checkstyle 0m 16s hadoop-yarn-project/hadoop-yarn/hadoop-yarn-server/hadoop-yarn-server-resourcemanager: patch generated 1 new + 62 unchanged - 0 fixed = 63 total (was 62)
          +1 mvnsite 0m 33s the patch passed
          +1 mvneclipse 0m 12s the patch passed
          +1 whitespace 0m 0s Patch has no whitespace issues.
          +1 findbugs 1m 17s the patch passed
          +1 javadoc 0m 19s the patch passed with JDK v1.8.0_77
          +1 javadoc 0m 24s the patch passed with JDK v1.7.0_95
          -1 unit 67m 56s hadoop-yarn-server-resourcemanager in the patch failed with JDK v1.8.0_77.
          -1 unit 50m 39s hadoop-yarn-server-resourcemanager in the patch failed with JDK v1.7.0_95.
          +1 asflicense 0m 18s Patch does not generate ASF License warnings.
          135m 21s



          Reason Tests
          JDK v1.8.0_77 Failed junit tests hadoop.yarn.server.resourcemanager.TestAMAuthorization
            hadoop.yarn.server.resourcemanager.webapp.TestRMWebServicesDelegationTokens
            hadoop.yarn.server.resourcemanager.webapp.TestRMWebServicesApps
            hadoop.yarn.webapp.TestRMWithCSRFFilter
            hadoop.yarn.server.resourcemanager.webapp.TestRMWebServices
            hadoop.yarn.server.resourcemanager.TestClientRMTokens
            hadoop.yarn.server.resourcemanager.webapp.TestRMWebServicesReservation
          JDK v1.8.0_77 Timed out junit tests org.apache.hadoop.yarn.server.resourcemanager.webapp.TestRMWebServicesNodes
          JDK v1.7.0_95 Failed junit tests hadoop.yarn.server.resourcemanager.scheduler.capacity.TestNodeLabelContainerAllocation
            hadoop.yarn.server.resourcemanager.TestAMAuthorization
            hadoop.yarn.server.resourcemanager.webapp.TestRMWebServicesAppsModification
            hadoop.yarn.server.resourcemanager.webapp.TestRMWebServicesDelegationTokens
            hadoop.yarn.server.resourcemanager.webapp.TestRMWebServicesCapacitySched
            hadoop.yarn.server.resourcemanager.webapp.TestRMWebServicesFairScheduler
            hadoop.yarn.server.resourcemanager.webapp.TestRMWebServicesNodeLabels
            hadoop.yarn.server.resourcemanager.webapp.TestRMWebServicesForCSWithPartitions
            hadoop.yarn.server.resourcemanager.webapp.TestRMWebServicesApps
            hadoop.yarn.webapp.TestRMWithCSRFFilter
            hadoop.yarn.server.resourcemanager.webapp.TestRMWebServices
            hadoop.yarn.server.resourcemanager.webapp.TestRMWebServicesNodes
            hadoop.yarn.server.resourcemanager.TestClientRMTokens
            hadoop.yarn.server.resourcemanager.webapp.TestRMWebServicesReservation



          Subsystem Report/Notes
          Docker Image:yetus/hadoop:fbe3e86
          JIRA Patch URL https://issues.apache.org/jira/secure/attachment/12798235/YARN-4940.01.patch
          JIRA Issue YARN-4940
          Optional Tests asflicense compile javac javadoc mvninstall mvnsite unit findbugs checkstyle
          uname Linux d7d081401830 3.13.0-36-lowlatency #63-Ubuntu SMP PREEMPT Wed Sep 3 21:56:12 UTC 2014 x86_64 x86_64 x86_64 GNU/Linux
          Build tool maven
          Personality /testptch/hadoop/patchprocess/precommit/personality/provided.sh
          git revision trunk / 209303b
          Default Java 1.7.0_95
          Multi-JDK versions /usr/lib/jvm/java-8-oracle:1.8.0_77 /usr/lib/jvm/java-7-openjdk-amd64:1.7.0_95
          findbugs v3.0.0
          checkstyle https://builds.apache.org/job/PreCommit-YARN-Build/11046/artifact/patchprocess/diff-checkstyle-hadoop-yarn-project_hadoop-yarn_hadoop-yarn-server_hadoop-yarn-server-resourcemanager.txt
          unit https://builds.apache.org/job/PreCommit-YARN-Build/11046/artifact/patchprocess/patch-unit-hadoop-yarn-project_hadoop-yarn_hadoop-yarn-server_hadoop-yarn-server-resourcemanager-jdk1.8.0_77.txt
          unit https://builds.apache.org/job/PreCommit-YARN-Build/11046/artifact/patchprocess/patch-unit-hadoop-yarn-project_hadoop-yarn_hadoop-yarn-server_hadoop-yarn-server-resourcemanager-jdk1.7.0_95.txt
          unit test logs https://builds.apache.org/job/PreCommit-YARN-Build/11046/artifact/patchprocess/patch-unit-hadoop-yarn-project_hadoop-yarn_hadoop-yarn-server_hadoop-yarn-server-resourcemanager-jdk1.8.0_77.txt https://builds.apache.org/job/PreCommit-YARN-Build/11046/artifact/patchprocess/patch-unit-hadoop-yarn-project_hadoop-yarn_hadoop-yarn-server_hadoop-yarn-server-resourcemanager-jdk1.7.0_95.txt
          JDK v1.7.0_95 Test Results https://builds.apache.org/job/PreCommit-YARN-Build/11046/testReport/
          modules C: hadoop-yarn-project/hadoop-yarn/hadoop-yarn-server/hadoop-yarn-server-resourcemanager U: hadoop-yarn-project/hadoop-yarn/hadoop-yarn-server/hadoop-yarn-server-resourcemanager
          Console output https://builds.apache.org/job/PreCommit-YARN-Build/11046/console
          Powered by Apache Yetus 0.2.0 http://yetus.apache.org

          This message was automatically generated.

          Show
          hadoopqa Hadoop QA added a comment - -1 overall Vote Subsystem Runtime Comment 0 reexec 0m 11s Docker mode activated. +1 @author 0m 0s The patch does not contain any @author tags. +1 test4tests 0m 0s The patch appears to include 1 new or modified test files. +1 mvninstall 6m 59s trunk passed +1 compile 0m 29s trunk passed with JDK v1.8.0_77 +1 compile 0m 28s trunk passed with JDK v1.7.0_95 +1 checkstyle 0m 19s trunk passed +1 mvnsite 0m 34s trunk passed +1 mvneclipse 0m 14s trunk passed +1 findbugs 1m 6s trunk passed +1 javadoc 0m 22s trunk passed with JDK v1.8.0_77 +1 javadoc 0m 25s trunk passed with JDK v1.7.0_95 +1 mvninstall 0m 30s the patch passed +1 compile 0m 24s the patch passed with JDK v1.8.0_77 +1 javac 0m 24s the patch passed +1 compile 0m 27s the patch passed with JDK v1.7.0_95 +1 javac 0m 27s the patch passed -1 checkstyle 0m 16s hadoop-yarn-project/hadoop-yarn/hadoop-yarn-server/hadoop-yarn-server-resourcemanager: patch generated 1 new + 62 unchanged - 0 fixed = 63 total (was 62) +1 mvnsite 0m 33s the patch passed +1 mvneclipse 0m 12s the patch passed +1 whitespace 0m 0s Patch has no whitespace issues. +1 findbugs 1m 17s the patch passed +1 javadoc 0m 19s the patch passed with JDK v1.8.0_77 +1 javadoc 0m 24s the patch passed with JDK v1.7.0_95 -1 unit 67m 56s hadoop-yarn-server-resourcemanager in the patch failed with JDK v1.8.0_77. -1 unit 50m 39s hadoop-yarn-server-resourcemanager in the patch failed with JDK v1.7.0_95. +1 asflicense 0m 18s Patch does not generate ASF License warnings. 135m 21s Reason Tests JDK v1.8.0_77 Failed junit tests hadoop.yarn.server.resourcemanager.TestAMAuthorization   hadoop.yarn.server.resourcemanager.webapp.TestRMWebServicesDelegationTokens   hadoop.yarn.server.resourcemanager.webapp.TestRMWebServicesApps   hadoop.yarn.webapp.TestRMWithCSRFFilter   hadoop.yarn.server.resourcemanager.webapp.TestRMWebServices   hadoop.yarn.server.resourcemanager.TestClientRMTokens   hadoop.yarn.server.resourcemanager.webapp.TestRMWebServicesReservation JDK v1.8.0_77 Timed out junit tests org.apache.hadoop.yarn.server.resourcemanager.webapp.TestRMWebServicesNodes JDK v1.7.0_95 Failed junit tests hadoop.yarn.server.resourcemanager.scheduler.capacity.TestNodeLabelContainerAllocation   hadoop.yarn.server.resourcemanager.TestAMAuthorization   hadoop.yarn.server.resourcemanager.webapp.TestRMWebServicesAppsModification   hadoop.yarn.server.resourcemanager.webapp.TestRMWebServicesDelegationTokens   hadoop.yarn.server.resourcemanager.webapp.TestRMWebServicesCapacitySched   hadoop.yarn.server.resourcemanager.webapp.TestRMWebServicesFairScheduler   hadoop.yarn.server.resourcemanager.webapp.TestRMWebServicesNodeLabels   hadoop.yarn.server.resourcemanager.webapp.TestRMWebServicesForCSWithPartitions   hadoop.yarn.server.resourcemanager.webapp.TestRMWebServicesApps   hadoop.yarn.webapp.TestRMWithCSRFFilter   hadoop.yarn.server.resourcemanager.webapp.TestRMWebServices   hadoop.yarn.server.resourcemanager.webapp.TestRMWebServicesNodes   hadoop.yarn.server.resourcemanager.TestClientRMTokens   hadoop.yarn.server.resourcemanager.webapp.TestRMWebServicesReservation Subsystem Report/Notes Docker Image:yetus/hadoop:fbe3e86 JIRA Patch URL https://issues.apache.org/jira/secure/attachment/12798235/YARN-4940.01.patch JIRA Issue YARN-4940 Optional Tests asflicense compile javac javadoc mvninstall mvnsite unit findbugs checkstyle uname Linux d7d081401830 3.13.0-36-lowlatency #63-Ubuntu SMP PREEMPT Wed Sep 3 21:56:12 UTC 2014 x86_64 x86_64 x86_64 GNU/Linux Build tool maven Personality /testptch/hadoop/patchprocess/precommit/personality/provided.sh git revision trunk / 209303b Default Java 1.7.0_95 Multi-JDK versions /usr/lib/jvm/java-8-oracle:1.8.0_77 /usr/lib/jvm/java-7-openjdk-amd64:1.7.0_95 findbugs v3.0.0 checkstyle https://builds.apache.org/job/PreCommit-YARN-Build/11046/artifact/patchprocess/diff-checkstyle-hadoop-yarn-project_hadoop-yarn_hadoop-yarn-server_hadoop-yarn-server-resourcemanager.txt unit https://builds.apache.org/job/PreCommit-YARN-Build/11046/artifact/patchprocess/patch-unit-hadoop-yarn-project_hadoop-yarn_hadoop-yarn-server_hadoop-yarn-server-resourcemanager-jdk1.8.0_77.txt unit https://builds.apache.org/job/PreCommit-YARN-Build/11046/artifact/patchprocess/patch-unit-hadoop-yarn-project_hadoop-yarn_hadoop-yarn-server_hadoop-yarn-server-resourcemanager-jdk1.7.0_95.txt unit test logs https://builds.apache.org/job/PreCommit-YARN-Build/11046/artifact/patchprocess/patch-unit-hadoop-yarn-project_hadoop-yarn_hadoop-yarn-server_hadoop-yarn-server-resourcemanager-jdk1.8.0_77.txt https://builds.apache.org/job/PreCommit-YARN-Build/11046/artifact/patchprocess/patch-unit-hadoop-yarn-project_hadoop-yarn_hadoop-yarn-server_hadoop-yarn-server-resourcemanager-jdk1.7.0_95.txt JDK v1.7.0_95 Test Results https://builds.apache.org/job/PreCommit-YARN-Build/11046/testReport/ modules C: hadoop-yarn-project/hadoop-yarn/hadoop-yarn-server/hadoop-yarn-server-resourcemanager U: hadoop-yarn-project/hadoop-yarn/hadoop-yarn-server/hadoop-yarn-server-resourcemanager Console output https://builds.apache.org/job/PreCommit-YARN-Build/11046/console Powered by Apache Yetus 0.2.0 http://yetus.apache.org This message was automatically generated.
          Hide
          sandflee sandflee added a comment -

          rather than converting UnknownNodeId , using NodeId seems more simple and reasonable. cc Jason Lowe Kuhu Shukla

          Show
          sandflee sandflee added a comment - rather than converting UnknownNodeId , using NodeId seems more simple and reasonable. cc Jason Lowe Kuhu Shukla
          Hide
          sandflee sandflee added a comment -

          seems not, they are all caused by YARN-3102

          Show
          sandflee sandflee added a comment - seems not, they are all caused by YARN-3102
          Hide
          bibinchundatt Bibin A Chundatt added a comment -

          Same as YARN-4723??

          Show
          bibinchundatt Bibin A Chundatt added a comment - Same as YARN-4723 ??

            People

            • Assignee:
              sandflee sandflee
              Reporter:
              sandflee sandflee
            • Votes:
              0 Vote for this issue
              Watchers:
              13 Start watching this issue

              Dates

              • Created:
                Updated:
                Resolved:

                Development