Details

    • Hadoop Flags:
      Reviewed

      Description

      These tests often fails with

      testAppRunningKill[0](org.apache.hadoop.yarn.server.resourcemanager.rmapp.TestRMAppTransitions)  Time elapsed: 0.042 sec  <<< FAILURE!
      java.lang.AssertionError: application finish time is not greater then 0
      	at org.junit.Assert.fail(Assert.java:88)
      	at org.junit.Assert.assertTrue(Assert.java:41)
      	at org.apache.hadoop.yarn.server.resourcemanager.rmapp.TestRMAppTransitions.assertTimesAtFinish(TestRMAppTransitions.java:321)
      	at org.apache.hadoop.yarn.server.resourcemanager.rmapp.TestRMAppTransitions.assertKilled(TestRMAppTransitions.java:338)
      	at org.apache.hadoop.yarn.server.resourcemanager.rmapp.TestRMAppTransitions.testAppRunningKill(TestRMAppTransitions.java:760)
      
      testAppKilledKilled[0](org.apache.hadoop.yarn.server.resourcemanager.rmapp.TestRMAppTransitions)  Time elapsed: 0.04 sec  <<< FAILURE!
      java.lang.AssertionError: application finish time is not greater then 0
      	at org.junit.Assert.fail(Assert.java:88)
      	at org.junit.Assert.assertTrue(Assert.java:41)
      	at org.apache.hadoop.yarn.server.resourcemanager.rmapp.TestRMAppTransitions.assertTimesAtFinish(TestRMAppTransitions.java:321)
      	at org.apache.hadoop.yarn.server.resourcemanager.rmapp.TestRMAppTransitions.testAppKilledKilled(TestRMAppTransitions.java:925)
      
      1. YARN-4573.1.patch
        9 kB
        Takashi Ohnishi
      2. YARN-4573.2.patch
        3 kB
        Takashi Ohnishi

        Activity

        Hide
        bwtakacy Takashi Ohnishi added a comment -

        These failure are caused because the test does not wait the events are handled which update application finish time from 0 to the actual value.

        I will attach a patch.

        Show
        bwtakacy Takashi Ohnishi added a comment - These failure are caused because the test does not wait the events are handled which update application finish time from 0 to the actual value. I will attach a patch.
        Hide
        bwtakacy Takashi Ohnishi added a comment -

        Attached a patch including some typo fix and removal of whitespace.

        Show
        bwtakacy Takashi Ohnishi added a comment - Attached a patch including some typo fix and removal of whitespace.
        Hide
        hadoopqa Hadoop QA added a comment -
        -1 overall



        Vote Subsystem Runtime Comment
        0 reexec 0m 0s Docker mode activated.
        +1 @author 0m 0s The patch does not contain any @author tags.
        +1 test4tests 0m 0s The patch appears to include 1 new or modified test files.
        +1 mvninstall 7m 46s trunk passed
        +1 compile 0m 26s trunk passed with JDK v1.8.0_66
        +1 compile 0m 30s trunk passed with JDK v1.7.0_91
        +1 checkstyle 0m 13s trunk passed
        +1 mvnsite 0m 37s trunk passed
        +1 mvneclipse 0m 15s trunk passed
        +1 findbugs 1m 11s trunk passed
        -1 javadoc 0m 21s hadoop-yarn-server-resourcemanager in trunk failed with JDK v1.8.0_66.
        +1 javadoc 0m 26s trunk passed with JDK v1.7.0_91
        +1 mvninstall 0m 31s the patch passed
        +1 compile 0m 23s the patch passed with JDK v1.8.0_66
        +1 javac 0m 23s the patch passed
        +1 compile 0m 26s the patch passed with JDK v1.7.0_91
        +1 javac 0m 26s the patch passed
        +1 checkstyle 0m 12s the patch passed
        +1 mvnsite 0m 33s the patch passed
        +1 mvneclipse 0m 12s the patch passed
        +1 whitespace 0m 0s Patch has no whitespace issues.
        +1 findbugs 1m 14s the patch passed
        -1 javadoc 0m 18s hadoop-yarn-server-resourcemanager in the patch failed with JDK v1.8.0_66.
        +1 javadoc 0m 23s the patch passed with JDK v1.7.0_91
        -1 unit 65m 12s hadoop-yarn-server-resourcemanager in the patch failed with JDK v1.8.0_66.
        -1 unit 65m 31s hadoop-yarn-server-resourcemanager in the patch failed with JDK v1.7.0_91.
        +1 asflicense 0m 17s Patch does not generate ASF License warnings.
        148m 8s



        Reason Tests
        JDK v1.8.0_66 Failed junit tests hadoop.yarn.server.resourcemanager.TestClientRMTokens
          hadoop.yarn.server.resourcemanager.TestAMAuthorization
        JDK v1.7.0_91 Failed junit tests hadoop.yarn.server.resourcemanager.TestClientRMTokens
          hadoop.yarn.server.resourcemanager.TestAMAuthorization



        Subsystem Report/Notes
        Docker Image:yetus/hadoop:0ca8df7
        JIRA Patch URL https://issues.apache.org/jira/secure/attachment/12781395/YARN-4573.1.patch
        JIRA Issue YARN-4573
        Optional Tests asflicense compile javac javadoc mvninstall mvnsite unit findbugs checkstyle
        uname Linux 939fdb37b3c0 3.13.0-36-lowlatency #63-Ubuntu SMP PREEMPT Wed Sep 3 21:56:12 UTC 2014 x86_64 x86_64 x86_64 GNU/Linux
        Build tool maven
        Personality /testptch/hadoop/patchprocess/precommit/personality/provided.sh
        git revision trunk / d7ed047
        Default Java 1.7.0_91
        Multi-JDK versions /usr/lib/jvm/java-8-oracle:1.8.0_66 /usr/lib/jvm/java-7-openjdk-amd64:1.7.0_91
        findbugs v3.0.0
        javadoc https://builds.apache.org/job/PreCommit-YARN-Build/10219/artifact/patchprocess/branch-javadoc-hadoop-yarn-project_hadoop-yarn_hadoop-yarn-server_hadoop-yarn-server-resourcemanager-jdk1.8.0_66.txt
        javadoc https://builds.apache.org/job/PreCommit-YARN-Build/10219/artifact/patchprocess/patch-javadoc-hadoop-yarn-project_hadoop-yarn_hadoop-yarn-server_hadoop-yarn-server-resourcemanager-jdk1.8.0_66.txt
        unit https://builds.apache.org/job/PreCommit-YARN-Build/10219/artifact/patchprocess/patch-unit-hadoop-yarn-project_hadoop-yarn_hadoop-yarn-server_hadoop-yarn-server-resourcemanager-jdk1.8.0_66.txt
        unit https://builds.apache.org/job/PreCommit-YARN-Build/10219/artifact/patchprocess/patch-unit-hadoop-yarn-project_hadoop-yarn_hadoop-yarn-server_hadoop-yarn-server-resourcemanager-jdk1.7.0_91.txt
        unit test logs https://builds.apache.org/job/PreCommit-YARN-Build/10219/artifact/patchprocess/patch-unit-hadoop-yarn-project_hadoop-yarn_hadoop-yarn-server_hadoop-yarn-server-resourcemanager-jdk1.8.0_66.txt https://builds.apache.org/job/PreCommit-YARN-Build/10219/artifact/patchprocess/patch-unit-hadoop-yarn-project_hadoop-yarn_hadoop-yarn-server_hadoop-yarn-server-resourcemanager-jdk1.7.0_91.txt
        JDK v1.7.0_91 Test Results https://builds.apache.org/job/PreCommit-YARN-Build/10219/testReport/
        modules C: hadoop-yarn-project/hadoop-yarn/hadoop-yarn-server/hadoop-yarn-server-resourcemanager U: hadoop-yarn-project/hadoop-yarn/hadoop-yarn-server/hadoop-yarn-server-resourcemanager
        Max memory used 75MB
        Powered by Apache Yetus 0.2.0-SNAPSHOT http://yetus.apache.org
        Console output https://builds.apache.org/job/PreCommit-YARN-Build/10219/console

        This message was automatically generated.

        Show
        hadoopqa Hadoop QA added a comment - -1 overall Vote Subsystem Runtime Comment 0 reexec 0m 0s Docker mode activated. +1 @author 0m 0s The patch does not contain any @author tags. +1 test4tests 0m 0s The patch appears to include 1 new or modified test files. +1 mvninstall 7m 46s trunk passed +1 compile 0m 26s trunk passed with JDK v1.8.0_66 +1 compile 0m 30s trunk passed with JDK v1.7.0_91 +1 checkstyle 0m 13s trunk passed +1 mvnsite 0m 37s trunk passed +1 mvneclipse 0m 15s trunk passed +1 findbugs 1m 11s trunk passed -1 javadoc 0m 21s hadoop-yarn-server-resourcemanager in trunk failed with JDK v1.8.0_66. +1 javadoc 0m 26s trunk passed with JDK v1.7.0_91 +1 mvninstall 0m 31s the patch passed +1 compile 0m 23s the patch passed with JDK v1.8.0_66 +1 javac 0m 23s the patch passed +1 compile 0m 26s the patch passed with JDK v1.7.0_91 +1 javac 0m 26s the patch passed +1 checkstyle 0m 12s the patch passed +1 mvnsite 0m 33s the patch passed +1 mvneclipse 0m 12s the patch passed +1 whitespace 0m 0s Patch has no whitespace issues. +1 findbugs 1m 14s the patch passed -1 javadoc 0m 18s hadoop-yarn-server-resourcemanager in the patch failed with JDK v1.8.0_66. +1 javadoc 0m 23s the patch passed with JDK v1.7.0_91 -1 unit 65m 12s hadoop-yarn-server-resourcemanager in the patch failed with JDK v1.8.0_66. -1 unit 65m 31s hadoop-yarn-server-resourcemanager in the patch failed with JDK v1.7.0_91. +1 asflicense 0m 17s Patch does not generate ASF License warnings. 148m 8s Reason Tests JDK v1.8.0_66 Failed junit tests hadoop.yarn.server.resourcemanager.TestClientRMTokens   hadoop.yarn.server.resourcemanager.TestAMAuthorization JDK v1.7.0_91 Failed junit tests hadoop.yarn.server.resourcemanager.TestClientRMTokens   hadoop.yarn.server.resourcemanager.TestAMAuthorization Subsystem Report/Notes Docker Image:yetus/hadoop:0ca8df7 JIRA Patch URL https://issues.apache.org/jira/secure/attachment/12781395/YARN-4573.1.patch JIRA Issue YARN-4573 Optional Tests asflicense compile javac javadoc mvninstall mvnsite unit findbugs checkstyle uname Linux 939fdb37b3c0 3.13.0-36-lowlatency #63-Ubuntu SMP PREEMPT Wed Sep 3 21:56:12 UTC 2014 x86_64 x86_64 x86_64 GNU/Linux Build tool maven Personality /testptch/hadoop/patchprocess/precommit/personality/provided.sh git revision trunk / d7ed047 Default Java 1.7.0_91 Multi-JDK versions /usr/lib/jvm/java-8-oracle:1.8.0_66 /usr/lib/jvm/java-7-openjdk-amd64:1.7.0_91 findbugs v3.0.0 javadoc https://builds.apache.org/job/PreCommit-YARN-Build/10219/artifact/patchprocess/branch-javadoc-hadoop-yarn-project_hadoop-yarn_hadoop-yarn-server_hadoop-yarn-server-resourcemanager-jdk1.8.0_66.txt javadoc https://builds.apache.org/job/PreCommit-YARN-Build/10219/artifact/patchprocess/patch-javadoc-hadoop-yarn-project_hadoop-yarn_hadoop-yarn-server_hadoop-yarn-server-resourcemanager-jdk1.8.0_66.txt unit https://builds.apache.org/job/PreCommit-YARN-Build/10219/artifact/patchprocess/patch-unit-hadoop-yarn-project_hadoop-yarn_hadoop-yarn-server_hadoop-yarn-server-resourcemanager-jdk1.8.0_66.txt unit https://builds.apache.org/job/PreCommit-YARN-Build/10219/artifact/patchprocess/patch-unit-hadoop-yarn-project_hadoop-yarn_hadoop-yarn-server_hadoop-yarn-server-resourcemanager-jdk1.7.0_91.txt unit test logs https://builds.apache.org/job/PreCommit-YARN-Build/10219/artifact/patchprocess/patch-unit-hadoop-yarn-project_hadoop-yarn_hadoop-yarn-server_hadoop-yarn-server-resourcemanager-jdk1.8.0_66.txt https://builds.apache.org/job/PreCommit-YARN-Build/10219/artifact/patchprocess/patch-unit-hadoop-yarn-project_hadoop-yarn_hadoop-yarn-server_hadoop-yarn-server-resourcemanager-jdk1.7.0_91.txt JDK v1.7.0_91 Test Results https://builds.apache.org/job/PreCommit-YARN-Build/10219/testReport/ modules C: hadoop-yarn-project/hadoop-yarn/hadoop-yarn-server/hadoop-yarn-server-resourcemanager U: hadoop-yarn-project/hadoop-yarn/hadoop-yarn-server/hadoop-yarn-server-resourcemanager Max memory used 75MB Powered by Apache Yetus 0.2.0-SNAPSHOT http://yetus.apache.org Console output https://builds.apache.org/job/PreCommit-YARN-Build/10219/console This message was automatically generated.
        Hide
        rohithsharma Rohith Sharma K S added a comment -

        Takashi Ohnishi the patch appears to be formatted all the lines, would you update the patch with only changed lines

        Show
        rohithsharma Rohith Sharma K S added a comment - Takashi Ohnishi the patch appears to be formatted all the lines, would you update the patch with only changed lines
        Hide
        bwtakacy Takashi Ohnishi added a comment -

        Thank you, Rohith Sharma K S for commenting!
        The patch includes typo fixes, like 'not greater then' to 'not greater than', and removal of trailing white spaces.

        Is it better to divide the patch?

        Show
        bwtakacy Takashi Ohnishi added a comment - Thank you, Rohith Sharma K S for commenting! The patch includes typo fixes, like 'not greater then' to 'not greater than', and removal of trailing white spaces. Is it better to divide the patch?
        Hide
        rohithsharma Rohith Sharma K S added a comment -

        typos fix can be done in this patch itself, but I see few places changes would not be required at all, for example

             RMAppEvent event = 		
        673	          new RMAppFailedAttemptEvent(application.getApplicationId(), 
        

        May be you can check your eclipse formatter!!

        Show
        rohithsharma Rohith Sharma K S added a comment - typos fix can be done in this patch itself, but I see few places changes would not be required at all, for example RMAppEvent event = 673 new RMAppFailedAttemptEvent(application.getApplicationId(), May be you can check your eclipse formatter!!
        Hide
        bwtakacy Takashi Ohnishi added a comment -

        Oops!

        Sorry for that.

        I will attach the updated patch.

        Show
        bwtakacy Takashi Ohnishi added a comment - Oops! Sorry for that. I will attach the updated patch.
        Hide
        rohithsharma Rohith Sharma K S added a comment -

        +1, pending jenkins

        Show
        rohithsharma Rohith Sharma K S added a comment - +1, pending jenkins
        Hide
        hadoopqa Hadoop QA added a comment -
        -1 overall



        Vote Subsystem Runtime Comment
        0 reexec 0m 0s Docker mode activated.
        +1 @author 0m 0s The patch does not contain any @author tags.
        +1 test4tests 0m 0s The patch appears to include 1 new or modified test files.
        +1 mvninstall 8m 39s trunk passed
        +1 compile 0m 32s trunk passed with JDK v1.8.0_66
        +1 compile 0m 33s trunk passed with JDK v1.7.0_91
        +1 checkstyle 0m 14s trunk passed
        +1 mvnsite 0m 42s trunk passed
        +1 mvneclipse 0m 16s trunk passed
        +1 findbugs 1m 18s trunk passed
        +1 javadoc 0m 25s trunk passed with JDK v1.8.0_66
        +1 javadoc 0m 30s trunk passed with JDK v1.7.0_91
        +1 mvninstall 0m 34s the patch passed
        +1 compile 0m 30s the patch passed with JDK v1.8.0_66
        +1 javac 0m 30s the patch passed
        +1 compile 0m 31s the patch passed with JDK v1.7.0_91
        +1 javac 0m 31s the patch passed
        +1 checkstyle 0m 13s the patch passed
        +1 mvnsite 0m 38s the patch passed
        +1 mvneclipse 0m 13s the patch passed
        -1 whitespace 0m 0s The patch has 2 line(s) that end in whitespace. Use git apply --whitespace=fix.
        +1 findbugs 1m 32s the patch passed
        +1 javadoc 0m 22s the patch passed with JDK v1.8.0_66
        +1 javadoc 0m 29s the patch passed with JDK v1.7.0_91
        -1 unit 68m 23s hadoop-yarn-server-resourcemanager in the patch failed with JDK v1.8.0_66.
        -1 unit 67m 17s hadoop-yarn-server-resourcemanager in the patch failed with JDK v1.7.0_91.
        +1 asflicense 0m 17s Patch does not generate ASF License warnings.
        155m 19s



        Reason Tests
        JDK v1.8.0_66 Failed junit tests hadoop.yarn.server.resourcemanager.TestClientRMTokens
          hadoop.yarn.server.resourcemanager.TestRMRestart
          hadoop.yarn.server.resourcemanager.TestAMAuthorization
        JDK v1.7.0_91 Failed junit tests hadoop.yarn.server.resourcemanager.TestClientRMTokens
          hadoop.yarn.server.resourcemanager.TestAMAuthorization
          hadoop.yarn.server.resourcemanager.scheduler.fifo.TestFifoScheduler



        Subsystem Report/Notes
        Docker Image:yetus/hadoop:0ca8df7
        JIRA Patch URL https://issues.apache.org/jira/secure/attachment/12784096/YARN-4573.2.patch
        JIRA Issue YARN-4573
        Optional Tests asflicense compile javac javadoc mvninstall mvnsite unit findbugs checkstyle
        uname Linux 007c672436d1 3.13.0-36-lowlatency #63-Ubuntu SMP PREEMPT Wed Sep 3 21:56:12 UTC 2014 x86_64 x86_64 x86_64 GNU/Linux
        Build tool maven
        Personality /testptch/hadoop/patchprocess/precommit/personality/provided.sh
        git revision trunk / 736eb17
        Default Java 1.7.0_91
        Multi-JDK versions /usr/lib/jvm/java-8-oracle:1.8.0_66 /usr/lib/jvm/java-7-openjdk-amd64:1.7.0_91
        findbugs v3.0.0
        whitespace https://builds.apache.org/job/PreCommit-YARN-Build/10377/artifact/patchprocess/whitespace-eol.txt
        unit https://builds.apache.org/job/PreCommit-YARN-Build/10377/artifact/patchprocess/patch-unit-hadoop-yarn-project_hadoop-yarn_hadoop-yarn-server_hadoop-yarn-server-resourcemanager-jdk1.8.0_66.txt
        unit https://builds.apache.org/job/PreCommit-YARN-Build/10377/artifact/patchprocess/patch-unit-hadoop-yarn-project_hadoop-yarn_hadoop-yarn-server_hadoop-yarn-server-resourcemanager-jdk1.7.0_91.txt
        unit test logs https://builds.apache.org/job/PreCommit-YARN-Build/10377/artifact/patchprocess/patch-unit-hadoop-yarn-project_hadoop-yarn_hadoop-yarn-server_hadoop-yarn-server-resourcemanager-jdk1.8.0_66.txt https://builds.apache.org/job/PreCommit-YARN-Build/10377/artifact/patchprocess/patch-unit-hadoop-yarn-project_hadoop-yarn_hadoop-yarn-server_hadoop-yarn-server-resourcemanager-jdk1.7.0_91.txt
        JDK v1.7.0_91 Test Results https://builds.apache.org/job/PreCommit-YARN-Build/10377/testReport/
        modules C: hadoop-yarn-project/hadoop-yarn/hadoop-yarn-server/hadoop-yarn-server-resourcemanager U: hadoop-yarn-project/hadoop-yarn/hadoop-yarn-server/hadoop-yarn-server-resourcemanager
        Max memory used 76MB
        Powered by Apache Yetus 0.2.0-SNAPSHOT http://yetus.apache.org
        Console output https://builds.apache.org/job/PreCommit-YARN-Build/10377/console

        This message was automatically generated.

        Show
        hadoopqa Hadoop QA added a comment - -1 overall Vote Subsystem Runtime Comment 0 reexec 0m 0s Docker mode activated. +1 @author 0m 0s The patch does not contain any @author tags. +1 test4tests 0m 0s The patch appears to include 1 new or modified test files. +1 mvninstall 8m 39s trunk passed +1 compile 0m 32s trunk passed with JDK v1.8.0_66 +1 compile 0m 33s trunk passed with JDK v1.7.0_91 +1 checkstyle 0m 14s trunk passed +1 mvnsite 0m 42s trunk passed +1 mvneclipse 0m 16s trunk passed +1 findbugs 1m 18s trunk passed +1 javadoc 0m 25s trunk passed with JDK v1.8.0_66 +1 javadoc 0m 30s trunk passed with JDK v1.7.0_91 +1 mvninstall 0m 34s the patch passed +1 compile 0m 30s the patch passed with JDK v1.8.0_66 +1 javac 0m 30s the patch passed +1 compile 0m 31s the patch passed with JDK v1.7.0_91 +1 javac 0m 31s the patch passed +1 checkstyle 0m 13s the patch passed +1 mvnsite 0m 38s the patch passed +1 mvneclipse 0m 13s the patch passed -1 whitespace 0m 0s The patch has 2 line(s) that end in whitespace. Use git apply --whitespace=fix. +1 findbugs 1m 32s the patch passed +1 javadoc 0m 22s the patch passed with JDK v1.8.0_66 +1 javadoc 0m 29s the patch passed with JDK v1.7.0_91 -1 unit 68m 23s hadoop-yarn-server-resourcemanager in the patch failed with JDK v1.8.0_66. -1 unit 67m 17s hadoop-yarn-server-resourcemanager in the patch failed with JDK v1.7.0_91. +1 asflicense 0m 17s Patch does not generate ASF License warnings. 155m 19s Reason Tests JDK v1.8.0_66 Failed junit tests hadoop.yarn.server.resourcemanager.TestClientRMTokens   hadoop.yarn.server.resourcemanager.TestRMRestart   hadoop.yarn.server.resourcemanager.TestAMAuthorization JDK v1.7.0_91 Failed junit tests hadoop.yarn.server.resourcemanager.TestClientRMTokens   hadoop.yarn.server.resourcemanager.TestAMAuthorization   hadoop.yarn.server.resourcemanager.scheduler.fifo.TestFifoScheduler Subsystem Report/Notes Docker Image:yetus/hadoop:0ca8df7 JIRA Patch URL https://issues.apache.org/jira/secure/attachment/12784096/YARN-4573.2.patch JIRA Issue YARN-4573 Optional Tests asflicense compile javac javadoc mvninstall mvnsite unit findbugs checkstyle uname Linux 007c672436d1 3.13.0-36-lowlatency #63-Ubuntu SMP PREEMPT Wed Sep 3 21:56:12 UTC 2014 x86_64 x86_64 x86_64 GNU/Linux Build tool maven Personality /testptch/hadoop/patchprocess/precommit/personality/provided.sh git revision trunk / 736eb17 Default Java 1.7.0_91 Multi-JDK versions /usr/lib/jvm/java-8-oracle:1.8.0_66 /usr/lib/jvm/java-7-openjdk-amd64:1.7.0_91 findbugs v3.0.0 whitespace https://builds.apache.org/job/PreCommit-YARN-Build/10377/artifact/patchprocess/whitespace-eol.txt unit https://builds.apache.org/job/PreCommit-YARN-Build/10377/artifact/patchprocess/patch-unit-hadoop-yarn-project_hadoop-yarn_hadoop-yarn-server_hadoop-yarn-server-resourcemanager-jdk1.8.0_66.txt unit https://builds.apache.org/job/PreCommit-YARN-Build/10377/artifact/patchprocess/patch-unit-hadoop-yarn-project_hadoop-yarn_hadoop-yarn-server_hadoop-yarn-server-resourcemanager-jdk1.7.0_91.txt unit test logs https://builds.apache.org/job/PreCommit-YARN-Build/10377/artifact/patchprocess/patch-unit-hadoop-yarn-project_hadoop-yarn_hadoop-yarn-server_hadoop-yarn-server-resourcemanager-jdk1.8.0_66.txt https://builds.apache.org/job/PreCommit-YARN-Build/10377/artifact/patchprocess/patch-unit-hadoop-yarn-project_hadoop-yarn_hadoop-yarn-server_hadoop-yarn-server-resourcemanager-jdk1.7.0_91.txt JDK v1.7.0_91 Test Results https://builds.apache.org/job/PreCommit-YARN-Build/10377/testReport/ modules C: hadoop-yarn-project/hadoop-yarn/hadoop-yarn-server/hadoop-yarn-server-resourcemanager U: hadoop-yarn-project/hadoop-yarn/hadoop-yarn-server/hadoop-yarn-server-resourcemanager Max memory used 76MB Powered by Apache Yetus 0.2.0-SNAPSHOT http://yetus.apache.org Console output https://builds.apache.org/job/PreCommit-YARN-Build/10377/console This message was automatically generated.
        Hide
        rohithsharma Rohith Sharma K S added a comment -

        +1, committed to trunk/branch-2. thanks Takashi Ohnishi for the patch!!

        Show
        rohithsharma Rohith Sharma K S added a comment - +1, committed to trunk/branch-2. thanks Takashi Ohnishi for the patch!!
        Hide
        bwtakacy Takashi Ohnishi added a comment -

        Thank you, Rohith Sharma K S for committing

        Show
        bwtakacy Takashi Ohnishi added a comment - Thank you, Rohith Sharma K S for committing
        Hide
        hudson Hudson added a comment -

        SUCCESS: Integrated in Hadoop-trunk-Commit #9190 (See https://builds.apache.org/job/Hadoop-trunk-Commit/9190/)
        YARN-4573. Fix test failure in TestRMAppTransitions#testAppRunningKill (rohithsharmaks: rev c01bee010832ca31d8e60e5461181cdf05140602)

        • hadoop-yarn-project/CHANGES.txt
        • hadoop-yarn-project/hadoop-yarn/hadoop-yarn-server/hadoop-yarn-server-resourcemanager/src/test/java/org/apache/hadoop/yarn/server/resourcemanager/rmapp/TestRMAppTransitions.java
        Show
        hudson Hudson added a comment - SUCCESS: Integrated in Hadoop-trunk-Commit #9190 (See https://builds.apache.org/job/Hadoop-trunk-Commit/9190/ ) YARN-4573 . Fix test failure in TestRMAppTransitions#testAppRunningKill (rohithsharmaks: rev c01bee010832ca31d8e60e5461181cdf05140602) hadoop-yarn-project/CHANGES.txt hadoop-yarn-project/hadoop-yarn/hadoop-yarn-server/hadoop-yarn-server-resourcemanager/src/test/java/org/apache/hadoop/yarn/server/resourcemanager/rmapp/TestRMAppTransitions.java
        Hide
        jlowe Jason Lowe added a comment -

        Thanks, Takashi Ohnishi! I committed this to branch-2.8, branch-2.7, and branch-2.6 as well.

        Show
        jlowe Jason Lowe added a comment - Thanks, Takashi Ohnishi ! I committed this to branch-2.8, branch-2.7, and branch-2.6 as well.

          People

          • Assignee:
            bwtakacy Takashi Ohnishi
            Reporter:
            bwtakacy Takashi Ohnishi
          • Votes:
            0 Vote for this issue
            Watchers:
            7 Start watching this issue

            Dates

            • Created:
              Updated:
              Resolved:

              Development