Details

    • Target Version/s:
    • Hadoop Flags:
      Reviewed

      Description

      YARN-313 add CLI to update node resource. It works fine for batch mode update. However, for single node update "yarn rmadmin -updateNodeResource" failed to work because resource is not set properly in sending request.

      1. YARN-4345.patch
        3 kB
        Junping Du
      2. YARN-4345-v2.patch
        3 kB
        Junping Du
      3. YARN-4345-v3.patch
        5 kB
        Junping Du

        Activity

        Hide
        djp Junping Du added a comment -

        The problem is quite straight-forward. Update a quick patch to fix it.

        Show
        djp Junping Du added a comment - The problem is quite straight-forward. Update a quick patch to fix it.
        Hide
        hadoopqa Hadoop QA added a comment -
        -1 overall



        Vote Subsystem Runtime Comment
        0 reexec 0m 5s docker + precommit patch detected.
        +1 @author 0m 0s The patch does not contain any @author tags.
        +1 test4tests 0m 0s The patch appears to include 1 new or modified test files.
        -1 mvninstall 1m 39s root in trunk failed.
        +1 compile 0m 11s trunk passed with JDK v1.8.0_60
        +1 compile 0m 14s trunk passed with JDK v1.7.0_79
        +1 checkstyle 0m 8s trunk passed
        +1 mvneclipse 0m 11s trunk passed
        +1 findbugs 0m 30s trunk passed
        +1 javadoc 0m 12s trunk passed with JDK v1.8.0_60
        +1 javadoc 0m 14s trunk passed with JDK v1.7.0_79
        +1 mvninstall 0m 16s the patch passed
        +1 compile 0m 11s the patch passed with JDK v1.8.0_60
        +1 javac 0m 11s the patch passed
        +1 compile 0m 13s the patch passed with JDK v1.7.0_79
        +1 javac 0m 13s the patch passed
        +1 checkstyle 0m 8s the patch passed
        +1 mvneclipse 0m 10s the patch passed
        +1 whitespace 0m 0s Patch has no whitespace issues.
        +1 findbugs 0m 39s the patch passed
        +1 javadoc 0m 12s the patch passed with JDK v1.8.0_60
        +1 javadoc 0m 14s the patch passed with JDK v1.7.0_79
        -1 unit 49m 36s hadoop-yarn-client in the patch failed with JDK v1.8.0_60.
        -1 unit 50m 39s hadoop-yarn-client in the patch failed with JDK v1.7.0_79.
        +1 asflicense 0m 27s Patch does not generate ASF License warnings.
        106m 58s



        Reason Tests
        JDK v1.8.0_60 Failed junit tests hadoop.yarn.client.TestGetGroups
        JDK v1.8.0_60 Timed out junit tests org.apache.hadoop.yarn.client.api.impl.TestAMRMClient
          org.apache.hadoop.yarn.client.api.impl.TestYarnClient
          org.apache.hadoop.yarn.client.api.impl.TestNMClient
        JDK v1.7.0_79 Failed junit tests hadoop.yarn.client.TestGetGroups
        JDK v1.7.0_79 Timed out junit tests org.apache.hadoop.yarn.client.api.impl.TestAMRMClient
          org.apache.hadoop.yarn.client.api.impl.TestYarnClient
          org.apache.hadoop.yarn.client.api.impl.TestNMClient



        Subsystem Report/Notes
        Docker Client=1.7.1 Server=1.7.1 Image:test-patch-base-hadoop-date2015-11-11
        JIRA Patch URL https://issues.apache.org/jira/secure/attachment/12771808/YARN-4345.patch
        JIRA Issue YARN-4345
        Optional Tests asflicense javac javadoc mvninstall unit findbugs checkstyle compile
        uname Linux a679cd61b8d0 3.13.0-36-lowlatency #63-Ubuntu SMP PREEMPT Wed Sep 3 21:56:12 UTC 2014 x86_64 x86_64 x86_64 GNU/Linux
        Build tool maven
        Personality /home/jenkins/jenkins-slave/workspace/PreCommit-YARN-Build/patchprocess/apache-yetus-ee5baeb/precommit/personality/hadoop.sh
        git revision trunk / df68eac
        Default Java 1.7.0_79
        Multi-JDK versions /usr/lib/jvm/java-8-oracle:1.8.0_60 /usr/lib/jvm/java-7-openjdk-amd64:1.7.0_79
        mvninstall https://builds.apache.org/job/PreCommit-YARN-Build/9659/artifact/patchprocess/branch-mvninstall-root.txt
        findbugs v3.0.0
        unit https://builds.apache.org/job/PreCommit-YARN-Build/9659/artifact/patchprocess/patch-unit-hadoop-yarn-project_hadoop-yarn_hadoop-yarn-client-jdk1.8.0_60.txt
        unit https://builds.apache.org/job/PreCommit-YARN-Build/9659/artifact/patchprocess/patch-unit-hadoop-yarn-project_hadoop-yarn_hadoop-yarn-client-jdk1.7.0_79.txt
        unit test logs https://builds.apache.org/job/PreCommit-YARN-Build/9659/artifact/patchprocess/patch-unit-hadoop-yarn-project_hadoop-yarn_hadoop-yarn-client-jdk1.8.0_60.txt https://builds.apache.org/job/PreCommit-YARN-Build/9659/artifact/patchprocess/patch-unit-hadoop-yarn-project_hadoop-yarn_hadoop-yarn-client-jdk1.7.0_79.txt
        JDK v1.7.0_79 Test Results https://builds.apache.org/job/PreCommit-YARN-Build/9659/testReport/
        modules C: hadoop-yarn-project/hadoop-yarn/hadoop-yarn-client U: hadoop-yarn-project/hadoop-yarn/hadoop-yarn-client
        Max memory used 67MB
        Powered by Apache Yetus http://yetus.apache.org
        Console output https://builds.apache.org/job/PreCommit-YARN-Build/9659/console

        This message was automatically generated.

        Show
        hadoopqa Hadoop QA added a comment - -1 overall Vote Subsystem Runtime Comment 0 reexec 0m 5s docker + precommit patch detected. +1 @author 0m 0s The patch does not contain any @author tags. +1 test4tests 0m 0s The patch appears to include 1 new or modified test files. -1 mvninstall 1m 39s root in trunk failed. +1 compile 0m 11s trunk passed with JDK v1.8.0_60 +1 compile 0m 14s trunk passed with JDK v1.7.0_79 +1 checkstyle 0m 8s trunk passed +1 mvneclipse 0m 11s trunk passed +1 findbugs 0m 30s trunk passed +1 javadoc 0m 12s trunk passed with JDK v1.8.0_60 +1 javadoc 0m 14s trunk passed with JDK v1.7.0_79 +1 mvninstall 0m 16s the patch passed +1 compile 0m 11s the patch passed with JDK v1.8.0_60 +1 javac 0m 11s the patch passed +1 compile 0m 13s the patch passed with JDK v1.7.0_79 +1 javac 0m 13s the patch passed +1 checkstyle 0m 8s the patch passed +1 mvneclipse 0m 10s the patch passed +1 whitespace 0m 0s Patch has no whitespace issues. +1 findbugs 0m 39s the patch passed +1 javadoc 0m 12s the patch passed with JDK v1.8.0_60 +1 javadoc 0m 14s the patch passed with JDK v1.7.0_79 -1 unit 49m 36s hadoop-yarn-client in the patch failed with JDK v1.8.0_60. -1 unit 50m 39s hadoop-yarn-client in the patch failed with JDK v1.7.0_79. +1 asflicense 0m 27s Patch does not generate ASF License warnings. 106m 58s Reason Tests JDK v1.8.0_60 Failed junit tests hadoop.yarn.client.TestGetGroups JDK v1.8.0_60 Timed out junit tests org.apache.hadoop.yarn.client.api.impl.TestAMRMClient   org.apache.hadoop.yarn.client.api.impl.TestYarnClient   org.apache.hadoop.yarn.client.api.impl.TestNMClient JDK v1.7.0_79 Failed junit tests hadoop.yarn.client.TestGetGroups JDK v1.7.0_79 Timed out junit tests org.apache.hadoop.yarn.client.api.impl.TestAMRMClient   org.apache.hadoop.yarn.client.api.impl.TestYarnClient   org.apache.hadoop.yarn.client.api.impl.TestNMClient Subsystem Report/Notes Docker Client=1.7.1 Server=1.7.1 Image:test-patch-base-hadoop-date2015-11-11 JIRA Patch URL https://issues.apache.org/jira/secure/attachment/12771808/YARN-4345.patch JIRA Issue YARN-4345 Optional Tests asflicense javac javadoc mvninstall unit findbugs checkstyle compile uname Linux a679cd61b8d0 3.13.0-36-lowlatency #63-Ubuntu SMP PREEMPT Wed Sep 3 21:56:12 UTC 2014 x86_64 x86_64 x86_64 GNU/Linux Build tool maven Personality /home/jenkins/jenkins-slave/workspace/PreCommit-YARN-Build/patchprocess/apache-yetus-ee5baeb/precommit/personality/hadoop.sh git revision trunk / df68eac Default Java 1.7.0_79 Multi-JDK versions /usr/lib/jvm/java-8-oracle:1.8.0_60 /usr/lib/jvm/java-7-openjdk-amd64:1.7.0_79 mvninstall https://builds.apache.org/job/PreCommit-YARN-Build/9659/artifact/patchprocess/branch-mvninstall-root.txt findbugs v3.0.0 unit https://builds.apache.org/job/PreCommit-YARN-Build/9659/artifact/patchprocess/patch-unit-hadoop-yarn-project_hadoop-yarn_hadoop-yarn-client-jdk1.8.0_60.txt unit https://builds.apache.org/job/PreCommit-YARN-Build/9659/artifact/patchprocess/patch-unit-hadoop-yarn-project_hadoop-yarn_hadoop-yarn-client-jdk1.7.0_79.txt unit test logs https://builds.apache.org/job/PreCommit-YARN-Build/9659/artifact/patchprocess/patch-unit-hadoop-yarn-project_hadoop-yarn_hadoop-yarn-client-jdk1.8.0_60.txt https://builds.apache.org/job/PreCommit-YARN-Build/9659/artifact/patchprocess/patch-unit-hadoop-yarn-project_hadoop-yarn_hadoop-yarn-client-jdk1.7.0_79.txt JDK v1.7.0_79 Test Results https://builds.apache.org/job/PreCommit-YARN-Build/9659/testReport/ modules C: hadoop-yarn-project/hadoop-yarn/hadoop-yarn-client U: hadoop-yarn-project/hadoop-yarn/hadoop-yarn-client Max memory used 67MB Powered by Apache Yetus http://yetus.apache.org Console output https://builds.apache.org/job/PreCommit-YARN-Build/9659/console This message was automatically generated.
        Hide
        jlowe Jason Lowe added a comment -

        Thanks for the patch, Junping! The main change looks OK, but the unit test needs some work. The unit test is missing the test decorator and therefore isn't executing. With that fixed, the unit test is passing even without the main fix.

        Show
        jlowe Jason Lowe added a comment - Thanks for the patch, Junping! The main change looks OK, but the unit test needs some work. The unit test is missing the test decorator and therefore isn't executing. With that fixed, the unit test is passing even without the main fix.
        Hide
        djp Junping Du added a comment -

        I think the test failure is not related. Try the test locally (TestYarnClient) which is failed with or without this patch.

        Show
        djp Junping Du added a comment - I think the test failure is not related. Try the test locally (TestYarnClient) which is failed with or without this patch.
        Hide
        djp Junping Du added a comment -

        Thanks Jason for review! I update v2 patch to address your comments.

        Show
        djp Junping Du added a comment - Thanks Jason for review! I update v2 patch to address your comments.
        Hide
        hadoopqa Hadoop QA added a comment -
        -1 overall



        Vote Subsystem Runtime Comment
        0 reexec 0m 19s docker + precommit patch detected.
        +1 @author 0m 0s The patch does not contain any @author tags.
        +1 test4tests 0m 0s The patch appears to include 1 new or modified test files.
        +1 mvninstall 3m 21s trunk passed
        +1 compile 0m 17s trunk passed with JDK v1.8.0_60
        +1 compile 0m 17s trunk passed with JDK v1.7.0_79
        +1 checkstyle 0m 9s trunk passed
        +1 mvneclipse 0m 15s trunk passed
        +1 findbugs 0m 37s trunk passed
        +1 javadoc 0m 17s trunk passed with JDK v1.8.0_60
        +1 javadoc 0m 18s trunk passed with JDK v1.7.0_79
        +1 mvninstall 0m 20s the patch passed
        +1 compile 0m 16s the patch passed with JDK v1.8.0_60
        +1 javac 0m 16s the patch passed
        +1 compile 0m 18s the patch passed with JDK v1.7.0_79
        +1 javac 0m 18s the patch passed
        +1 checkstyle 0m 9s the patch passed
        +1 mvneclipse 0m 14s the patch passed
        +1 whitespace 0m 0s Patch has no whitespace issues.
        +1 findbugs 0m 48s the patch passed
        +1 javadoc 0m 18s the patch passed with JDK v1.8.0_60
        +1 javadoc 0m 19s the patch passed with JDK v1.7.0_79
        -1 unit 49m 33s hadoop-yarn-client in the patch failed with JDK v1.8.0_60.
        -1 unit 49m 36s hadoop-yarn-client in the patch failed with JDK v1.7.0_79.
        +1 asflicense 0m 28s Patch does not generate ASF License warnings.
        109m 11s



        Reason Tests
        JDK v1.8.0_60 Failed junit tests hadoop.yarn.client.TestGetGroups
        JDK v1.8.0_60 Timed out junit tests org.apache.hadoop.yarn.client.api.impl.TestYarnClient
          org.apache.hadoop.yarn.client.api.impl.TestAMRMClient
          org.apache.hadoop.yarn.client.api.impl.TestNMClient
        JDK v1.7.0_79 Failed junit tests hadoop.yarn.client.TestGetGroups
        JDK v1.7.0_79 Timed out junit tests org.apache.hadoop.yarn.client.api.impl.TestYarnClient
          org.apache.hadoop.yarn.client.api.impl.TestAMRMClient
          org.apache.hadoop.yarn.client.api.impl.TestNMClient



        Subsystem Report/Notes
        Docker Client=1.7.1 Server=1.7.1 Image:test-patch-base-hadoop-date2015-11-11
        JIRA Patch URL https://issues.apache.org/jira/secure/attachment/12771848/YARN-4345-v2.patch
        JIRA Issue YARN-4345
        Optional Tests asflicense javac javadoc mvninstall unit findbugs checkstyle compile
        uname Linux e13eaab48005 3.13.0-36-lowlatency #63-Ubuntu SMP PREEMPT Wed Sep 3 21:56:12 UTC 2014 x86_64 x86_64 x86_64 GNU/Linux
        Build tool maven
        Personality /home/jenkins/jenkins-slave/workspace/PreCommit-YARN-Build/patchprocess/apache-yetus-72645f4/precommit/personality/hadoop.sh
        git revision trunk / a2a104f
        findbugs v3.0.0
        unit https://builds.apache.org/job/PreCommit-YARN-Build/9661/artifact/patchprocess/patch-unit-hadoop-yarn-project_hadoop-yarn_hadoop-yarn-client-jdk1.8.0_60.txt
        unit https://builds.apache.org/job/PreCommit-YARN-Build/9661/artifact/patchprocess/patch-unit-hadoop-yarn-project_hadoop-yarn_hadoop-yarn-client-jdk1.7.0_79.txt
        unit test logs https://builds.apache.org/job/PreCommit-YARN-Build/9661/artifact/patchprocess/patch-unit-hadoop-yarn-project_hadoop-yarn_hadoop-yarn-client-jdk1.8.0_60.txt https://builds.apache.org/job/PreCommit-YARN-Build/9661/artifact/patchprocess/patch-unit-hadoop-yarn-project_hadoop-yarn_hadoop-yarn-client-jdk1.7.0_79.txt
        JDK v1.7.0_79 Test Results https://builds.apache.org/job/PreCommit-YARN-Build/9661/testReport/
        modules C: hadoop-yarn-project/hadoop-yarn/hadoop-yarn-client U: hadoop-yarn-project/hadoop-yarn/hadoop-yarn-client
        Max memory used 226MB
        Powered by Apache Yetus http://yetus.apache.org
        Console output https://builds.apache.org/job/PreCommit-YARN-Build/9661/console

        This message was automatically generated.

        Show
        hadoopqa Hadoop QA added a comment - -1 overall Vote Subsystem Runtime Comment 0 reexec 0m 19s docker + precommit patch detected. +1 @author 0m 0s The patch does not contain any @author tags. +1 test4tests 0m 0s The patch appears to include 1 new or modified test files. +1 mvninstall 3m 21s trunk passed +1 compile 0m 17s trunk passed with JDK v1.8.0_60 +1 compile 0m 17s trunk passed with JDK v1.7.0_79 +1 checkstyle 0m 9s trunk passed +1 mvneclipse 0m 15s trunk passed +1 findbugs 0m 37s trunk passed +1 javadoc 0m 17s trunk passed with JDK v1.8.0_60 +1 javadoc 0m 18s trunk passed with JDK v1.7.0_79 +1 mvninstall 0m 20s the patch passed +1 compile 0m 16s the patch passed with JDK v1.8.0_60 +1 javac 0m 16s the patch passed +1 compile 0m 18s the patch passed with JDK v1.7.0_79 +1 javac 0m 18s the patch passed +1 checkstyle 0m 9s the patch passed +1 mvneclipse 0m 14s the patch passed +1 whitespace 0m 0s Patch has no whitespace issues. +1 findbugs 0m 48s the patch passed +1 javadoc 0m 18s the patch passed with JDK v1.8.0_60 +1 javadoc 0m 19s the patch passed with JDK v1.7.0_79 -1 unit 49m 33s hadoop-yarn-client in the patch failed with JDK v1.8.0_60. -1 unit 49m 36s hadoop-yarn-client in the patch failed with JDK v1.7.0_79. +1 asflicense 0m 28s Patch does not generate ASF License warnings. 109m 11s Reason Tests JDK v1.8.0_60 Failed junit tests hadoop.yarn.client.TestGetGroups JDK v1.8.0_60 Timed out junit tests org.apache.hadoop.yarn.client.api.impl.TestYarnClient   org.apache.hadoop.yarn.client.api.impl.TestAMRMClient   org.apache.hadoop.yarn.client.api.impl.TestNMClient JDK v1.7.0_79 Failed junit tests hadoop.yarn.client.TestGetGroups JDK v1.7.0_79 Timed out junit tests org.apache.hadoop.yarn.client.api.impl.TestYarnClient   org.apache.hadoop.yarn.client.api.impl.TestAMRMClient   org.apache.hadoop.yarn.client.api.impl.TestNMClient Subsystem Report/Notes Docker Client=1.7.1 Server=1.7.1 Image:test-patch-base-hadoop-date2015-11-11 JIRA Patch URL https://issues.apache.org/jira/secure/attachment/12771848/YARN-4345-v2.patch JIRA Issue YARN-4345 Optional Tests asflicense javac javadoc mvninstall unit findbugs checkstyle compile uname Linux e13eaab48005 3.13.0-36-lowlatency #63-Ubuntu SMP PREEMPT Wed Sep 3 21:56:12 UTC 2014 x86_64 x86_64 x86_64 GNU/Linux Build tool maven Personality /home/jenkins/jenkins-slave/workspace/PreCommit-YARN-Build/patchprocess/apache-yetus-72645f4/precommit/personality/hadoop.sh git revision trunk / a2a104f findbugs v3.0.0 unit https://builds.apache.org/job/PreCommit-YARN-Build/9661/artifact/patchprocess/patch-unit-hadoop-yarn-project_hadoop-yarn_hadoop-yarn-client-jdk1.8.0_60.txt unit https://builds.apache.org/job/PreCommit-YARN-Build/9661/artifact/patchprocess/patch-unit-hadoop-yarn-project_hadoop-yarn_hadoop-yarn-client-jdk1.7.0_79.txt unit test logs https://builds.apache.org/job/PreCommit-YARN-Build/9661/artifact/patchprocess/patch-unit-hadoop-yarn-project_hadoop-yarn_hadoop-yarn-client-jdk1.8.0_60.txt https://builds.apache.org/job/PreCommit-YARN-Build/9661/artifact/patchprocess/patch-unit-hadoop-yarn-project_hadoop-yarn_hadoop-yarn-client-jdk1.7.0_79.txt JDK v1.7.0_79 Test Results https://builds.apache.org/job/PreCommit-YARN-Build/9661/testReport/ modules C: hadoop-yarn-project/hadoop-yarn/hadoop-yarn-client U: hadoop-yarn-project/hadoop-yarn/hadoop-yarn-client Max memory used 226MB Powered by Apache Yetus http://yetus.apache.org Console output https://builds.apache.org/job/PreCommit-YARN-Build/9661/console This message was automatically generated.
        Hide
        djp Junping Du added a comment -

        Add test for parameter check in v3 patch to make sure the unit test will get failed without changes of the patch. Will file a separate JIRA to track TestYarnClient failures if no open one for it.

        Show
        djp Junping Du added a comment - Add test for parameter check in v3 patch to make sure the unit test will get failed without changes of the patch. Will file a separate JIRA to track TestYarnClient failures if no open one for it.
        Hide
        hadoopqa Hadoop QA added a comment -
        -1 overall



        Vote Subsystem Runtime Comment
        0 reexec 0m 6s docker + precommit patch detected.
        +1 @author 0m 0s The patch does not contain any @author tags.
        +1 test4tests 0m 0s The patch appears to include 1 new or modified test files.
        +1 mvninstall 3m 6s trunk passed
        +1 compile 0m 15s trunk passed with JDK v1.8.0_60
        +1 compile 0m 16s trunk passed with JDK v1.7.0_79
        +1 checkstyle 0m 10s trunk passed
        +1 mvnsite 0m 21s trunk passed
        +1 mvneclipse 0m 13s trunk passed
        +1 findbugs 0m 36s trunk passed
        +1 javadoc 0m 15s trunk passed with JDK v1.8.0_60
        +1 javadoc 0m 18s trunk passed with JDK v1.7.0_79
        +1 mvninstall 0m 20s the patch passed
        +1 compile 0m 14s the patch passed with JDK v1.8.0_60
        +1 javac 0m 14s the patch passed
        +1 compile 0m 16s the patch passed with JDK v1.7.0_79
        +1 javac 0m 16s the patch passed
        +1 checkstyle 0m 9s the patch passed
        +1 mvnsite 0m 22s the patch passed
        +1 mvneclipse 0m 13s the patch passed
        +1 whitespace 0m 0s Patch has no whitespace issues.
        +1 findbugs 0m 44s the patch passed
        +1 javadoc 0m 16s the patch passed with JDK v1.8.0_60
        +1 javadoc 0m 18s the patch passed with JDK v1.7.0_79
        -1 unit 49m 26s hadoop-yarn-client in the patch failed with JDK v1.8.0_60.
        -1 unit 49m 35s hadoop-yarn-client in the patch failed with JDK v1.7.0_79.
        +1 asflicense 0m 23s Patch does not generate ASF License warnings.
        108m 52s



        Reason Tests
        JDK v1.8.0_60 Failed junit tests hadoop.yarn.client.TestGetGroups
        JDK v1.8.0_60 Timed out junit tests org.apache.hadoop.yarn.client.api.impl.TestYarnClient
          org.apache.hadoop.yarn.client.api.impl.TestAMRMClient
          org.apache.hadoop.yarn.client.api.impl.TestNMClient
        JDK v1.7.0_79 Failed junit tests hadoop.yarn.client.TestGetGroups
        JDK v1.7.0_79 Timed out junit tests org.apache.hadoop.yarn.client.api.impl.TestYarnClient
          org.apache.hadoop.yarn.client.api.impl.TestAMRMClient
          org.apache.hadoop.yarn.client.api.impl.TestNMClient



        Subsystem Report/Notes
        Docker Client=1.7.1 Server=1.7.1 Image:test-patch-base-hadoop-date2015-11-12
        JIRA Patch URL https://issues.apache.org/jira/secure/attachment/12771958/YARN-4345-v3.patch
        JIRA Issue YARN-4345
        Optional Tests asflicense compile javac javadoc mvninstall mvnsite unit findbugs checkstyle
        uname Linux ba00d50d4eb7 3.13.0-36-lowlatency #63-Ubuntu SMP PREEMPT Wed Sep 3 21:56:12 UTC 2014 x86_64 x86_64 x86_64 GNU/Linux
        Build tool maven
        Personality /home/jenkins/jenkins-slave/workspace/PreCommit-YARN-Build/patchprocess/apache-yetus-fa12328/precommit/personality/hadoop.sh
        git revision trunk / 9ad708a
        findbugs v3.0.0
        unit https://builds.apache.org/job/PreCommit-YARN-Build/9671/artifact/patchprocess/patch-unit-hadoop-yarn-project_hadoop-yarn_hadoop-yarn-client-jdk1.8.0_60.txt
        unit https://builds.apache.org/job/PreCommit-YARN-Build/9671/artifact/patchprocess/patch-unit-hadoop-yarn-project_hadoop-yarn_hadoop-yarn-client-jdk1.7.0_79.txt
        unit test logs https://builds.apache.org/job/PreCommit-YARN-Build/9671/artifact/patchprocess/patch-unit-hadoop-yarn-project_hadoop-yarn_hadoop-yarn-client-jdk1.8.0_60.txt https://builds.apache.org/job/PreCommit-YARN-Build/9671/artifact/patchprocess/patch-unit-hadoop-yarn-project_hadoop-yarn_hadoop-yarn-client-jdk1.7.0_79.txt
        JDK v1.7.0_79 Test Results https://builds.apache.org/job/PreCommit-YARN-Build/9671/testReport/
        modules C: hadoop-yarn-project/hadoop-yarn/hadoop-yarn-client U: hadoop-yarn-project/hadoop-yarn/hadoop-yarn-client
        Max memory used 229MB
        Powered by Apache Yetus http://yetus.apache.org
        Console output https://builds.apache.org/job/PreCommit-YARN-Build/9671/console

        This message was automatically generated.

        Show
        hadoopqa Hadoop QA added a comment - -1 overall Vote Subsystem Runtime Comment 0 reexec 0m 6s docker + precommit patch detected. +1 @author 0m 0s The patch does not contain any @author tags. +1 test4tests 0m 0s The patch appears to include 1 new or modified test files. +1 mvninstall 3m 6s trunk passed +1 compile 0m 15s trunk passed with JDK v1.8.0_60 +1 compile 0m 16s trunk passed with JDK v1.7.0_79 +1 checkstyle 0m 10s trunk passed +1 mvnsite 0m 21s trunk passed +1 mvneclipse 0m 13s trunk passed +1 findbugs 0m 36s trunk passed +1 javadoc 0m 15s trunk passed with JDK v1.8.0_60 +1 javadoc 0m 18s trunk passed with JDK v1.7.0_79 +1 mvninstall 0m 20s the patch passed +1 compile 0m 14s the patch passed with JDK v1.8.0_60 +1 javac 0m 14s the patch passed +1 compile 0m 16s the patch passed with JDK v1.7.0_79 +1 javac 0m 16s the patch passed +1 checkstyle 0m 9s the patch passed +1 mvnsite 0m 22s the patch passed +1 mvneclipse 0m 13s the patch passed +1 whitespace 0m 0s Patch has no whitespace issues. +1 findbugs 0m 44s the patch passed +1 javadoc 0m 16s the patch passed with JDK v1.8.0_60 +1 javadoc 0m 18s the patch passed with JDK v1.7.0_79 -1 unit 49m 26s hadoop-yarn-client in the patch failed with JDK v1.8.0_60. -1 unit 49m 35s hadoop-yarn-client in the patch failed with JDK v1.7.0_79. +1 asflicense 0m 23s Patch does not generate ASF License warnings. 108m 52s Reason Tests JDK v1.8.0_60 Failed junit tests hadoop.yarn.client.TestGetGroups JDK v1.8.0_60 Timed out junit tests org.apache.hadoop.yarn.client.api.impl.TestYarnClient   org.apache.hadoop.yarn.client.api.impl.TestAMRMClient   org.apache.hadoop.yarn.client.api.impl.TestNMClient JDK v1.7.0_79 Failed junit tests hadoop.yarn.client.TestGetGroups JDK v1.7.0_79 Timed out junit tests org.apache.hadoop.yarn.client.api.impl.TestYarnClient   org.apache.hadoop.yarn.client.api.impl.TestAMRMClient   org.apache.hadoop.yarn.client.api.impl.TestNMClient Subsystem Report/Notes Docker Client=1.7.1 Server=1.7.1 Image:test-patch-base-hadoop-date2015-11-12 JIRA Patch URL https://issues.apache.org/jira/secure/attachment/12771958/YARN-4345-v3.patch JIRA Issue YARN-4345 Optional Tests asflicense compile javac javadoc mvninstall mvnsite unit findbugs checkstyle uname Linux ba00d50d4eb7 3.13.0-36-lowlatency #63-Ubuntu SMP PREEMPT Wed Sep 3 21:56:12 UTC 2014 x86_64 x86_64 x86_64 GNU/Linux Build tool maven Personality /home/jenkins/jenkins-slave/workspace/PreCommit-YARN-Build/patchprocess/apache-yetus-fa12328/precommit/personality/hadoop.sh git revision trunk / 9ad708a findbugs v3.0.0 unit https://builds.apache.org/job/PreCommit-YARN-Build/9671/artifact/patchprocess/patch-unit-hadoop-yarn-project_hadoop-yarn_hadoop-yarn-client-jdk1.8.0_60.txt unit https://builds.apache.org/job/PreCommit-YARN-Build/9671/artifact/patchprocess/patch-unit-hadoop-yarn-project_hadoop-yarn_hadoop-yarn-client-jdk1.7.0_79.txt unit test logs https://builds.apache.org/job/PreCommit-YARN-Build/9671/artifact/patchprocess/patch-unit-hadoop-yarn-project_hadoop-yarn_hadoop-yarn-client-jdk1.8.0_60.txt https://builds.apache.org/job/PreCommit-YARN-Build/9671/artifact/patchprocess/patch-unit-hadoop-yarn-project_hadoop-yarn_hadoop-yarn-client-jdk1.7.0_79.txt JDK v1.7.0_79 Test Results https://builds.apache.org/job/PreCommit-YARN-Build/9671/testReport/ modules C: hadoop-yarn-project/hadoop-yarn/hadoop-yarn-client U: hadoop-yarn-project/hadoop-yarn/hadoop-yarn-client Max memory used 229MB Powered by Apache Yetus http://yetus.apache.org Console output https://builds.apache.org/job/PreCommit-YARN-Build/9671/console This message was automatically generated.
        Hide
        jlowe Jason Lowe added a comment -

        +1 lgtm. Other test failures appear to be unrelated. Committing this.

        Show
        jlowe Jason Lowe added a comment - +1 lgtm. Other test failures appear to be unrelated. Committing this.
        Hide
        jlowe Jason Lowe added a comment -

        Thanks, Junping! I committed this to trunk and branch-2.

        Show
        jlowe Jason Lowe added a comment - Thanks, Junping! I committed this to trunk and branch-2.
        Hide
        djp Junping Du added a comment -

        Thanks Jason Lowe for review and commit! Did you see the same test failures report (failed on TestGetGroups and timeout for TestYarnClient/TestNMClient/TestAMRMClient) before? If not, I will go ahead to file two jiras to track them separately.

        Show
        djp Junping Du added a comment - Thanks Jason Lowe for review and commit! Did you see the same test failures report (failed on TestGetGroups and timeout for TestYarnClient/TestNMClient/TestAMRMClient) before? If not, I will go ahead to file two jiras to track them separately.
        Hide
        hudson Hudson added a comment -

        FAILURE: Integrated in Hadoop-trunk-Commit #8796 (See https://builds.apache.org/job/Hadoop-trunk-Commit/8796/)
        YARN-4345. yarn rmadmin -updateNodeResource doesn't work. Contributed by (jlowe: rev 06a70311b90a7bc676af86e778ec7bcd8dd6ea82)

        • hadoop-yarn-project/hadoop-yarn/hadoop-yarn-client/src/test/java/org/apache/hadoop/yarn/client/cli/TestRMAdminCLI.java
        • hadoop-yarn-project/CHANGES.txt
        • hadoop-yarn-project/hadoop-yarn/hadoop-yarn-client/src/main/java/org/apache/hadoop/yarn/client/cli/RMAdminCLI.java
        Show
        hudson Hudson added a comment - FAILURE: Integrated in Hadoop-trunk-Commit #8796 (See https://builds.apache.org/job/Hadoop-trunk-Commit/8796/ ) YARN-4345 . yarn rmadmin -updateNodeResource doesn't work. Contributed by (jlowe: rev 06a70311b90a7bc676af86e778ec7bcd8dd6ea82) hadoop-yarn-project/hadoop-yarn/hadoop-yarn-client/src/test/java/org/apache/hadoop/yarn/client/cli/TestRMAdminCLI.java hadoop-yarn-project/CHANGES.txt hadoop-yarn-project/hadoop-yarn/hadoop-yarn-client/src/main/java/org/apache/hadoop/yarn/client/cli/RMAdminCLI.java
        Hide
        hudson Hudson added a comment -

        FAILURE: Integrated in Hadoop-Yarn-trunk #1397 (See https://builds.apache.org/job/Hadoop-Yarn-trunk/1397/)
        YARN-4345. yarn rmadmin -updateNodeResource doesn't work. Contributed by (jlowe: rev 06a70311b90a7bc676af86e778ec7bcd8dd6ea82)

        • hadoop-yarn-project/CHANGES.txt
        • hadoop-yarn-project/hadoop-yarn/hadoop-yarn-client/src/test/java/org/apache/hadoop/yarn/client/cli/TestRMAdminCLI.java
        • hadoop-yarn-project/hadoop-yarn/hadoop-yarn-client/src/main/java/org/apache/hadoop/yarn/client/cli/RMAdminCLI.java
        Show
        hudson Hudson added a comment - FAILURE: Integrated in Hadoop-Yarn-trunk #1397 (See https://builds.apache.org/job/Hadoop-Yarn-trunk/1397/ ) YARN-4345 . yarn rmadmin -updateNodeResource doesn't work. Contributed by (jlowe: rev 06a70311b90a7bc676af86e778ec7bcd8dd6ea82) hadoop-yarn-project/CHANGES.txt hadoop-yarn-project/hadoop-yarn/hadoop-yarn-client/src/test/java/org/apache/hadoop/yarn/client/cli/TestRMAdminCLI.java hadoop-yarn-project/hadoop-yarn/hadoop-yarn-client/src/main/java/org/apache/hadoop/yarn/client/cli/RMAdminCLI.java
        Hide
        jlowe Jason Lowe added a comment -

        I have not seen JIRAs tracking those failures, so please file them.

        Show
        jlowe Jason Lowe added a comment - I have not seen JIRAs tracking those failures, so please file them.
        Hide
        hudson Hudson added a comment -

        FAILURE: Integrated in Hadoop-Mapreduce-trunk #2601 (See https://builds.apache.org/job/Hadoop-Mapreduce-trunk/2601/)
        YARN-4345. yarn rmadmin -updateNodeResource doesn't work. Contributed by (jlowe: rev 06a70311b90a7bc676af86e778ec7bcd8dd6ea82)

        • hadoop-yarn-project/CHANGES.txt
        • hadoop-yarn-project/hadoop-yarn/hadoop-yarn-client/src/test/java/org/apache/hadoop/yarn/client/cli/TestRMAdminCLI.java
        • hadoop-yarn-project/hadoop-yarn/hadoop-yarn-client/src/main/java/org/apache/hadoop/yarn/client/cli/RMAdminCLI.java
        Show
        hudson Hudson added a comment - FAILURE: Integrated in Hadoop-Mapreduce-trunk #2601 (See https://builds.apache.org/job/Hadoop-Mapreduce-trunk/2601/ ) YARN-4345 . yarn rmadmin -updateNodeResource doesn't work. Contributed by (jlowe: rev 06a70311b90a7bc676af86e778ec7bcd8dd6ea82) hadoop-yarn-project/CHANGES.txt hadoop-yarn-project/hadoop-yarn/hadoop-yarn-client/src/test/java/org/apache/hadoop/yarn/client/cli/TestRMAdminCLI.java hadoop-yarn-project/hadoop-yarn/hadoop-yarn-client/src/main/java/org/apache/hadoop/yarn/client/cli/RMAdminCLI.java
        Hide
        hudson Hudson added a comment -

        FAILURE: Integrated in Hadoop-Yarn-trunk-Java8 #673 (See https://builds.apache.org/job/Hadoop-Yarn-trunk-Java8/673/)
        YARN-4345. yarn rmadmin -updateNodeResource doesn't work. Contributed by (jlowe: rev 06a70311b90a7bc676af86e778ec7bcd8dd6ea82)

        • hadoop-yarn-project/CHANGES.txt
        • hadoop-yarn-project/hadoop-yarn/hadoop-yarn-client/src/test/java/org/apache/hadoop/yarn/client/cli/TestRMAdminCLI.java
        • hadoop-yarn-project/hadoop-yarn/hadoop-yarn-client/src/main/java/org/apache/hadoop/yarn/client/cli/RMAdminCLI.java
        Show
        hudson Hudson added a comment - FAILURE: Integrated in Hadoop-Yarn-trunk-Java8 #673 (See https://builds.apache.org/job/Hadoop-Yarn-trunk-Java8/673/ ) YARN-4345 . yarn rmadmin -updateNodeResource doesn't work. Contributed by (jlowe: rev 06a70311b90a7bc676af86e778ec7bcd8dd6ea82) hadoop-yarn-project/CHANGES.txt hadoop-yarn-project/hadoop-yarn/hadoop-yarn-client/src/test/java/org/apache/hadoop/yarn/client/cli/TestRMAdminCLI.java hadoop-yarn-project/hadoop-yarn/hadoop-yarn-client/src/main/java/org/apache/hadoop/yarn/client/cli/RMAdminCLI.java
        Hide
        djp Junping Du added a comment -

        I have not seen JIRAs tracking those failures, so please file them.

        Thanks for confirmation. Filed YARN-4351 and YARN-4352 to track test failures/timeout.

        Show
        djp Junping Du added a comment - I have not seen JIRAs tracking those failures, so please file them. Thanks for confirmation. Filed YARN-4351 and YARN-4352 to track test failures/timeout.
        Hide
        hudson Hudson added a comment -

        SUCCESS: Integrated in Hadoop-Mapreduce-trunk-Java8 #661 (See https://builds.apache.org/job/Hadoop-Mapreduce-trunk-Java8/661/)
        YARN-4345. yarn rmadmin -updateNodeResource doesn't work. Contributed by (jlowe: rev 06a70311b90a7bc676af86e778ec7bcd8dd6ea82)

        • hadoop-yarn-project/hadoop-yarn/hadoop-yarn-client/src/main/java/org/apache/hadoop/yarn/client/cli/RMAdminCLI.java
        • hadoop-yarn-project/CHANGES.txt
        • hadoop-yarn-project/hadoop-yarn/hadoop-yarn-client/src/test/java/org/apache/hadoop/yarn/client/cli/TestRMAdminCLI.java
        Show
        hudson Hudson added a comment - SUCCESS: Integrated in Hadoop-Mapreduce-trunk-Java8 #661 (See https://builds.apache.org/job/Hadoop-Mapreduce-trunk-Java8/661/ ) YARN-4345 . yarn rmadmin -updateNodeResource doesn't work. Contributed by (jlowe: rev 06a70311b90a7bc676af86e778ec7bcd8dd6ea82) hadoop-yarn-project/hadoop-yarn/hadoop-yarn-client/src/main/java/org/apache/hadoop/yarn/client/cli/RMAdminCLI.java hadoop-yarn-project/CHANGES.txt hadoop-yarn-project/hadoop-yarn/hadoop-yarn-client/src/test/java/org/apache/hadoop/yarn/client/cli/TestRMAdminCLI.java
        Hide
        hudson Hudson added a comment -

        FAILURE: Integrated in Hadoop-Hdfs-trunk-Java8 #600 (See https://builds.apache.org/job/Hadoop-Hdfs-trunk-Java8/600/)
        YARN-4345. yarn rmadmin -updateNodeResource doesn't work. Contributed by (jlowe: rev 06a70311b90a7bc676af86e778ec7bcd8dd6ea82)

        • hadoop-yarn-project/hadoop-yarn/hadoop-yarn-client/src/main/java/org/apache/hadoop/yarn/client/cli/RMAdminCLI.java
        • hadoop-yarn-project/CHANGES.txt
        • hadoop-yarn-project/hadoop-yarn/hadoop-yarn-client/src/test/java/org/apache/hadoop/yarn/client/cli/TestRMAdminCLI.java
        Show
        hudson Hudson added a comment - FAILURE: Integrated in Hadoop-Hdfs-trunk-Java8 #600 (See https://builds.apache.org/job/Hadoop-Hdfs-trunk-Java8/600/ ) YARN-4345 . yarn rmadmin -updateNodeResource doesn't work. Contributed by (jlowe: rev 06a70311b90a7bc676af86e778ec7bcd8dd6ea82) hadoop-yarn-project/hadoop-yarn/hadoop-yarn-client/src/main/java/org/apache/hadoop/yarn/client/cli/RMAdminCLI.java hadoop-yarn-project/CHANGES.txt hadoop-yarn-project/hadoop-yarn/hadoop-yarn-client/src/test/java/org/apache/hadoop/yarn/client/cli/TestRMAdminCLI.java
        Hide
        hudson Hudson added a comment -

        FAILURE: Integrated in Hadoop-Hdfs-trunk #2538 (See https://builds.apache.org/job/Hadoop-Hdfs-trunk/2538/)
        YARN-4345. yarn rmadmin -updateNodeResource doesn't work. Contributed by (jlowe: rev 06a70311b90a7bc676af86e778ec7bcd8dd6ea82)

        • hadoop-yarn-project/hadoop-yarn/hadoop-yarn-client/src/test/java/org/apache/hadoop/yarn/client/cli/TestRMAdminCLI.java
        • hadoop-yarn-project/hadoop-yarn/hadoop-yarn-client/src/main/java/org/apache/hadoop/yarn/client/cli/RMAdminCLI.java
        • hadoop-yarn-project/CHANGES.txt
        Show
        hudson Hudson added a comment - FAILURE: Integrated in Hadoop-Hdfs-trunk #2538 (See https://builds.apache.org/job/Hadoop-Hdfs-trunk/2538/ ) YARN-4345 . yarn rmadmin -updateNodeResource doesn't work. Contributed by (jlowe: rev 06a70311b90a7bc676af86e778ec7bcd8dd6ea82) hadoop-yarn-project/hadoop-yarn/hadoop-yarn-client/src/test/java/org/apache/hadoop/yarn/client/cli/TestRMAdminCLI.java hadoop-yarn-project/hadoop-yarn/hadoop-yarn-client/src/main/java/org/apache/hadoop/yarn/client/cli/RMAdminCLI.java hadoop-yarn-project/CHANGES.txt

          People

          • Assignee:
            djp Junping Du
            Reporter:
            ssreenivasan Sushmitha Sreenivasan
          • Votes:
            0 Vote for this issue
            Watchers:
            7 Start watching this issue

            Dates

            • Created:
              Updated:
              Resolved:

              Development