Uploaded image for project: 'Hadoop YARN'
  1. Hadoop YARN
  2. YARN-4218

Metric for resource*time that was preempted

    Details

    • Type: Bug
    • Status: Resolved
    • Priority: Major
    • Resolution: Fixed
    • Affects Version/s: None
    • Fix Version/s: 2.8.0, 3.0.0-alpha2
    • Component/s: resourcemanager
    • Labels:
      None

      Description

      After YARN-415 we have the ability to track the resource*time footprint of a job and preemption metrics shows how many containers were preempted on a job. However we don't have a metric showing the resource*time footprint cost of preemption. In other words, we know how many containers were preempted but we don't have a good measure of how much work was lost as a result of preemption.
      We should add this metric so we can analyze how much work preemption is costing on a grid and better track which jobs were heavily impacted by it. A job that has 100 containers preempted that only lasted a minute each and were very small is going to be less impacted than a job that only lost a single container but that container was huge and had been running for 3 days.

      1. screenshot-1.png
        33 kB
        Chang Li
      2. screenshot-2.png
        23 kB
        Chang Li
      3. screenshot-3.png
        51 kB
        Chang Li
      4. YARN-4218.006.patch
        58 kB
        Chang Li
      5. YARN-4218.2.patch
        53 kB
        Chang Li
      6. YARN-4218.2.patch
        53 kB
        Chang Li
      7. YARN-4218.2.patch
        53 kB
        Chang Li
      8. YARN-4218.2.patch
        53 kB
        Chang Li
      9. YARN-4218.3.patch
        53 kB
        Chang Li
      10. YARN-4218.4.patch
        53 kB
        Chang Li
      11. YARN-4218.5.patch
        54 kB
        Chang Li
      12. YARN-4218.branch-2.2.patch
        54 kB
        Chang Li
      13. YARN-4218.branch-2.patch
        53 kB
        Chang Li
      14. YARN-4218.patch
        52 kB
        Chang Li
      15. YARN-4218.trunk.2.patch
        51 kB
        Chang Li
      16. YARN-4218.trunk.3.patch
        58 kB
        Chang Li
      17. YARN-4218.trunk.patch
        52 kB
        Chang Li
      18. YARN-4218.wip.patch
        49 kB
        Chang Li
      19. YARN-4218-branch-2.003.patch
        54 kB
        Chang Li

        Activity

        Hide
        lichangleo Chang Li added a comment -

        The latest patch added the new metric for preempted work(resource*time), and push the new metric to appreport, UI, rest autolog and timeline server

        Show
        lichangleo Chang Li added a comment - The latest patch added the new metric for preempted work(resource*time), and push the new metric to appreport, UI, rest autolog and timeline server
        Hide
        lichangleo Chang Li added a comment -

        .2 patch updated appSummary log

        Show
        lichangleo Chang Li added a comment - .2 patch updated appSummary log
        Hide
        hadoopqa Hadoop QA added a comment -



        -1 overall



        Vote Subsystem Runtime Comment
        0 pre-patch 22m 27s Pre-patch trunk compilation is healthy.
        +1 @author 0m 0s The patch does not contain any @author tags.
        +1 tests included 0m 0s The patch appears to include 9 new or modified test files.
        +1 javac 8m 0s There were no new javac warning messages.
        +1 javadoc 10m 22s There were no new javadoc warning messages.
        -1 release audit 0m 15s The applied patch generated 1 release audit warnings.
        -1 checkstyle 2m 43s The applied patch generated 3 new checkstyle issues (total was 10, now 13).
        -1 whitespace 0m 19s The patch has 10 line(s) that end in whitespace. Use git apply --whitespace=fix.
        +1 install 1m 32s mvn install still works.
        +1 eclipse:eclipse 0m 34s The patch built with eclipse:eclipse.
        +1 findbugs 7m 45s The patch does not introduce any new Findbugs (version 3.0.0) warnings.
        +1 yarn tests 0m 24s Tests passed in hadoop-yarn-api.
        +1 yarn tests 6m 59s Tests passed in hadoop-yarn-client.
        +1 yarn tests 2m 3s Tests passed in hadoop-yarn-common.
        +1 yarn tests 3m 17s Tests passed in hadoop-yarn-server-applicationhistoryservice.
        +1 yarn tests 0m 27s Tests passed in hadoop-yarn-server-common.
        -1 yarn tests 17m 29s Tests failed in hadoop-yarn-server-resourcemanager.
            85m 43s  



        Reason Tests
        Failed unit tests hadoop.yarn.server.resourcemanager.TestApplicationCleanup
          hadoop.yarn.server.resourcemanager.webapp.TestRMWebServicesDelegationTokenAuthentication
          hadoop.yarn.server.resourcemanager.TestResourceTrackerService
          hadoop.yarn.server.resourcemanager.webapp.TestRMWebServicesAppsModification
          hadoop.yarn.server.resourcemanager.TestMoveApplication
          hadoop.yarn.server.resourcemanager.TestApplicationMasterService
          hadoop.yarn.server.resourcemanager.rmcontainer.TestRMContainerImpl
          hadoop.yarn.server.resourcemanager.webapp.TestRMWebServicesFairScheduler
          hadoop.yarn.server.resourcemanager.applicationsmanager.TestAMRMRPCNodeUpdates
          hadoop.yarn.server.resourcemanager.webapp.TestRMWebServices
          hadoop.yarn.server.resourcemanager.scheduler.capacity.TestCapacitySchedulerQueueACLs
          hadoop.yarn.server.resourcemanager.webapp.TestRMWebServicesHttpStaticUserPermissions
          hadoop.yarn.server.resourcemanager.monitor.TestSchedulingMonitor
          hadoop.yarn.server.resourcemanager.TestRMAdminService
          hadoop.yarn.server.resourcemanager.webapp.TestRMWebServicesApps
          hadoop.yarn.server.resourcemanager.webapp.TestRMWebappAuthentication
          hadoop.yarn.server.resourcemanager.applicationsmanager.TestAMRMRPCResponseId
          hadoop.yarn.server.resourcemanager.TestKillApplicationWithRMHA
          hadoop.yarn.server.resourcemanager.webapp.TestRMWebServicesCapacitySched
          hadoop.yarn.server.resourcemanager.security.TestRMDelegationTokens
          hadoop.yarn.server.resourcemanager.TestApplicationACLs
          hadoop.yarn.server.resourcemanager.scheduler.capacity.TestLeafQueue
          hadoop.yarn.server.resourcemanager.scheduler.capacity.TestWorkPreservingRMRestartForNodeLabel
          hadoop.yarn.server.resourcemanager.scheduler.capacity.TestApplicationPriority
          hadoop.yarn.server.resourcemanager.TestRMHAForNodeLabels
          hadoop.yarn.server.resourcemanager.webapp.TestRMWebServicesNodeLabels
          hadoop.yarn.server.resourcemanager.applicationsmanager.TestAMRestart
          hadoop.yarn.server.resourcemanager.TestAMAuthorization
          hadoop.yarn.server.resourcemanager.TestRMRestart
          hadoop.yarn.server.resourcemanager.recovery.TestZKRMStateStore
          hadoop.yarn.server.resourcemanager.rmapp.attempt.TestRMAppAttemptTransitions
          hadoop.yarn.server.resourcemanager.scheduler.capacity.TestCapacitySchedulerNodeLabelUpdate
          hadoop.yarn.server.resourcemanager.security.TestClientToAMTokens
          hadoop.yarn.server.resourcemanager.TestClientRMService
          hadoop.yarn.server.resourcemanager.scheduler.capacity.TestCapacityScheduler
          hadoop.yarn.server.resourcemanager.resourcetracker.TestNMReconnect
          hadoop.yarn.server.resourcemanager.TestSubmitApplicationWithRMHA
          hadoop.yarn.server.resourcemanager.TestResourceManager
          hadoop.yarn.server.resourcemanager.rmapp.TestRMAppTransitions
          hadoop.yarn.server.resourcemanager.scheduler.capacity.TestQueueParsing
          hadoop.yarn.server.resourcemanager.scheduler.capacity.TestCapacitySchedulerDynamicBehavior
          hadoop.yarn.server.resourcemanager.ahs.TestRMApplicationHistoryWriter
          hadoop.yarn.server.resourcemanager.TestSignalContainer
          hadoop.yarn.server.resourcemanager.nodelabels.TestRMNodeLabelsManager
          hadoop.yarn.server.resourcemanager.TestApplicationMasterLauncher
          hadoop.yarn.server.resourcemanager.TestRM
          hadoop.yarn.server.resourcemanager.monitor.capacity.TestProportionalCapacityPreemptionPolicy
          hadoop.yarn.server.resourcemanager.TestRMHA
          hadoop.yarn.server.resourcemanager.rmapp.TestNodesListManager
          hadoop.yarn.server.resourcemanager.webapp.TestRMWebServicesDelegationTokens
          hadoop.yarn.server.resourcemanager.TestWorkPreservingRMRestart
          hadoop.yarn.server.resourcemanager.rmapp.attempt.TestAMLivelinessMonitor
          hadoop.yarn.server.resourcemanager.metrics.TestSystemMetricsPublisher
          hadoop.yarn.server.resourcemanager.security.TestDelegationTokenRenewer
          hadoop.yarn.server.resourcemanager.webapp.TestRMWebServicesNodes
          hadoop.yarn.server.resourcemanager.TestContainerResourceUsage
          hadoop.yarn.server.resourcemanager.security.TestAMRMTokens



        Subsystem Report/Notes
        Patch URL http://issues.apache.org/jira/secure/attachment/12765260/YARN-4218.2.patch
        Optional Tests javadoc javac unit findbugs checkstyle
        git revision trunk / 6d5713a
        Release Audit https://builds.apache.org/job/PreCommit-YARN-Build/9366/artifact/patchprocess/patchReleaseAuditProblems.txt
        checkstyle https://builds.apache.org/job/PreCommit-YARN-Build/9366/artifact/patchprocess/diffcheckstylehadoop-yarn-api.txt
        whitespace https://builds.apache.org/job/PreCommit-YARN-Build/9366/artifact/patchprocess/whitespace.txt
        hadoop-yarn-api test log https://builds.apache.org/job/PreCommit-YARN-Build/9366/artifact/patchprocess/testrun_hadoop-yarn-api.txt
        hadoop-yarn-client test log https://builds.apache.org/job/PreCommit-YARN-Build/9366/artifact/patchprocess/testrun_hadoop-yarn-client.txt
        hadoop-yarn-common test log https://builds.apache.org/job/PreCommit-YARN-Build/9366/artifact/patchprocess/testrun_hadoop-yarn-common.txt
        hadoop-yarn-server-applicationhistoryservice test log https://builds.apache.org/job/PreCommit-YARN-Build/9366/artifact/patchprocess/testrun_hadoop-yarn-server-applicationhistoryservice.txt
        hadoop-yarn-server-common test log https://builds.apache.org/job/PreCommit-YARN-Build/9366/artifact/patchprocess/testrun_hadoop-yarn-server-common.txt
        hadoop-yarn-server-resourcemanager test log https://builds.apache.org/job/PreCommit-YARN-Build/9366/artifact/patchprocess/testrun_hadoop-yarn-server-resourcemanager.txt
        Test Results https://builds.apache.org/job/PreCommit-YARN-Build/9366/testReport/
        Java 1.7.0_55
        uname Linux asf903.gq1.ygridcore.net 3.13.0-36-lowlatency #63-Ubuntu SMP PREEMPT Wed Sep 3 21:56:12 UTC 2014 x86_64 x86_64 x86_64 GNU/Linux
        Console output https://builds.apache.org/job/PreCommit-YARN-Build/9366/console

        This message was automatically generated.

        Show
        hadoopqa Hadoop QA added a comment - -1 overall Vote Subsystem Runtime Comment 0 pre-patch 22m 27s Pre-patch trunk compilation is healthy. +1 @author 0m 0s The patch does not contain any @author tags. +1 tests included 0m 0s The patch appears to include 9 new or modified test files. +1 javac 8m 0s There were no new javac warning messages. +1 javadoc 10m 22s There were no new javadoc warning messages. -1 release audit 0m 15s The applied patch generated 1 release audit warnings. -1 checkstyle 2m 43s The applied patch generated 3 new checkstyle issues (total was 10, now 13). -1 whitespace 0m 19s The patch has 10 line(s) that end in whitespace. Use git apply --whitespace=fix. +1 install 1m 32s mvn install still works. +1 eclipse:eclipse 0m 34s The patch built with eclipse:eclipse. +1 findbugs 7m 45s The patch does not introduce any new Findbugs (version 3.0.0) warnings. +1 yarn tests 0m 24s Tests passed in hadoop-yarn-api. +1 yarn tests 6m 59s Tests passed in hadoop-yarn-client. +1 yarn tests 2m 3s Tests passed in hadoop-yarn-common. +1 yarn tests 3m 17s Tests passed in hadoop-yarn-server-applicationhistoryservice. +1 yarn tests 0m 27s Tests passed in hadoop-yarn-server-common. -1 yarn tests 17m 29s Tests failed in hadoop-yarn-server-resourcemanager.     85m 43s   Reason Tests Failed unit tests hadoop.yarn.server.resourcemanager.TestApplicationCleanup   hadoop.yarn.server.resourcemanager.webapp.TestRMWebServicesDelegationTokenAuthentication   hadoop.yarn.server.resourcemanager.TestResourceTrackerService   hadoop.yarn.server.resourcemanager.webapp.TestRMWebServicesAppsModification   hadoop.yarn.server.resourcemanager.TestMoveApplication   hadoop.yarn.server.resourcemanager.TestApplicationMasterService   hadoop.yarn.server.resourcemanager.rmcontainer.TestRMContainerImpl   hadoop.yarn.server.resourcemanager.webapp.TestRMWebServicesFairScheduler   hadoop.yarn.server.resourcemanager.applicationsmanager.TestAMRMRPCNodeUpdates   hadoop.yarn.server.resourcemanager.webapp.TestRMWebServices   hadoop.yarn.server.resourcemanager.scheduler.capacity.TestCapacitySchedulerQueueACLs   hadoop.yarn.server.resourcemanager.webapp.TestRMWebServicesHttpStaticUserPermissions   hadoop.yarn.server.resourcemanager.monitor.TestSchedulingMonitor   hadoop.yarn.server.resourcemanager.TestRMAdminService   hadoop.yarn.server.resourcemanager.webapp.TestRMWebServicesApps   hadoop.yarn.server.resourcemanager.webapp.TestRMWebappAuthentication   hadoop.yarn.server.resourcemanager.applicationsmanager.TestAMRMRPCResponseId   hadoop.yarn.server.resourcemanager.TestKillApplicationWithRMHA   hadoop.yarn.server.resourcemanager.webapp.TestRMWebServicesCapacitySched   hadoop.yarn.server.resourcemanager.security.TestRMDelegationTokens   hadoop.yarn.server.resourcemanager.TestApplicationACLs   hadoop.yarn.server.resourcemanager.scheduler.capacity.TestLeafQueue   hadoop.yarn.server.resourcemanager.scheduler.capacity.TestWorkPreservingRMRestartForNodeLabel   hadoop.yarn.server.resourcemanager.scheduler.capacity.TestApplicationPriority   hadoop.yarn.server.resourcemanager.TestRMHAForNodeLabels   hadoop.yarn.server.resourcemanager.webapp.TestRMWebServicesNodeLabels   hadoop.yarn.server.resourcemanager.applicationsmanager.TestAMRestart   hadoop.yarn.server.resourcemanager.TestAMAuthorization   hadoop.yarn.server.resourcemanager.TestRMRestart   hadoop.yarn.server.resourcemanager.recovery.TestZKRMStateStore   hadoop.yarn.server.resourcemanager.rmapp.attempt.TestRMAppAttemptTransitions   hadoop.yarn.server.resourcemanager.scheduler.capacity.TestCapacitySchedulerNodeLabelUpdate   hadoop.yarn.server.resourcemanager.security.TestClientToAMTokens   hadoop.yarn.server.resourcemanager.TestClientRMService   hadoop.yarn.server.resourcemanager.scheduler.capacity.TestCapacityScheduler   hadoop.yarn.server.resourcemanager.resourcetracker.TestNMReconnect   hadoop.yarn.server.resourcemanager.TestSubmitApplicationWithRMHA   hadoop.yarn.server.resourcemanager.TestResourceManager   hadoop.yarn.server.resourcemanager.rmapp.TestRMAppTransitions   hadoop.yarn.server.resourcemanager.scheduler.capacity.TestQueueParsing   hadoop.yarn.server.resourcemanager.scheduler.capacity.TestCapacitySchedulerDynamicBehavior   hadoop.yarn.server.resourcemanager.ahs.TestRMApplicationHistoryWriter   hadoop.yarn.server.resourcemanager.TestSignalContainer   hadoop.yarn.server.resourcemanager.nodelabels.TestRMNodeLabelsManager   hadoop.yarn.server.resourcemanager.TestApplicationMasterLauncher   hadoop.yarn.server.resourcemanager.TestRM   hadoop.yarn.server.resourcemanager.monitor.capacity.TestProportionalCapacityPreemptionPolicy   hadoop.yarn.server.resourcemanager.TestRMHA   hadoop.yarn.server.resourcemanager.rmapp.TestNodesListManager   hadoop.yarn.server.resourcemanager.webapp.TestRMWebServicesDelegationTokens   hadoop.yarn.server.resourcemanager.TestWorkPreservingRMRestart   hadoop.yarn.server.resourcemanager.rmapp.attempt.TestAMLivelinessMonitor   hadoop.yarn.server.resourcemanager.metrics.TestSystemMetricsPublisher   hadoop.yarn.server.resourcemanager.security.TestDelegationTokenRenewer   hadoop.yarn.server.resourcemanager.webapp.TestRMWebServicesNodes   hadoop.yarn.server.resourcemanager.TestContainerResourceUsage   hadoop.yarn.server.resourcemanager.security.TestAMRMTokens Subsystem Report/Notes Patch URL http://issues.apache.org/jira/secure/attachment/12765260/YARN-4218.2.patch Optional Tests javadoc javac unit findbugs checkstyle git revision trunk / 6d5713a Release Audit https://builds.apache.org/job/PreCommit-YARN-Build/9366/artifact/patchprocess/patchReleaseAuditProblems.txt checkstyle https://builds.apache.org/job/PreCommit-YARN-Build/9366/artifact/patchprocess/diffcheckstylehadoop-yarn-api.txt whitespace https://builds.apache.org/job/PreCommit-YARN-Build/9366/artifact/patchprocess/whitespace.txt hadoop-yarn-api test log https://builds.apache.org/job/PreCommit-YARN-Build/9366/artifact/patchprocess/testrun_hadoop-yarn-api.txt hadoop-yarn-client test log https://builds.apache.org/job/PreCommit-YARN-Build/9366/artifact/patchprocess/testrun_hadoop-yarn-client.txt hadoop-yarn-common test log https://builds.apache.org/job/PreCommit-YARN-Build/9366/artifact/patchprocess/testrun_hadoop-yarn-common.txt hadoop-yarn-server-applicationhistoryservice test log https://builds.apache.org/job/PreCommit-YARN-Build/9366/artifact/patchprocess/testrun_hadoop-yarn-server-applicationhistoryservice.txt hadoop-yarn-server-common test log https://builds.apache.org/job/PreCommit-YARN-Build/9366/artifact/patchprocess/testrun_hadoop-yarn-server-common.txt hadoop-yarn-server-resourcemanager test log https://builds.apache.org/job/PreCommit-YARN-Build/9366/artifact/patchprocess/testrun_hadoop-yarn-server-resourcemanager.txt Test Results https://builds.apache.org/job/PreCommit-YARN-Build/9366/testReport/ Java 1.7.0_55 uname Linux asf903.gq1.ygridcore.net 3.13.0-36-lowlatency #63-Ubuntu SMP PREEMPT Wed Sep 3 21:56:12 UTC 2014 x86_64 x86_64 x86_64 GNU/Linux Console output https://builds.apache.org/job/PreCommit-YARN-Build/9366/console This message was automatically generated.
        Hide
        hadoopqa Hadoop QA added a comment -
        -1 overall



        Vote Subsystem Runtime Comment
        -1 patch 0m 4s YARN-4218 does not apply to trunk. Rebase required? Wrong Branch? See https://wiki.apache.org/hadoop/HowToContribute for help.



        Subsystem Report/Notes
        JIRA Patch URL https://issues.apache.org/jira/secure/attachment/12777564/YARN-4218.2.patch
        JIRA Issue YARN-4218
        Powered by Apache Yetus 0.1.0 http://yetus.apache.org
        Console output https://builds.apache.org/job/PreCommit-YARN-Build/9973/console

        This message was automatically generated.

        Show
        hadoopqa Hadoop QA added a comment - -1 overall Vote Subsystem Runtime Comment -1 patch 0m 4s YARN-4218 does not apply to trunk. Rebase required? Wrong Branch? See https://wiki.apache.org/hadoop/HowToContribute for help. Subsystem Report/Notes JIRA Patch URL https://issues.apache.org/jira/secure/attachment/12777564/YARN-4218.2.patch JIRA Issue YARN-4218 Powered by Apache Yetus 0.1.0 http://yetus.apache.org Console output https://builds.apache.org/job/PreCommit-YARN-Build/9973/console This message was automatically generated.
        Hide
        hadoopqa Hadoop QA added a comment -
        -1 overall



        Vote Subsystem Runtime Comment
        0 reexec 0m 0s Docker mode activated.
        +1 @author 0m 0s The patch does not contain any @author tags.
        +1 test4tests 0m 0s The patch appears to include 9 new or modified test files.
        0 mvndep 1m 9s Maven dependency ordering for branch
        +1 mvninstall 7m 56s trunk passed
        +1 compile 1m 46s trunk passed with JDK v1.8.0_66
        +1 compile 2m 8s trunk passed with JDK v1.7.0_91
        +1 checkstyle 0m 36s trunk passed
        +1 mvnsite 2m 48s trunk passed
        +1 mvneclipse 1m 23s trunk passed
        +1 findbugs 5m 38s trunk passed
        +1 javadoc 2m 11s trunk passed with JDK v1.8.0_66
        +1 javadoc 4m 38s trunk passed with JDK v1.7.0_91
        0 mvndep 0m 54s Maven dependency ordering for patch
        +1 mvninstall 2m 16s the patch passed
        +1 compile 1m 47s the patch passed with JDK v1.8.0_66
        +1 cc 1m 47s the patch passed
        +1 javac 1m 47s the patch passed
        +1 compile 2m 5s the patch passed with JDK v1.7.0_91
        +1 cc 2m 5s the patch passed
        +1 javac 2m 5s the patch passed
        -1 checkstyle 0m 36s hadoop-yarn-project/hadoop-yarn: patch generated 24 new + 680 unchanged - 7 fixed = 704 total (was 687)
        +1 mvnsite 2m 38s the patch passed
        +1 mvneclipse 1m 10s the patch passed
        -1 whitespace 0m 0s The patch has 9 line(s) that end in whitespace. Use git apply --whitespace=fix.
        -1 whitespace 0m 0s The patch has 1 line(s) with tabs.
        +1 findbugs 6m 46s the patch passed
        -1 javadoc 2m 59s hadoop-yarn-project_hadoop-yarn_hadoop-yarn-server_hadoop-yarn-server-resourcemanager-jdk1.8.0_66 with JDK v1.8.0_66 generated 1 new + 99 unchanged - 1 fixed = 100 total (was 100)
        +1 javadoc 2m 0s the patch passed with JDK v1.8.0_66
        +1 javadoc 4m 27s the patch passed with JDK v1.7.0_91
        +1 unit 0m 19s hadoop-yarn-api in the patch passed with JDK v1.8.0_66.
        +1 unit 1m 53s hadoop-yarn-common in the patch passed with JDK v1.8.0_66.
        +1 unit 0m 20s hadoop-yarn-server-common in the patch passed with JDK v1.8.0_66.
        +1 unit 3m 36s hadoop-yarn-server-applicationhistoryservice in the patch passed with JDK v1.8.0_66.
        -1 unit 65m 49s hadoop-yarn-server-resourcemanager in the patch failed with JDK v1.8.0_66.
        -1 unit 64m 32s hadoop-yarn-client in the patch failed with JDK v1.8.0_66.
        +1 unit 0m 25s hadoop-yarn-api in the patch passed with JDK v1.7.0_91.
        +1 unit 2m 10s hadoop-yarn-common in the patch passed with JDK v1.7.0_91.
        +1 unit 0m 26s hadoop-yarn-server-common in the patch passed with JDK v1.7.0_91.
        +1 unit 3m 59s hadoop-yarn-server-applicationhistoryservice in the patch passed with JDK v1.7.0_91.
        -1 unit 67m 53s hadoop-yarn-server-resourcemanager in the patch failed with JDK v1.7.0_91.
        -1 unit 64m 47s hadoop-yarn-client in the patch failed with JDK v1.7.0_91.
        +1 asflicense 0m 20s Patch does not generate ASF License warnings.
        333m 28s



        Reason Tests
        JDK v1.8.0_66 Failed junit tests hadoop.yarn.server.resourcemanager.TestClientRMTokens
          hadoop.yarn.server.resourcemanager.TestAMAuthorization
          hadoop.yarn.server.resourcemanager.webapp.TestRMWebServicesApps
          hadoop.yarn.client.TestGetGroups
        JDK v1.8.0_66 Timed out junit tests org.apache.hadoop.yarn.client.cli.TestYarnCLI
          org.apache.hadoop.yarn.client.api.impl.TestYarnClient
          org.apache.hadoop.yarn.client.api.impl.TestAMRMClient
          org.apache.hadoop.yarn.client.api.impl.TestNMClient
        JDK v1.7.0_91 Failed junit tests hadoop.yarn.server.resourcemanager.TestClientRMTokens
          hadoop.yarn.server.resourcemanager.TestAMAuthorization
          hadoop.yarn.server.resourcemanager.webapp.TestRMWebServicesApps
          hadoop.yarn.client.TestGetGroups
        JDK v1.7.0_91 Timed out junit tests org.apache.hadoop.yarn.client.cli.TestYarnCLI
          org.apache.hadoop.yarn.client.api.impl.TestYarnClient
          org.apache.hadoop.yarn.client.api.impl.TestAMRMClient
          org.apache.hadoop.yarn.client.api.impl.TestNMClient



        Subsystem Report/Notes
        Docker Image:yetus/hadoop:0ca8df7
        JIRA Patch URL https://issues.apache.org/jira/secure/attachment/12784189/YARN-4218.3.patch
        JIRA Issue YARN-4218
        Optional Tests asflicense compile javac javadoc mvninstall mvnsite unit findbugs checkstyle cc
        uname Linux f6af3c3c1cbb 3.13.0-36-lowlatency #63-Ubuntu SMP PREEMPT Wed Sep 3 21:56:12 UTC 2014 x86_64 x86_64 x86_64 GNU/Linux
        Build tool maven
        Personality /testptch/hadoop/patchprocess/precommit/personality/provided.sh
        git revision trunk / 6eacdea
        Default Java 1.7.0_91
        Multi-JDK versions /usr/lib/jvm/java-8-oracle:1.8.0_66 /usr/lib/jvm/java-7-openjdk-amd64:1.7.0_91
        findbugs v3.0.0
        checkstyle https://builds.apache.org/job/PreCommit-YARN-Build/10380/artifact/patchprocess/diff-checkstyle-hadoop-yarn-project_hadoop-yarn.txt
        whitespace https://builds.apache.org/job/PreCommit-YARN-Build/10380/artifact/patchprocess/whitespace-eol.txt
        whitespace https://builds.apache.org/job/PreCommit-YARN-Build/10380/artifact/patchprocess/whitespace-tabs.txt
        javadoc hadoop-yarn-project_hadoop-yarn_hadoop-yarn-server_hadoop-yarn-server-resourcemanager-jdk1.8.0_66: https://builds.apache.org/job/PreCommit-YARN-Build/10380/artifact/patchprocess/diff-javadoc-javadoc-hadoop-yarn-project_hadoop-yarn_hadoop-yarn-server_hadoop-yarn-server-resourcemanager-jdk1.8.0_66.txt
        unit https://builds.apache.org/job/PreCommit-YARN-Build/10380/artifact/patchprocess/patch-unit-hadoop-yarn-project_hadoop-yarn_hadoop-yarn-server_hadoop-yarn-server-resourcemanager-jdk1.8.0_66.txt
        unit https://builds.apache.org/job/PreCommit-YARN-Build/10380/artifact/patchprocess/patch-unit-hadoop-yarn-project_hadoop-yarn_hadoop-yarn-client-jdk1.8.0_66.txt
        unit https://builds.apache.org/job/PreCommit-YARN-Build/10380/artifact/patchprocess/patch-unit-hadoop-yarn-project_hadoop-yarn_hadoop-yarn-server_hadoop-yarn-server-resourcemanager-jdk1.7.0_91.txt
        unit https://builds.apache.org/job/PreCommit-YARN-Build/10380/artifact/patchprocess/patch-unit-hadoop-yarn-project_hadoop-yarn_hadoop-yarn-client-jdk1.7.0_91.txt
        unit test logs https://builds.apache.org/job/PreCommit-YARN-Build/10380/artifact/patchprocess/patch-unit-hadoop-yarn-project_hadoop-yarn_hadoop-yarn-server_hadoop-yarn-server-resourcemanager-jdk1.8.0_66.txt https://builds.apache.org/job/PreCommit-YARN-Build/10380/artifact/patchprocess/patch-unit-hadoop-yarn-project_hadoop-yarn_hadoop-yarn-client-jdk1.8.0_66.txt https://builds.apache.org/job/PreCommit-YARN-Build/10380/artifact/patchprocess/patch-unit-hadoop-yarn-project_hadoop-yarn_hadoop-yarn-server_hadoop-yarn-server-resourcemanager-jdk1.7.0_91.txt https://builds.apache.org/job/PreCommit-YARN-Build/10380/artifact/patchprocess/patch-unit-hadoop-yarn-project_hadoop-yarn_hadoop-yarn-client-jdk1.7.0_91.txt
        JDK v1.7.0_91 Test Results https://builds.apache.org/job/PreCommit-YARN-Build/10380/testReport/
        modules C: hadoop-yarn-project/hadoop-yarn/hadoop-yarn-api hadoop-yarn-project/hadoop-yarn/hadoop-yarn-common hadoop-yarn-project/hadoop-yarn/hadoop-yarn-server/hadoop-yarn-server-common hadoop-yarn-project/hadoop-yarn/hadoop-yarn-server/hadoop-yarn-server-applicationhistoryservice hadoop-yarn-project/hadoop-yarn/hadoop-yarn-server/hadoop-yarn-server-resourcemanager hadoop-yarn-project/hadoop-yarn/hadoop-yarn-client U: hadoop-yarn-project/hadoop-yarn
        Max memory used 76MB
        Powered by Apache Yetus 0.2.0-SNAPSHOT http://yetus.apache.org
        Console output https://builds.apache.org/job/PreCommit-YARN-Build/10380/console

        This message was automatically generated.

        Show
        hadoopqa Hadoop QA added a comment - -1 overall Vote Subsystem Runtime Comment 0 reexec 0m 0s Docker mode activated. +1 @author 0m 0s The patch does not contain any @author tags. +1 test4tests 0m 0s The patch appears to include 9 new or modified test files. 0 mvndep 1m 9s Maven dependency ordering for branch +1 mvninstall 7m 56s trunk passed +1 compile 1m 46s trunk passed with JDK v1.8.0_66 +1 compile 2m 8s trunk passed with JDK v1.7.0_91 +1 checkstyle 0m 36s trunk passed +1 mvnsite 2m 48s trunk passed +1 mvneclipse 1m 23s trunk passed +1 findbugs 5m 38s trunk passed +1 javadoc 2m 11s trunk passed with JDK v1.8.0_66 +1 javadoc 4m 38s trunk passed with JDK v1.7.0_91 0 mvndep 0m 54s Maven dependency ordering for patch +1 mvninstall 2m 16s the patch passed +1 compile 1m 47s the patch passed with JDK v1.8.0_66 +1 cc 1m 47s the patch passed +1 javac 1m 47s the patch passed +1 compile 2m 5s the patch passed with JDK v1.7.0_91 +1 cc 2m 5s the patch passed +1 javac 2m 5s the patch passed -1 checkstyle 0m 36s hadoop-yarn-project/hadoop-yarn: patch generated 24 new + 680 unchanged - 7 fixed = 704 total (was 687) +1 mvnsite 2m 38s the patch passed +1 mvneclipse 1m 10s the patch passed -1 whitespace 0m 0s The patch has 9 line(s) that end in whitespace. Use git apply --whitespace=fix. -1 whitespace 0m 0s The patch has 1 line(s) with tabs. +1 findbugs 6m 46s the patch passed -1 javadoc 2m 59s hadoop-yarn-project_hadoop-yarn_hadoop-yarn-server_hadoop-yarn-server-resourcemanager-jdk1.8.0_66 with JDK v1.8.0_66 generated 1 new + 99 unchanged - 1 fixed = 100 total (was 100) +1 javadoc 2m 0s the patch passed with JDK v1.8.0_66 +1 javadoc 4m 27s the patch passed with JDK v1.7.0_91 +1 unit 0m 19s hadoop-yarn-api in the patch passed with JDK v1.8.0_66. +1 unit 1m 53s hadoop-yarn-common in the patch passed with JDK v1.8.0_66. +1 unit 0m 20s hadoop-yarn-server-common in the patch passed with JDK v1.8.0_66. +1 unit 3m 36s hadoop-yarn-server-applicationhistoryservice in the patch passed with JDK v1.8.0_66. -1 unit 65m 49s hadoop-yarn-server-resourcemanager in the patch failed with JDK v1.8.0_66. -1 unit 64m 32s hadoop-yarn-client in the patch failed with JDK v1.8.0_66. +1 unit 0m 25s hadoop-yarn-api in the patch passed with JDK v1.7.0_91. +1 unit 2m 10s hadoop-yarn-common in the patch passed with JDK v1.7.0_91. +1 unit 0m 26s hadoop-yarn-server-common in the patch passed with JDK v1.7.0_91. +1 unit 3m 59s hadoop-yarn-server-applicationhistoryservice in the patch passed with JDK v1.7.0_91. -1 unit 67m 53s hadoop-yarn-server-resourcemanager in the patch failed with JDK v1.7.0_91. -1 unit 64m 47s hadoop-yarn-client in the patch failed with JDK v1.7.0_91. +1 asflicense 0m 20s Patch does not generate ASF License warnings. 333m 28s Reason Tests JDK v1.8.0_66 Failed junit tests hadoop.yarn.server.resourcemanager.TestClientRMTokens   hadoop.yarn.server.resourcemanager.TestAMAuthorization   hadoop.yarn.server.resourcemanager.webapp.TestRMWebServicesApps   hadoop.yarn.client.TestGetGroups JDK v1.8.0_66 Timed out junit tests org.apache.hadoop.yarn.client.cli.TestYarnCLI   org.apache.hadoop.yarn.client.api.impl.TestYarnClient   org.apache.hadoop.yarn.client.api.impl.TestAMRMClient   org.apache.hadoop.yarn.client.api.impl.TestNMClient JDK v1.7.0_91 Failed junit tests hadoop.yarn.server.resourcemanager.TestClientRMTokens   hadoop.yarn.server.resourcemanager.TestAMAuthorization   hadoop.yarn.server.resourcemanager.webapp.TestRMWebServicesApps   hadoop.yarn.client.TestGetGroups JDK v1.7.0_91 Timed out junit tests org.apache.hadoop.yarn.client.cli.TestYarnCLI   org.apache.hadoop.yarn.client.api.impl.TestYarnClient   org.apache.hadoop.yarn.client.api.impl.TestAMRMClient   org.apache.hadoop.yarn.client.api.impl.TestNMClient Subsystem Report/Notes Docker Image:yetus/hadoop:0ca8df7 JIRA Patch URL https://issues.apache.org/jira/secure/attachment/12784189/YARN-4218.3.patch JIRA Issue YARN-4218 Optional Tests asflicense compile javac javadoc mvninstall mvnsite unit findbugs checkstyle cc uname Linux f6af3c3c1cbb 3.13.0-36-lowlatency #63-Ubuntu SMP PREEMPT Wed Sep 3 21:56:12 UTC 2014 x86_64 x86_64 x86_64 GNU/Linux Build tool maven Personality /testptch/hadoop/patchprocess/precommit/personality/provided.sh git revision trunk / 6eacdea Default Java 1.7.0_91 Multi-JDK versions /usr/lib/jvm/java-8-oracle:1.8.0_66 /usr/lib/jvm/java-7-openjdk-amd64:1.7.0_91 findbugs v3.0.0 checkstyle https://builds.apache.org/job/PreCommit-YARN-Build/10380/artifact/patchprocess/diff-checkstyle-hadoop-yarn-project_hadoop-yarn.txt whitespace https://builds.apache.org/job/PreCommit-YARN-Build/10380/artifact/patchprocess/whitespace-eol.txt whitespace https://builds.apache.org/job/PreCommit-YARN-Build/10380/artifact/patchprocess/whitespace-tabs.txt javadoc hadoop-yarn-project_hadoop-yarn_hadoop-yarn-server_hadoop-yarn-server-resourcemanager-jdk1.8.0_66: https://builds.apache.org/job/PreCommit-YARN-Build/10380/artifact/patchprocess/diff-javadoc-javadoc-hadoop-yarn-project_hadoop-yarn_hadoop-yarn-server_hadoop-yarn-server-resourcemanager-jdk1.8.0_66.txt unit https://builds.apache.org/job/PreCommit-YARN-Build/10380/artifact/patchprocess/patch-unit-hadoop-yarn-project_hadoop-yarn_hadoop-yarn-server_hadoop-yarn-server-resourcemanager-jdk1.8.0_66.txt unit https://builds.apache.org/job/PreCommit-YARN-Build/10380/artifact/patchprocess/patch-unit-hadoop-yarn-project_hadoop-yarn_hadoop-yarn-client-jdk1.8.0_66.txt unit https://builds.apache.org/job/PreCommit-YARN-Build/10380/artifact/patchprocess/patch-unit-hadoop-yarn-project_hadoop-yarn_hadoop-yarn-server_hadoop-yarn-server-resourcemanager-jdk1.7.0_91.txt unit https://builds.apache.org/job/PreCommit-YARN-Build/10380/artifact/patchprocess/patch-unit-hadoop-yarn-project_hadoop-yarn_hadoop-yarn-client-jdk1.7.0_91.txt unit test logs https://builds.apache.org/job/PreCommit-YARN-Build/10380/artifact/patchprocess/patch-unit-hadoop-yarn-project_hadoop-yarn_hadoop-yarn-server_hadoop-yarn-server-resourcemanager-jdk1.8.0_66.txt https://builds.apache.org/job/PreCommit-YARN-Build/10380/artifact/patchprocess/patch-unit-hadoop-yarn-project_hadoop-yarn_hadoop-yarn-client-jdk1.8.0_66.txt https://builds.apache.org/job/PreCommit-YARN-Build/10380/artifact/patchprocess/patch-unit-hadoop-yarn-project_hadoop-yarn_hadoop-yarn-server_hadoop-yarn-server-resourcemanager-jdk1.7.0_91.txt https://builds.apache.org/job/PreCommit-YARN-Build/10380/artifact/patchprocess/patch-unit-hadoop-yarn-project_hadoop-yarn_hadoop-yarn-client-jdk1.7.0_91.txt JDK v1.7.0_91 Test Results https://builds.apache.org/job/PreCommit-YARN-Build/10380/testReport/ modules C: hadoop-yarn-project/hadoop-yarn/hadoop-yarn-api hadoop-yarn-project/hadoop-yarn/hadoop-yarn-common hadoop-yarn-project/hadoop-yarn/hadoop-yarn-server/hadoop-yarn-server-common hadoop-yarn-project/hadoop-yarn/hadoop-yarn-server/hadoop-yarn-server-applicationhistoryservice hadoop-yarn-project/hadoop-yarn/hadoop-yarn-server/hadoop-yarn-server-resourcemanager hadoop-yarn-project/hadoop-yarn/hadoop-yarn-client U: hadoop-yarn-project/hadoop-yarn Max memory used 76MB Powered by Apache Yetus 0.2.0-SNAPSHOT http://yetus.apache.org Console output https://builds.apache.org/job/PreCommit-YARN-Build/10380/console This message was automatically generated.
        Hide
        eepayne Eric Payne added a comment - - edited

        Cancelling patch since it no longer applies. I will review the patch and provide feedback shortly.

        Show
        eepayne Eric Payne added a comment - - edited Cancelling patch since it no longer applies. I will review the patch and provide feedback shortly.
        Hide
        eepayne Eric Payne added a comment -

        Chang Li, Thank you very much for adding this useful metric. I'm sorry that it took so long to review this patch.

        The patch looks good to me. Please upmerge it and I will commit it to trunk.

        Also, this feature would be good to have in branch-2 and branch-2.8. Can you please also provide a patch for those branches?

        Show
        eepayne Eric Payne added a comment - Chang Li , Thank you very much for adding this useful metric. I'm sorry that it took so long to review this patch. The patch looks good to me. Please upmerge it and I will commit it to trunk. Also, this feature would be good to have in branch-2 and branch-2.8. Can you please also provide a patch for those branches?
        Hide
        hadoopqa Hadoop QA added a comment -
        -1 overall



        Vote Subsystem Runtime Comment
        0 reexec 0m 0s Docker mode activated.
        -1 patch 0m 5s YARN-4218 does not apply to trunk. Rebase required? Wrong Branch? See https://wiki.apache.org/hadoop/HowToContribute for help.



        Subsystem Report/Notes
        JIRA Issue YARN-4218
        JIRA Patch URL https://issues.apache.org/jira/secure/attachment/12836007/YARN-4218.4.patch
        Console output https://builds.apache.org/job/PreCommit-YARN-Build/13675/console
        Powered by Apache Yetus 0.4.0-SNAPSHOT http://yetus.apache.org

        This message was automatically generated.

        Show
        hadoopqa Hadoop QA added a comment - -1 overall Vote Subsystem Runtime Comment 0 reexec 0m 0s Docker mode activated. -1 patch 0m 5s YARN-4218 does not apply to trunk. Rebase required? Wrong Branch? See https://wiki.apache.org/hadoop/HowToContribute for help. Subsystem Report/Notes JIRA Issue YARN-4218 JIRA Patch URL https://issues.apache.org/jira/secure/attachment/12836007/YARN-4218.4.patch Console output https://builds.apache.org/job/PreCommit-YARN-Build/13675/console Powered by Apache Yetus 0.4.0-SNAPSHOT http://yetus.apache.org This message was automatically generated.
        Hide
        lichangleo Chang Li added a comment -

        Thanks for review Eric Payne. I have upmerged the patch and upload the .4 patch. Have verified that it works against the latest branch-2

        Show
        lichangleo Chang Li added a comment - Thanks for review Eric Payne . I have upmerged the patch and upload the .4 patch. Have verified that it works against the latest branch-2
        Hide
        lichangleo Chang Li added a comment -

        it seems patch generated by

         git diff HEAD --no-prefix 

        is not accepted by HADOOP QA? post again .trunk patch generated by

         git diff trunk 
        Show
        lichangleo Chang Li added a comment - it seems patch generated by git diff HEAD --no-prefix is not accepted by HADOOP QA? post again .trunk patch generated by git diff trunk
        Hide
        hadoopqa Hadoop QA added a comment -
        -1 overall



        Vote Subsystem Runtime Comment
        0 reexec 0m 17s Docker mode activated.
        +1 @author 0m 0s The patch does not contain any @author tags.
        +1 test4tests 0m 0s The patch appears to include 9 new or modified test files.
        0 mvndep 0m 9s Maven dependency ordering for branch
        +1 mvninstall 6m 46s trunk passed
        +1 compile 2m 17s trunk passed
        +1 checkstyle 0m 49s trunk passed
        +1 mvnsite 2m 42s trunk passed
        +1 mvneclipse 1m 23s trunk passed
        +1 findbugs 4m 26s trunk passed
        +1 javadoc 1m 49s trunk passed
        0 mvndep 0m 10s Maven dependency ordering for patch
        -1 mvninstall 0m 29s hadoop-yarn-server-resourcemanager in the patch failed.
        -1 compile 1m 38s hadoop-yarn in the patch failed.
        -1 cc 1m 38s hadoop-yarn in the patch failed.
        -1 javac 1m 38s hadoop-yarn in the patch failed.
        -0 checkstyle 0m 49s hadoop-yarn-project/hadoop-yarn: The patch generated 29 new + 896 unchanged - 9 fixed = 925 total (was 905)
        -1 mvnsite 0m 30s hadoop-yarn-server-resourcemanager in the patch failed.
        +1 mvneclipse 1m 15s the patch passed
        -1 whitespace 0m 0s The patch has 9 line(s) that end in whitespace. Use git apply --whitespace=fix <<patch_file>>. Refer https://git-scm.com/docs/git-apply
        -1 whitespace 0m 0s The patch 1 line(s) with tabs.
        -1 findbugs 0m 21s hadoop-yarn-server-resourcemanager in the patch failed.
        -1 javadoc 0m 20s hadoop-yarn-project_hadoop-yarn_hadoop-yarn-server_hadoop-yarn-server-resourcemanager generated 1 new + 938 unchanged - 0 fixed = 939 total (was 938)
        +1 unit 0m 24s hadoop-yarn-api in the patch passed.
        +1 unit 2m 17s hadoop-yarn-common in the patch passed.
        +1 unit 0m 26s hadoop-yarn-server-common in the patch passed.
        +1 unit 3m 9s hadoop-yarn-server-applicationhistoryservice in the patch passed.
        -1 unit 0m 31s hadoop-yarn-server-resourcemanager in the patch failed.
        -1 unit 1m 16s hadoop-yarn-client in the patch failed.
        +1 asflicense 0m 19s The patch does not generate ASF License warnings.
        52m 25s



        Reason Tests
        Failed junit tests hadoop.yarn.client.TestResourceTrackerOnHA
          hadoop.yarn.client.api.impl.TestAMRMProxy
          hadoop.yarn.client.api.impl.TestOpportunisticContainerAllocation
          hadoop.yarn.client.api.impl.TestYarnClient
          hadoop.yarn.client.api.impl.TestDistributedScheduling
          hadoop.yarn.client.TestResourceManagerAdministrationProtocolPBClientImpl
          hadoop.yarn.client.api.impl.TestAMRMClient
          hadoop.yarn.client.TestGetGroups
          hadoop.yarn.client.api.impl.TestNMClient
          hadoop.yarn.client.TestHedgingRequestRMFailoverProxyProvider
          hadoop.yarn.client.TestApplicationClientProtocolOnHA
          hadoop.yarn.client.api.impl.TestAMRMClientOnRMRestart
          hadoop.yarn.client.TestApplicationMasterServiceProtocolOnHA
          hadoop.yarn.client.TestRMFailover
          hadoop.yarn.client.cli.TestYarnCLI



        Subsystem Report/Notes
        Docker Image:yetus/hadoop:9560f25
        JIRA Issue YARN-4218
        JIRA Patch URL https://issues.apache.org/jira/secure/attachment/12836012/YARN-4218.trunk.patch
        Optional Tests asflicense compile javac javadoc mvninstall mvnsite unit findbugs checkstyle cc
        uname Linux 70bae0f66336 3.13.0-95-generic #142-Ubuntu SMP Fri Aug 12 17:00:09 UTC 2016 x86_64 x86_64 x86_64 GNU/Linux
        Build tool maven
        Personality /testptch/hadoop/patchprocess/precommit/personality/provided.sh
        git revision trunk / aa3cab1
        Default Java 1.8.0_101
        findbugs v3.0.0
        mvninstall https://builds.apache.org/job/PreCommit-YARN-Build/13676/artifact/patchprocess/patch-mvninstall-hadoop-yarn-project_hadoop-yarn_hadoop-yarn-server_hadoop-yarn-server-resourcemanager.txt
        compile https://builds.apache.org/job/PreCommit-YARN-Build/13676/artifact/patchprocess/patch-compile-hadoop-yarn-project_hadoop-yarn.txt
        cc https://builds.apache.org/job/PreCommit-YARN-Build/13676/artifact/patchprocess/patch-compile-hadoop-yarn-project_hadoop-yarn.txt
        javac https://builds.apache.org/job/PreCommit-YARN-Build/13676/artifact/patchprocess/patch-compile-hadoop-yarn-project_hadoop-yarn.txt
        checkstyle https://builds.apache.org/job/PreCommit-YARN-Build/13676/artifact/patchprocess/diff-checkstyle-hadoop-yarn-project_hadoop-yarn.txt
        mvnsite https://builds.apache.org/job/PreCommit-YARN-Build/13676/artifact/patchprocess/patch-mvnsite-hadoop-yarn-project_hadoop-yarn_hadoop-yarn-server_hadoop-yarn-server-resourcemanager.txt
        whitespace https://builds.apache.org/job/PreCommit-YARN-Build/13676/artifact/patchprocess/whitespace-eol.txt
        whitespace https://builds.apache.org/job/PreCommit-YARN-Build/13676/artifact/patchprocess/whitespace-tabs.txt
        findbugs https://builds.apache.org/job/PreCommit-YARN-Build/13676/artifact/patchprocess/patch-findbugs-hadoop-yarn-project_hadoop-yarn_hadoop-yarn-server_hadoop-yarn-server-resourcemanager.txt
        javadoc https://builds.apache.org/job/PreCommit-YARN-Build/13676/artifact/patchprocess/diff-javadoc-javadoc-hadoop-yarn-project_hadoop-yarn_hadoop-yarn-server_hadoop-yarn-server-resourcemanager.txt
        unit https://builds.apache.org/job/PreCommit-YARN-Build/13676/artifact/patchprocess/patch-unit-hadoop-yarn-project_hadoop-yarn_hadoop-yarn-server_hadoop-yarn-server-resourcemanager.txt
        unit https://builds.apache.org/job/PreCommit-YARN-Build/13676/artifact/patchprocess/patch-unit-hadoop-yarn-project_hadoop-yarn_hadoop-yarn-client.txt
        Test Results https://builds.apache.org/job/PreCommit-YARN-Build/13676/testReport/
        modules C: hadoop-yarn-project/hadoop-yarn/hadoop-yarn-api hadoop-yarn-project/hadoop-yarn/hadoop-yarn-common hadoop-yarn-project/hadoop-yarn/hadoop-yarn-server/hadoop-yarn-server-common hadoop-yarn-project/hadoop-yarn/hadoop-yarn-server/hadoop-yarn-server-applicationhistoryservice hadoop-yarn-project/hadoop-yarn/hadoop-yarn-server/hadoop-yarn-server-resourcemanager hadoop-yarn-project/hadoop-yarn/hadoop-yarn-client U: hadoop-yarn-project/hadoop-yarn
        Console output https://builds.apache.org/job/PreCommit-YARN-Build/13676/console
        Powered by Apache Yetus 0.4.0-SNAPSHOT http://yetus.apache.org

        This message was automatically generated.

        Show
        hadoopqa Hadoop QA added a comment - -1 overall Vote Subsystem Runtime Comment 0 reexec 0m 17s Docker mode activated. +1 @author 0m 0s The patch does not contain any @author tags. +1 test4tests 0m 0s The patch appears to include 9 new or modified test files. 0 mvndep 0m 9s Maven dependency ordering for branch +1 mvninstall 6m 46s trunk passed +1 compile 2m 17s trunk passed +1 checkstyle 0m 49s trunk passed +1 mvnsite 2m 42s trunk passed +1 mvneclipse 1m 23s trunk passed +1 findbugs 4m 26s trunk passed +1 javadoc 1m 49s trunk passed 0 mvndep 0m 10s Maven dependency ordering for patch -1 mvninstall 0m 29s hadoop-yarn-server-resourcemanager in the patch failed. -1 compile 1m 38s hadoop-yarn in the patch failed. -1 cc 1m 38s hadoop-yarn in the patch failed. -1 javac 1m 38s hadoop-yarn in the patch failed. -0 checkstyle 0m 49s hadoop-yarn-project/hadoop-yarn: The patch generated 29 new + 896 unchanged - 9 fixed = 925 total (was 905) -1 mvnsite 0m 30s hadoop-yarn-server-resourcemanager in the patch failed. +1 mvneclipse 1m 15s the patch passed -1 whitespace 0m 0s The patch has 9 line(s) that end in whitespace. Use git apply --whitespace=fix <<patch_file>>. Refer https://git-scm.com/docs/git-apply -1 whitespace 0m 0s The patch 1 line(s) with tabs. -1 findbugs 0m 21s hadoop-yarn-server-resourcemanager in the patch failed. -1 javadoc 0m 20s hadoop-yarn-project_hadoop-yarn_hadoop-yarn-server_hadoop-yarn-server-resourcemanager generated 1 new + 938 unchanged - 0 fixed = 939 total (was 938) +1 unit 0m 24s hadoop-yarn-api in the patch passed. +1 unit 2m 17s hadoop-yarn-common in the patch passed. +1 unit 0m 26s hadoop-yarn-server-common in the patch passed. +1 unit 3m 9s hadoop-yarn-server-applicationhistoryservice in the patch passed. -1 unit 0m 31s hadoop-yarn-server-resourcemanager in the patch failed. -1 unit 1m 16s hadoop-yarn-client in the patch failed. +1 asflicense 0m 19s The patch does not generate ASF License warnings. 52m 25s Reason Tests Failed junit tests hadoop.yarn.client.TestResourceTrackerOnHA   hadoop.yarn.client.api.impl.TestAMRMProxy   hadoop.yarn.client.api.impl.TestOpportunisticContainerAllocation   hadoop.yarn.client.api.impl.TestYarnClient   hadoop.yarn.client.api.impl.TestDistributedScheduling   hadoop.yarn.client.TestResourceManagerAdministrationProtocolPBClientImpl   hadoop.yarn.client.api.impl.TestAMRMClient   hadoop.yarn.client.TestGetGroups   hadoop.yarn.client.api.impl.TestNMClient   hadoop.yarn.client.TestHedgingRequestRMFailoverProxyProvider   hadoop.yarn.client.TestApplicationClientProtocolOnHA   hadoop.yarn.client.api.impl.TestAMRMClientOnRMRestart   hadoop.yarn.client.TestApplicationMasterServiceProtocolOnHA   hadoop.yarn.client.TestRMFailover   hadoop.yarn.client.cli.TestYarnCLI Subsystem Report/Notes Docker Image:yetus/hadoop:9560f25 JIRA Issue YARN-4218 JIRA Patch URL https://issues.apache.org/jira/secure/attachment/12836012/YARN-4218.trunk.patch Optional Tests asflicense compile javac javadoc mvninstall mvnsite unit findbugs checkstyle cc uname Linux 70bae0f66336 3.13.0-95-generic #142-Ubuntu SMP Fri Aug 12 17:00:09 UTC 2016 x86_64 x86_64 x86_64 GNU/Linux Build tool maven Personality /testptch/hadoop/patchprocess/precommit/personality/provided.sh git revision trunk / aa3cab1 Default Java 1.8.0_101 findbugs v3.0.0 mvninstall https://builds.apache.org/job/PreCommit-YARN-Build/13676/artifact/patchprocess/patch-mvninstall-hadoop-yarn-project_hadoop-yarn_hadoop-yarn-server_hadoop-yarn-server-resourcemanager.txt compile https://builds.apache.org/job/PreCommit-YARN-Build/13676/artifact/patchprocess/patch-compile-hadoop-yarn-project_hadoop-yarn.txt cc https://builds.apache.org/job/PreCommit-YARN-Build/13676/artifact/patchprocess/patch-compile-hadoop-yarn-project_hadoop-yarn.txt javac https://builds.apache.org/job/PreCommit-YARN-Build/13676/artifact/patchprocess/patch-compile-hadoop-yarn-project_hadoop-yarn.txt checkstyle https://builds.apache.org/job/PreCommit-YARN-Build/13676/artifact/patchprocess/diff-checkstyle-hadoop-yarn-project_hadoop-yarn.txt mvnsite https://builds.apache.org/job/PreCommit-YARN-Build/13676/artifact/patchprocess/patch-mvnsite-hadoop-yarn-project_hadoop-yarn_hadoop-yarn-server_hadoop-yarn-server-resourcemanager.txt whitespace https://builds.apache.org/job/PreCommit-YARN-Build/13676/artifact/patchprocess/whitespace-eol.txt whitespace https://builds.apache.org/job/PreCommit-YARN-Build/13676/artifact/patchprocess/whitespace-tabs.txt findbugs https://builds.apache.org/job/PreCommit-YARN-Build/13676/artifact/patchprocess/patch-findbugs-hadoop-yarn-project_hadoop-yarn_hadoop-yarn-server_hadoop-yarn-server-resourcemanager.txt javadoc https://builds.apache.org/job/PreCommit-YARN-Build/13676/artifact/patchprocess/diff-javadoc-javadoc-hadoop-yarn-project_hadoop-yarn_hadoop-yarn-server_hadoop-yarn-server-resourcemanager.txt unit https://builds.apache.org/job/PreCommit-YARN-Build/13676/artifact/patchprocess/patch-unit-hadoop-yarn-project_hadoop-yarn_hadoop-yarn-server_hadoop-yarn-server-resourcemanager.txt unit https://builds.apache.org/job/PreCommit-YARN-Build/13676/artifact/patchprocess/patch-unit-hadoop-yarn-project_hadoop-yarn_hadoop-yarn-client.txt Test Results https://builds.apache.org/job/PreCommit-YARN-Build/13676/testReport/ modules C: hadoop-yarn-project/hadoop-yarn/hadoop-yarn-api hadoop-yarn-project/hadoop-yarn/hadoop-yarn-common hadoop-yarn-project/hadoop-yarn/hadoop-yarn-server/hadoop-yarn-server-common hadoop-yarn-project/hadoop-yarn/hadoop-yarn-server/hadoop-yarn-server-applicationhistoryservice hadoop-yarn-project/hadoop-yarn/hadoop-yarn-server/hadoop-yarn-server-resourcemanager hadoop-yarn-project/hadoop-yarn/hadoop-yarn-client U: hadoop-yarn-project/hadoop-yarn Console output https://builds.apache.org/job/PreCommit-YARN-Build/13676/console Powered by Apache Yetus 0.4.0-SNAPSHOT http://yetus.apache.org This message was automatically generated.
        Hide
        hadoopqa Hadoop QA added a comment -
        -1 overall



        Vote Subsystem Runtime Comment
        0 reexec 0m 18s Docker mode activated.
        +1 @author 0m 0s The patch does not contain any @author tags.
        +1 test4tests 0m 0s The patch appears to include 9 new or modified test files.
        0 mvndep 0m 9s Maven dependency ordering for branch
        +1 mvninstall 6m 41s trunk passed
        +1 compile 2m 18s trunk passed
        +1 checkstyle 0m 49s trunk passed
        +1 mvnsite 2m 41s trunk passed
        +1 mvneclipse 1m 22s trunk passed
        +1 findbugs 4m 27s trunk passed
        +1 javadoc 1m 51s trunk passed
        0 mvndep 0m 10s Maven dependency ordering for patch
        -1 mvninstall 0m 30s hadoop-yarn-server-resourcemanager in the patch failed.
        -1 compile 1m 38s hadoop-yarn in the patch failed.
        -1 cc 1m 38s hadoop-yarn in the patch failed.
        -1 javac 1m 38s hadoop-yarn in the patch failed.
        -0 checkstyle 0m 48s hadoop-yarn-project/hadoop-yarn: The patch generated 27 new + 897 unchanged - 8 fixed = 924 total (was 905)
        -1 mvnsite 0m 31s hadoop-yarn-server-resourcemanager in the patch failed.
        +1 mvneclipse 1m 15s the patch passed
        +1 whitespace 0m 0s The patch has no whitespace issues.
        -1 findbugs 0m 21s hadoop-yarn-server-resourcemanager in the patch failed.
        -1 javadoc 0m 20s hadoop-yarn-project_hadoop-yarn_hadoop-yarn-server_hadoop-yarn-server-resourcemanager generated 1 new + 938 unchanged - 0 fixed = 939 total (was 938)
        +1 unit 0m 25s hadoop-yarn-api in the patch passed.
        +1 unit 2m 16s hadoop-yarn-common in the patch passed.
        +1 unit 0m 26s hadoop-yarn-server-common in the patch passed.
        +1 unit 3m 8s hadoop-yarn-server-applicationhistoryservice in the patch passed.
        -1 unit 0m 31s hadoop-yarn-server-resourcemanager in the patch failed.
        -1 unit 1m 16s hadoop-yarn-client in the patch failed.
        +1 asflicense 0m 19s The patch does not generate ASF License warnings.
        52m 21s



        Reason Tests
        Failed junit tests hadoop.yarn.client.TestResourceTrackerOnHA
          hadoop.yarn.client.api.impl.TestAMRMProxy
          hadoop.yarn.client.api.impl.TestOpportunisticContainerAllocation
          hadoop.yarn.client.api.impl.TestYarnClient
          hadoop.yarn.client.api.impl.TestDistributedScheduling
          hadoop.yarn.client.TestResourceManagerAdministrationProtocolPBClientImpl
          hadoop.yarn.client.api.impl.TestAMRMClient
          hadoop.yarn.client.TestGetGroups
          hadoop.yarn.client.api.impl.TestNMClient
          hadoop.yarn.client.TestHedgingRequestRMFailoverProxyProvider
          hadoop.yarn.client.TestApplicationClientProtocolOnHA
          hadoop.yarn.client.api.impl.TestAMRMClientOnRMRestart
          hadoop.yarn.client.TestApplicationMasterServiceProtocolOnHA
          hadoop.yarn.client.TestRMFailover
          hadoop.yarn.client.cli.TestYarnCLI



        Subsystem Report/Notes
        Docker Image:yetus/hadoop:9560f25
        JIRA Issue YARN-4218
        JIRA Patch URL https://issues.apache.org/jira/secure/attachment/12836038/YARN-4218.trunk.2.patch
        Optional Tests asflicense compile javac javadoc mvninstall mvnsite unit findbugs checkstyle cc
        uname Linux 4c92939597ce 3.13.0-95-generic #142-Ubuntu SMP Fri Aug 12 17:00:09 UTC 2016 x86_64 x86_64 x86_64 GNU/Linux
        Build tool maven
        Personality /testptch/hadoop/patchprocess/precommit/personality/provided.sh
        git revision trunk / aa3cab1
        Default Java 1.8.0_101
        findbugs v3.0.0
        mvninstall https://builds.apache.org/job/PreCommit-YARN-Build/13678/artifact/patchprocess/patch-mvninstall-hadoop-yarn-project_hadoop-yarn_hadoop-yarn-server_hadoop-yarn-server-resourcemanager.txt
        compile https://builds.apache.org/job/PreCommit-YARN-Build/13678/artifact/patchprocess/patch-compile-hadoop-yarn-project_hadoop-yarn.txt
        cc https://builds.apache.org/job/PreCommit-YARN-Build/13678/artifact/patchprocess/patch-compile-hadoop-yarn-project_hadoop-yarn.txt
        javac https://builds.apache.org/job/PreCommit-YARN-Build/13678/artifact/patchprocess/patch-compile-hadoop-yarn-project_hadoop-yarn.txt
        checkstyle https://builds.apache.org/job/PreCommit-YARN-Build/13678/artifact/patchprocess/diff-checkstyle-hadoop-yarn-project_hadoop-yarn.txt
        mvnsite https://builds.apache.org/job/PreCommit-YARN-Build/13678/artifact/patchprocess/patch-mvnsite-hadoop-yarn-project_hadoop-yarn_hadoop-yarn-server_hadoop-yarn-server-resourcemanager.txt
        findbugs https://builds.apache.org/job/PreCommit-YARN-Build/13678/artifact/patchprocess/patch-findbugs-hadoop-yarn-project_hadoop-yarn_hadoop-yarn-server_hadoop-yarn-server-resourcemanager.txt
        javadoc https://builds.apache.org/job/PreCommit-YARN-Build/13678/artifact/patchprocess/diff-javadoc-javadoc-hadoop-yarn-project_hadoop-yarn_hadoop-yarn-server_hadoop-yarn-server-resourcemanager.txt
        unit https://builds.apache.org/job/PreCommit-YARN-Build/13678/artifact/patchprocess/patch-unit-hadoop-yarn-project_hadoop-yarn_hadoop-yarn-server_hadoop-yarn-server-resourcemanager.txt
        unit https://builds.apache.org/job/PreCommit-YARN-Build/13678/artifact/patchprocess/patch-unit-hadoop-yarn-project_hadoop-yarn_hadoop-yarn-client.txt
        Test Results https://builds.apache.org/job/PreCommit-YARN-Build/13678/testReport/
        modules C: hadoop-yarn-project/hadoop-yarn/hadoop-yarn-api hadoop-yarn-project/hadoop-yarn/hadoop-yarn-common hadoop-yarn-project/hadoop-yarn/hadoop-yarn-server/hadoop-yarn-server-common hadoop-yarn-project/hadoop-yarn/hadoop-yarn-server/hadoop-yarn-server-applicationhistoryservice hadoop-yarn-project/hadoop-yarn/hadoop-yarn-server/hadoop-yarn-server-resourcemanager hadoop-yarn-project/hadoop-yarn/hadoop-yarn-client U: hadoop-yarn-project/hadoop-yarn
        Console output https://builds.apache.org/job/PreCommit-YARN-Build/13678/console
        Powered by Apache Yetus 0.4.0-SNAPSHOT http://yetus.apache.org

        This message was automatically generated.

        Show
        hadoopqa Hadoop QA added a comment - -1 overall Vote Subsystem Runtime Comment 0 reexec 0m 18s Docker mode activated. +1 @author 0m 0s The patch does not contain any @author tags. +1 test4tests 0m 0s The patch appears to include 9 new or modified test files. 0 mvndep 0m 9s Maven dependency ordering for branch +1 mvninstall 6m 41s trunk passed +1 compile 2m 18s trunk passed +1 checkstyle 0m 49s trunk passed +1 mvnsite 2m 41s trunk passed +1 mvneclipse 1m 22s trunk passed +1 findbugs 4m 27s trunk passed +1 javadoc 1m 51s trunk passed 0 mvndep 0m 10s Maven dependency ordering for patch -1 mvninstall 0m 30s hadoop-yarn-server-resourcemanager in the patch failed. -1 compile 1m 38s hadoop-yarn in the patch failed. -1 cc 1m 38s hadoop-yarn in the patch failed. -1 javac 1m 38s hadoop-yarn in the patch failed. -0 checkstyle 0m 48s hadoop-yarn-project/hadoop-yarn: The patch generated 27 new + 897 unchanged - 8 fixed = 924 total (was 905) -1 mvnsite 0m 31s hadoop-yarn-server-resourcemanager in the patch failed. +1 mvneclipse 1m 15s the patch passed +1 whitespace 0m 0s The patch has no whitespace issues. -1 findbugs 0m 21s hadoop-yarn-server-resourcemanager in the patch failed. -1 javadoc 0m 20s hadoop-yarn-project_hadoop-yarn_hadoop-yarn-server_hadoop-yarn-server-resourcemanager generated 1 new + 938 unchanged - 0 fixed = 939 total (was 938) +1 unit 0m 25s hadoop-yarn-api in the patch passed. +1 unit 2m 16s hadoop-yarn-common in the patch passed. +1 unit 0m 26s hadoop-yarn-server-common in the patch passed. +1 unit 3m 8s hadoop-yarn-server-applicationhistoryservice in the patch passed. -1 unit 0m 31s hadoop-yarn-server-resourcemanager in the patch failed. -1 unit 1m 16s hadoop-yarn-client in the patch failed. +1 asflicense 0m 19s The patch does not generate ASF License warnings. 52m 21s Reason Tests Failed junit tests hadoop.yarn.client.TestResourceTrackerOnHA   hadoop.yarn.client.api.impl.TestAMRMProxy   hadoop.yarn.client.api.impl.TestOpportunisticContainerAllocation   hadoop.yarn.client.api.impl.TestYarnClient   hadoop.yarn.client.api.impl.TestDistributedScheduling   hadoop.yarn.client.TestResourceManagerAdministrationProtocolPBClientImpl   hadoop.yarn.client.api.impl.TestAMRMClient   hadoop.yarn.client.TestGetGroups   hadoop.yarn.client.api.impl.TestNMClient   hadoop.yarn.client.TestHedgingRequestRMFailoverProxyProvider   hadoop.yarn.client.TestApplicationClientProtocolOnHA   hadoop.yarn.client.api.impl.TestAMRMClientOnRMRestart   hadoop.yarn.client.TestApplicationMasterServiceProtocolOnHA   hadoop.yarn.client.TestRMFailover   hadoop.yarn.client.cli.TestYarnCLI Subsystem Report/Notes Docker Image:yetus/hadoop:9560f25 JIRA Issue YARN-4218 JIRA Patch URL https://issues.apache.org/jira/secure/attachment/12836038/YARN-4218.trunk.2.patch Optional Tests asflicense compile javac javadoc mvninstall mvnsite unit findbugs checkstyle cc uname Linux 4c92939597ce 3.13.0-95-generic #142-Ubuntu SMP Fri Aug 12 17:00:09 UTC 2016 x86_64 x86_64 x86_64 GNU/Linux Build tool maven Personality /testptch/hadoop/patchprocess/precommit/personality/provided.sh git revision trunk / aa3cab1 Default Java 1.8.0_101 findbugs v3.0.0 mvninstall https://builds.apache.org/job/PreCommit-YARN-Build/13678/artifact/patchprocess/patch-mvninstall-hadoop-yarn-project_hadoop-yarn_hadoop-yarn-server_hadoop-yarn-server-resourcemanager.txt compile https://builds.apache.org/job/PreCommit-YARN-Build/13678/artifact/patchprocess/patch-compile-hadoop-yarn-project_hadoop-yarn.txt cc https://builds.apache.org/job/PreCommit-YARN-Build/13678/artifact/patchprocess/patch-compile-hadoop-yarn-project_hadoop-yarn.txt javac https://builds.apache.org/job/PreCommit-YARN-Build/13678/artifact/patchprocess/patch-compile-hadoop-yarn-project_hadoop-yarn.txt checkstyle https://builds.apache.org/job/PreCommit-YARN-Build/13678/artifact/patchprocess/diff-checkstyle-hadoop-yarn-project_hadoop-yarn.txt mvnsite https://builds.apache.org/job/PreCommit-YARN-Build/13678/artifact/patchprocess/patch-mvnsite-hadoop-yarn-project_hadoop-yarn_hadoop-yarn-server_hadoop-yarn-server-resourcemanager.txt findbugs https://builds.apache.org/job/PreCommit-YARN-Build/13678/artifact/patchprocess/patch-findbugs-hadoop-yarn-project_hadoop-yarn_hadoop-yarn-server_hadoop-yarn-server-resourcemanager.txt javadoc https://builds.apache.org/job/PreCommit-YARN-Build/13678/artifact/patchprocess/diff-javadoc-javadoc-hadoop-yarn-project_hadoop-yarn_hadoop-yarn-server_hadoop-yarn-server-resourcemanager.txt unit https://builds.apache.org/job/PreCommit-YARN-Build/13678/artifact/patchprocess/patch-unit-hadoop-yarn-project_hadoop-yarn_hadoop-yarn-server_hadoop-yarn-server-resourcemanager.txt unit https://builds.apache.org/job/PreCommit-YARN-Build/13678/artifact/patchprocess/patch-unit-hadoop-yarn-project_hadoop-yarn_hadoop-yarn-client.txt Test Results https://builds.apache.org/job/PreCommit-YARN-Build/13678/testReport/ modules C: hadoop-yarn-project/hadoop-yarn/hadoop-yarn-api hadoop-yarn-project/hadoop-yarn/hadoop-yarn-common hadoop-yarn-project/hadoop-yarn/hadoop-yarn-server/hadoop-yarn-server-common hadoop-yarn-project/hadoop-yarn/hadoop-yarn-server/hadoop-yarn-server-applicationhistoryservice hadoop-yarn-project/hadoop-yarn/hadoop-yarn-server/hadoop-yarn-server-resourcemanager hadoop-yarn-project/hadoop-yarn/hadoop-yarn-client U: hadoop-yarn-project/hadoop-yarn Console output https://builds.apache.org/job/PreCommit-YARN-Build/13678/console Powered by Apache Yetus 0.4.0-SNAPSHOT http://yetus.apache.org This message was automatically generated.
        Hide
        hadoopqa Hadoop QA added a comment -
        -1 overall



        Vote Subsystem Runtime Comment
        0 reexec 0m 22s Docker mode activated.
        +1 @author 0m 0s The patch does not contain any @author tags.
        +1 test4tests 0m 0s The patch appears to include 9 new or modified test files.
        0 mvndep 0m 44s Maven dependency ordering for branch
        +1 mvninstall 6m 30s branch-2 passed
        +1 compile 1m 52s branch-2 passed with JDK v1.8.0_101
        +1 compile 2m 15s branch-2 passed with JDK v1.7.0_111
        +1 checkstyle 0m 52s branch-2 passed
        +1 mvnsite 2m 52s branch-2 passed
        +1 mvneclipse 1m 28s branch-2 passed
        +1 findbugs 5m 38s branch-2 passed
        +1 javadoc 1m 50s branch-2 passed with JDK v1.8.0_101
        +1 javadoc 2m 6s branch-2 passed with JDK v1.7.0_111
        0 mvndep 0m 11s Maven dependency ordering for patch
        +1 mvninstall 2m 23s the patch passed
        +1 compile 1m 50s the patch passed with JDK v1.8.0_101
        +1 cc 1m 50s the patch passed
        +1 javac 1m 50s the patch passed
        +1 compile 2m 12s the patch passed with JDK v1.7.0_111
        +1 cc 2m 12s the patch passed
        +1 javac 2m 12s the patch passed
        -0 checkstyle 0m 51s hadoop-yarn-project/hadoop-yarn: The patch generated 28 new + 904 unchanged - 8 fixed = 932 total (was 912)
        +1 mvnsite 2m 49s the patch passed
        +1 mvneclipse 1m 24s the patch passed
        -1 whitespace 0m 0s The patch has 9 line(s) that end in whitespace. Use git apply --whitespace=fix <<patch_file>>. Refer https://git-scm.com/docs/git-apply
        -1 whitespace 0m 0s The patch 1 line(s) with tabs.
        +1 findbugs 6m 49s the patch passed
        -1 javadoc 0m 19s hadoop-yarn-project_hadoop-yarn_hadoop-yarn-server_hadoop-yarn-server-resourcemanager-jdk1.8.0_101 with JDK v1.8.0_101 generated 1 new + 938 unchanged - 0 fixed = 939 total (was 938)
        +1 javadoc 2m 2s the patch passed with JDK v1.7.0_111
        +1 unit 0m 26s hadoop-yarn-api in the patch passed with JDK v1.7.0_111.
        +1 unit 2m 26s hadoop-yarn-common in the patch passed with JDK v1.7.0_111.
        +1 unit 0m 28s hadoop-yarn-server-common in the patch passed with JDK v1.7.0_111.
        +1 unit 3m 15s hadoop-yarn-server-applicationhistoryservice in the patch passed with JDK v1.7.0_111.
        -1 unit 35m 54s hadoop-yarn-server-resourcemanager in the patch failed with JDK v1.7.0_111.
        +1 unit 16m 26s hadoop-yarn-client in the patch passed with JDK v1.7.0_111.
        +1 asflicense 0m 20s The patch does not generate ASF License warnings.
        174m 5s



        Reason Tests
        JDK v1.8.0_101 Failed junit tests hadoop.yarn.server.resourcemanager.webapp.TestRMWebServicesApps
        JDK v1.7.0_111 Failed junit tests hadoop.yarn.server.resourcemanager.webapp.TestRMWebServicesApps



        Subsystem Report/Notes
        Docker Image:yetus/hadoop:b59b8b7
        JIRA Issue YARN-4218
        JIRA Patch URL https://issues.apache.org/jira/secure/attachment/12836045/YARN-4218.branch-2.patch
        Optional Tests asflicense compile javac javadoc mvninstall mvnsite unit findbugs checkstyle cc
        uname Linux 8ab5f227aa7a 3.13.0-36-lowlatency #63-Ubuntu SMP PREEMPT Wed Sep 3 21:56:12 UTC 2014 x86_64 x86_64 x86_64 GNU/Linux
        Build tool maven
        Personality /testptch/hadoop/patchprocess/precommit/personality/provided.sh
        git revision branch-2 / 0e6fcd3
        Default Java 1.7.0_111
        Multi-JDK versions /usr/lib/jvm/java-8-oracle:1.8.0_101 /usr/lib/jvm/java-7-openjdk-amd64:1.7.0_111
        findbugs v3.0.0
        checkstyle https://builds.apache.org/job/PreCommit-YARN-Build/13679/artifact/patchprocess/diff-checkstyle-hadoop-yarn-project_hadoop-yarn.txt
        whitespace https://builds.apache.org/job/PreCommit-YARN-Build/13679/artifact/patchprocess/whitespace-eol.txt
        whitespace https://builds.apache.org/job/PreCommit-YARN-Build/13679/artifact/patchprocess/whitespace-tabs.txt
        javadoc https://builds.apache.org/job/PreCommit-YARN-Build/13679/artifact/patchprocess/diff-javadoc-javadoc-hadoop-yarn-project_hadoop-yarn_hadoop-yarn-server_hadoop-yarn-server-resourcemanager-jdk1.8.0_101.txt
        unit https://builds.apache.org/job/PreCommit-YARN-Build/13679/artifact/patchprocess/patch-unit-hadoop-yarn-project_hadoop-yarn_hadoop-yarn-server_hadoop-yarn-server-resourcemanager-jdk1.7.0_111.txt
        JDK v1.7.0_111 Test Results https://builds.apache.org/job/PreCommit-YARN-Build/13679/testReport/
        modules C: hadoop-yarn-project/hadoop-yarn/hadoop-yarn-api hadoop-yarn-project/hadoop-yarn/hadoop-yarn-common hadoop-yarn-project/hadoop-yarn/hadoop-yarn-server/hadoop-yarn-server-common hadoop-yarn-project/hadoop-yarn/hadoop-yarn-server/hadoop-yarn-server-applicationhistoryservice hadoop-yarn-project/hadoop-yarn/hadoop-yarn-server/hadoop-yarn-server-resourcemanager hadoop-yarn-project/hadoop-yarn/hadoop-yarn-client U: hadoop-yarn-project/hadoop-yarn
        Console output https://builds.apache.org/job/PreCommit-YARN-Build/13679/console
        Powered by Apache Yetus 0.4.0-SNAPSHOT http://yetus.apache.org

        This message was automatically generated.

        Show
        hadoopqa Hadoop QA added a comment - -1 overall Vote Subsystem Runtime Comment 0 reexec 0m 22s Docker mode activated. +1 @author 0m 0s The patch does not contain any @author tags. +1 test4tests 0m 0s The patch appears to include 9 new or modified test files. 0 mvndep 0m 44s Maven dependency ordering for branch +1 mvninstall 6m 30s branch-2 passed +1 compile 1m 52s branch-2 passed with JDK v1.8.0_101 +1 compile 2m 15s branch-2 passed with JDK v1.7.0_111 +1 checkstyle 0m 52s branch-2 passed +1 mvnsite 2m 52s branch-2 passed +1 mvneclipse 1m 28s branch-2 passed +1 findbugs 5m 38s branch-2 passed +1 javadoc 1m 50s branch-2 passed with JDK v1.8.0_101 +1 javadoc 2m 6s branch-2 passed with JDK v1.7.0_111 0 mvndep 0m 11s Maven dependency ordering for patch +1 mvninstall 2m 23s the patch passed +1 compile 1m 50s the patch passed with JDK v1.8.0_101 +1 cc 1m 50s the patch passed +1 javac 1m 50s the patch passed +1 compile 2m 12s the patch passed with JDK v1.7.0_111 +1 cc 2m 12s the patch passed +1 javac 2m 12s the patch passed -0 checkstyle 0m 51s hadoop-yarn-project/hadoop-yarn: The patch generated 28 new + 904 unchanged - 8 fixed = 932 total (was 912) +1 mvnsite 2m 49s the patch passed +1 mvneclipse 1m 24s the patch passed -1 whitespace 0m 0s The patch has 9 line(s) that end in whitespace. Use git apply --whitespace=fix <<patch_file>>. Refer https://git-scm.com/docs/git-apply -1 whitespace 0m 0s The patch 1 line(s) with tabs. +1 findbugs 6m 49s the patch passed -1 javadoc 0m 19s hadoop-yarn-project_hadoop-yarn_hadoop-yarn-server_hadoop-yarn-server-resourcemanager-jdk1.8.0_101 with JDK v1.8.0_101 generated 1 new + 938 unchanged - 0 fixed = 939 total (was 938) +1 javadoc 2m 2s the patch passed with JDK v1.7.0_111 +1 unit 0m 26s hadoop-yarn-api in the patch passed with JDK v1.7.0_111. +1 unit 2m 26s hadoop-yarn-common in the patch passed with JDK v1.7.0_111. +1 unit 0m 28s hadoop-yarn-server-common in the patch passed with JDK v1.7.0_111. +1 unit 3m 15s hadoop-yarn-server-applicationhistoryservice in the patch passed with JDK v1.7.0_111. -1 unit 35m 54s hadoop-yarn-server-resourcemanager in the patch failed with JDK v1.7.0_111. +1 unit 16m 26s hadoop-yarn-client in the patch passed with JDK v1.7.0_111. +1 asflicense 0m 20s The patch does not generate ASF License warnings. 174m 5s Reason Tests JDK v1.8.0_101 Failed junit tests hadoop.yarn.server.resourcemanager.webapp.TestRMWebServicesApps JDK v1.7.0_111 Failed junit tests hadoop.yarn.server.resourcemanager.webapp.TestRMWebServicesApps Subsystem Report/Notes Docker Image:yetus/hadoop:b59b8b7 JIRA Issue YARN-4218 JIRA Patch URL https://issues.apache.org/jira/secure/attachment/12836045/YARN-4218.branch-2.patch Optional Tests asflicense compile javac javadoc mvninstall mvnsite unit findbugs checkstyle cc uname Linux 8ab5f227aa7a 3.13.0-36-lowlatency #63-Ubuntu SMP PREEMPT Wed Sep 3 21:56:12 UTC 2014 x86_64 x86_64 x86_64 GNU/Linux Build tool maven Personality /testptch/hadoop/patchprocess/precommit/personality/provided.sh git revision branch-2 / 0e6fcd3 Default Java 1.7.0_111 Multi-JDK versions /usr/lib/jvm/java-8-oracle:1.8.0_101 /usr/lib/jvm/java-7-openjdk-amd64:1.7.0_111 findbugs v3.0.0 checkstyle https://builds.apache.org/job/PreCommit-YARN-Build/13679/artifact/patchprocess/diff-checkstyle-hadoop-yarn-project_hadoop-yarn.txt whitespace https://builds.apache.org/job/PreCommit-YARN-Build/13679/artifact/patchprocess/whitespace-eol.txt whitespace https://builds.apache.org/job/PreCommit-YARN-Build/13679/artifact/patchprocess/whitespace-tabs.txt javadoc https://builds.apache.org/job/PreCommit-YARN-Build/13679/artifact/patchprocess/diff-javadoc-javadoc-hadoop-yarn-project_hadoop-yarn_hadoop-yarn-server_hadoop-yarn-server-resourcemanager-jdk1.8.0_101.txt unit https://builds.apache.org/job/PreCommit-YARN-Build/13679/artifact/patchprocess/patch-unit-hadoop-yarn-project_hadoop-yarn_hadoop-yarn-server_hadoop-yarn-server-resourcemanager-jdk1.7.0_111.txt JDK v1.7.0_111 Test Results https://builds.apache.org/job/PreCommit-YARN-Build/13679/testReport/ modules C: hadoop-yarn-project/hadoop-yarn/hadoop-yarn-api hadoop-yarn-project/hadoop-yarn/hadoop-yarn-common hadoop-yarn-project/hadoop-yarn/hadoop-yarn-server/hadoop-yarn-server-common hadoop-yarn-project/hadoop-yarn/hadoop-yarn-server/hadoop-yarn-server-applicationhistoryservice hadoop-yarn-project/hadoop-yarn/hadoop-yarn-server/hadoop-yarn-server-resourcemanager hadoop-yarn-project/hadoop-yarn/hadoop-yarn-client U: hadoop-yarn-project/hadoop-yarn Console output https://builds.apache.org/job/PreCommit-YARN-Build/13679/console Powered by Apache Yetus 0.4.0-SNAPSHOT http://yetus.apache.org This message was automatically generated.
        Hide
        hadoopqa Hadoop QA added a comment -
        -1 overall



        Vote Subsystem Runtime Comment
        0 reexec 0m 0s Docker mode activated.
        -1 patch 0m 5s YARN-4218 does not apply to trunk. Rebase required? Wrong Branch? See https://wiki.apache.org/hadoop/HowToContribute for help.



        Subsystem Report/Notes
        JIRA Issue YARN-4218
        JIRA Patch URL https://issues.apache.org/jira/secure/attachment/12836096/YARN-4218.5.patch
        Console output https://builds.apache.org/job/PreCommit-YARN-Build/13684/console
        Powered by Apache Yetus 0.4.0-SNAPSHOT http://yetus.apache.org

        This message was automatically generated.

        Show
        hadoopqa Hadoop QA added a comment - -1 overall Vote Subsystem Runtime Comment 0 reexec 0m 0s Docker mode activated. -1 patch 0m 5s YARN-4218 does not apply to trunk. Rebase required? Wrong Branch? See https://wiki.apache.org/hadoop/HowToContribute for help. Subsystem Report/Notes JIRA Issue YARN-4218 JIRA Patch URL https://issues.apache.org/jira/secure/attachment/12836096/YARN-4218.5.patch Console output https://builds.apache.org/job/PreCommit-YARN-Build/13684/console Powered by Apache Yetus 0.4.0-SNAPSHOT http://yetus.apache.org This message was automatically generated.
        Hide
        hadoopqa Hadoop QA added a comment -
        -1 overall



        Vote Subsystem Runtime Comment
        0 reexec 0m 0s Docker mode activated.
        -1 patch 0m 8s YARN-4218 does not apply to branch-2.2. Rebase required? Wrong Branch? See https://wiki.apache.org/hadoop/HowToContribute for help.



        Subsystem Report/Notes
        JIRA Issue YARN-4218
        JIRA Patch URL https://issues.apache.org/jira/secure/attachment/12836101/YARN-4218.branch-2.2.patch
        Console output https://builds.apache.org/job/PreCommit-YARN-Build/13689/console
        Powered by Apache Yetus 0.4.0-SNAPSHOT http://yetus.apache.org

        This message was automatically generated.

        Show
        hadoopqa Hadoop QA added a comment - -1 overall Vote Subsystem Runtime Comment 0 reexec 0m 0s Docker mode activated. -1 patch 0m 8s YARN-4218 does not apply to branch-2.2. Rebase required? Wrong Branch? See https://wiki.apache.org/hadoop/HowToContribute for help. Subsystem Report/Notes JIRA Issue YARN-4218 JIRA Patch URL https://issues.apache.org/jira/secure/attachment/12836101/YARN-4218.branch-2.2.patch Console output https://builds.apache.org/job/PreCommit-YARN-Build/13689/console Powered by Apache Yetus 0.4.0-SNAPSHOT http://yetus.apache.org This message was automatically generated.
        Hide
        lichangleo Chang Li added a comment -

        were having some troubles to run jobs on trunk, just figured that out.. Will submit a patch for trunk soon

        Show
        lichangleo Chang Li added a comment - were having some troubles to run jobs on trunk, just figured that out.. Will submit a patch for trunk soon
        Hide
        hadoopqa Hadoop QA added a comment -
        -1 overall



        Vote Subsystem Runtime Comment
        0 reexec 0m 23s Docker mode activated.
        +1 @author 0m 0s The patch does not contain any @author tags.
        +1 test4tests 0m 0s The patch appears to include 11 new or modified test files.
        0 mvndep 0m 53s Maven dependency ordering for branch
        +1 mvninstall 6m 47s trunk passed
        +1 compile 2m 19s trunk passed
        +1 checkstyle 0m 49s trunk passed
        +1 mvnsite 2m 41s trunk passed
        +1 mvneclipse 1m 24s trunk passed
        +1 findbugs 4m 44s trunk passed
        +1 javadoc 1m 57s trunk passed
        0 mvndep 0m 10s Maven dependency ordering for patch
        +1 mvninstall 2m 27s the patch passed
        +1 compile 2m 34s the patch passed
        +1 cc 2m 34s the patch passed
        +1 javac 2m 34s the patch passed
        -0 checkstyle 0m 51s hadoop-yarn-project/hadoop-yarn: The patch generated 10 new + 908 unchanged - 10 fixed = 918 total (was 918)
        +1 mvnsite 2m 40s the patch passed
        +1 mvneclipse 1m 19s the patch passed
        +1 whitespace 0m 0s The patch has no whitespace issues.
        +1 findbugs 6m 21s the patch passed
        -1 javadoc 0m 18s hadoop-yarn-api in the patch failed.
        -1 javadoc 0m 23s hadoop-yarn-project_hadoop-yarn_hadoop-yarn-server_hadoop-yarn-server-resourcemanager generated 1 new + 938 unchanged - 0 fixed = 939 total (was 938)
        +1 unit 0m 28s hadoop-yarn-api in the patch passed.
        +1 unit 2m 26s hadoop-yarn-common in the patch passed.
        +1 unit 0m 33s hadoop-yarn-server-common in the patch passed.
        +1 unit 2m 51s hadoop-yarn-server-applicationhistoryservice in the patch passed.
        +1 unit 36m 5s hadoop-yarn-server-resourcemanager in the patch passed.
        +1 unit 16m 1s hadoop-yarn-client in the patch passed.
        +1 asflicense 0m 19s The patch does not generate ASF License warnings.
        107m 47s



        Subsystem Report/Notes
        Docker Image:yetus/hadoop:9560f25
        JIRA Issue YARN-4218
        JIRA Patch URL https://issues.apache.org/jira/secure/attachment/12836129/YARN-4218.trunk.3.patch
        Optional Tests asflicense compile javac javadoc mvninstall mvnsite unit findbugs checkstyle cc
        uname Linux d2e9e62da26f 3.13.0-36-lowlatency #63-Ubuntu SMP PREEMPT Wed Sep 3 21:56:12 UTC 2014 x86_64 x86_64 x86_64 GNU/Linux
        Build tool maven
        Personality /testptch/hadoop/patchprocess/precommit/personality/provided.sh
        git revision trunk / f646fe3
        Default Java 1.8.0_101
        findbugs v3.0.0
        checkstyle https://builds.apache.org/job/PreCommit-YARN-Build/13693/artifact/patchprocess/diff-checkstyle-hadoop-yarn-project_hadoop-yarn.txt
        javadoc https://builds.apache.org/job/PreCommit-YARN-Build/13693/artifact/patchprocess/patch-javadoc-hadoop-yarn-project_hadoop-yarn_hadoop-yarn-api.txt
        javadoc https://builds.apache.org/job/PreCommit-YARN-Build/13693/artifact/patchprocess/diff-javadoc-javadoc-hadoop-yarn-project_hadoop-yarn_hadoop-yarn-server_hadoop-yarn-server-resourcemanager.txt
        Test Results https://builds.apache.org/job/PreCommit-YARN-Build/13693/testReport/
        modules C: hadoop-yarn-project/hadoop-yarn/hadoop-yarn-api hadoop-yarn-project/hadoop-yarn/hadoop-yarn-common hadoop-yarn-project/hadoop-yarn/hadoop-yarn-server/hadoop-yarn-server-common hadoop-yarn-project/hadoop-yarn/hadoop-yarn-server/hadoop-yarn-server-applicationhistoryservice hadoop-yarn-project/hadoop-yarn/hadoop-yarn-server/hadoop-yarn-server-resourcemanager hadoop-yarn-project/hadoop-yarn/hadoop-yarn-client U: hadoop-yarn-project/hadoop-yarn
        Console output https://builds.apache.org/job/PreCommit-YARN-Build/13693/console
        Powered by Apache Yetus 0.4.0-SNAPSHOT http://yetus.apache.org

        This message was automatically generated.

        Show
        hadoopqa Hadoop QA added a comment - -1 overall Vote Subsystem Runtime Comment 0 reexec 0m 23s Docker mode activated. +1 @author 0m 0s The patch does not contain any @author tags. +1 test4tests 0m 0s The patch appears to include 11 new or modified test files. 0 mvndep 0m 53s Maven dependency ordering for branch +1 mvninstall 6m 47s trunk passed +1 compile 2m 19s trunk passed +1 checkstyle 0m 49s trunk passed +1 mvnsite 2m 41s trunk passed +1 mvneclipse 1m 24s trunk passed +1 findbugs 4m 44s trunk passed +1 javadoc 1m 57s trunk passed 0 mvndep 0m 10s Maven dependency ordering for patch +1 mvninstall 2m 27s the patch passed +1 compile 2m 34s the patch passed +1 cc 2m 34s the patch passed +1 javac 2m 34s the patch passed -0 checkstyle 0m 51s hadoop-yarn-project/hadoop-yarn: The patch generated 10 new + 908 unchanged - 10 fixed = 918 total (was 918) +1 mvnsite 2m 40s the patch passed +1 mvneclipse 1m 19s the patch passed +1 whitespace 0m 0s The patch has no whitespace issues. +1 findbugs 6m 21s the patch passed -1 javadoc 0m 18s hadoop-yarn-api in the patch failed. -1 javadoc 0m 23s hadoop-yarn-project_hadoop-yarn_hadoop-yarn-server_hadoop-yarn-server-resourcemanager generated 1 new + 938 unchanged - 0 fixed = 939 total (was 938) +1 unit 0m 28s hadoop-yarn-api in the patch passed. +1 unit 2m 26s hadoop-yarn-common in the patch passed. +1 unit 0m 33s hadoop-yarn-server-common in the patch passed. +1 unit 2m 51s hadoop-yarn-server-applicationhistoryservice in the patch passed. +1 unit 36m 5s hadoop-yarn-server-resourcemanager in the patch passed. +1 unit 16m 1s hadoop-yarn-client in the patch passed. +1 asflicense 0m 19s The patch does not generate ASF License warnings. 107m 47s Subsystem Report/Notes Docker Image:yetus/hadoop:9560f25 JIRA Issue YARN-4218 JIRA Patch URL https://issues.apache.org/jira/secure/attachment/12836129/YARN-4218.trunk.3.patch Optional Tests asflicense compile javac javadoc mvninstall mvnsite unit findbugs checkstyle cc uname Linux d2e9e62da26f 3.13.0-36-lowlatency #63-Ubuntu SMP PREEMPT Wed Sep 3 21:56:12 UTC 2014 x86_64 x86_64 x86_64 GNU/Linux Build tool maven Personality /testptch/hadoop/patchprocess/precommit/personality/provided.sh git revision trunk / f646fe3 Default Java 1.8.0_101 findbugs v3.0.0 checkstyle https://builds.apache.org/job/PreCommit-YARN-Build/13693/artifact/patchprocess/diff-checkstyle-hadoop-yarn-project_hadoop-yarn.txt javadoc https://builds.apache.org/job/PreCommit-YARN-Build/13693/artifact/patchprocess/patch-javadoc-hadoop-yarn-project_hadoop-yarn_hadoop-yarn-api.txt javadoc https://builds.apache.org/job/PreCommit-YARN-Build/13693/artifact/patchprocess/diff-javadoc-javadoc-hadoop-yarn-project_hadoop-yarn_hadoop-yarn-server_hadoop-yarn-server-resourcemanager.txt Test Results https://builds.apache.org/job/PreCommit-YARN-Build/13693/testReport/ modules C: hadoop-yarn-project/hadoop-yarn/hadoop-yarn-api hadoop-yarn-project/hadoop-yarn/hadoop-yarn-common hadoop-yarn-project/hadoop-yarn/hadoop-yarn-server/hadoop-yarn-server-common hadoop-yarn-project/hadoop-yarn/hadoop-yarn-server/hadoop-yarn-server-applicationhistoryservice hadoop-yarn-project/hadoop-yarn/hadoop-yarn-server/hadoop-yarn-server-resourcemanager hadoop-yarn-project/hadoop-yarn/hadoop-yarn-client U: hadoop-yarn-project/hadoop-yarn Console output https://builds.apache.org/job/PreCommit-YARN-Build/13693/console Powered by Apache Yetus 0.4.0-SNAPSHOT http://yetus.apache.org This message was automatically generated.
        Hide
        eepayne Eric Payne added a comment -

        Thanks, Chang Li, for updating the patches.

        I'm looking into the patches, but I would like to provide a quick reminder about patch naming conventions. From the Hadoop: How To Contribute Wiki

        Patches for trunk should be named according to the Jira, with a version number: <jiraName>.<versionNum>.patch,

        So, there is no need to put the word trunk in the name of trunk patches, and the <versionNum> is preferred to be nnn. For example YARN-4218.001.patch, YARN-4218.002.patch, etc.

        For non-trunk branches:

        Patches for a non-trunk branch should be named <jiraName>-<branchName>.<versionNum>.patch. ... The branch name suffix should be the exact name of a git branch, such as "branch-2". Jenkins will check the name of the patch and detect the appropriate branch for testing.

        The branch-2 patches that you provided are correct except for the preferred <versionNum>, but that's not a big deal.

        Show
        eepayne Eric Payne added a comment - Thanks, Chang Li , for updating the patches. I'm looking into the patches, but I would like to provide a quick reminder about patch naming conventions. From the Hadoop: How To Contribute Wiki Patches for trunk should be named according to the Jira, with a version number: <jiraName>.<versionNum>.patch, So, there is no need to put the word trunk in the name of trunk patches, and the <versionNum> is preferred to be nnn . For example YARN-4218 .001.patch , YARN-4218 .002.patch , etc. For non-trunk branches: Patches for a non-trunk branch should be named <jiraName>-<branchName>.<versionNum>.patch. ... The branch name suffix should be the exact name of a git branch, such as "branch-2". Jenkins will check the name of the patch and detect the appropriate branch for testing. The branch-2 patches that you provided are correct except for the preferred <versionNum> , but that's not a big deal.
        Hide
        eepayne Eric Payne added a comment -

        Chang Li, sorry one more thing. I also noticed that the latest branch-2 patch (YARN-4218.branch-2.2.patch) did not apply.

        Show
        eepayne Eric Payne added a comment - Chang Li , sorry one more thing. I also noticed that the latest branch-2 patch ( YARN-4218 .branch-2.2.patch) did not apply.
        Hide
        eepayne Eric Payne added a comment -

        Chang Li, as for the trunk patch, please go ahead and fix the hadoop-yarn-api javadoc warnings. I don't think you can fix the hadoop-yarn-server-resourcemanager warnings because it's related to the underscore:

        RMAppBlock.java:179: warning: '_' used as an identifier

        Show
        eepayne Eric Payne added a comment - Chang Li , as for the trunk patch, please go ahead and fix the hadoop-yarn-api javadoc warnings. I don't think you can fix the hadoop-yarn-server-resourcemanager warnings because it's related to the underscore: RMAppBlock.java:179: warning: '_' used as an identifier
        Hide
        lichangleo Chang Li added a comment -

        Eric Payne hmm, there are tons of errors for protocol javadocs for missing descriptions of why YarnException is thrown and why IOExceptions are thrown. My changes never touches those protocols not sure why it generates those errors for me. To fulfill those thousands of missing javadocs for exceptions or param probably worth a feature... Also I didn't implement those protocols it's hard for me to write correct description...

        Show
        lichangleo Chang Li added a comment - Eric Payne hmm, there are tons of errors for protocol javadocs for missing descriptions of why YarnException is thrown and why IOExceptions are thrown. My changes never touches those protocols not sure why it generates those errors for me. To fulfill those thousands of missing javadocs for exceptions or param probably worth a feature... Also I didn't implement those protocols it's hard for me to write correct description...
        Hide
        eepayne Eric Payne added a comment -

        Chang Li. Sorry, I should have been more specific. Can you please fix the following javadocs errors. These came from the new methods that you created:

        [ERROR] /testptch/hadoop/hadoop-yarn-project/hadoop-yarn/hadoop-yarn-api/src/main/java/org/apache/hadoop/yarn/api/records/ApplicationResourceUsageReport.java:199: error: @param name not found
        [ERROR] * @param memory_seconds the aggregated amount of memory seconds
        [ERROR] ^
        [ERROR] /testptch/hadoop/hadoop-yarn-project/hadoop-yarn/hadoop-yarn-api/src/main/java/org/apache/hadoop/yarn/api/records/ApplicationResourceUsageReport.java:203: warning: no @param for memorySeconds
        [ERROR] public abstract void setPreemptedMemorySeconds(long memorySeconds);
        [ERROR] ^
        [ERROR] /testptch/hadoop/hadoop-yarn-project/hadoop-yarn/hadoop-yarn-api/src/main/java/org/apache/hadoop/yarn/api/records/ApplicationResourceUsageReport.java:218: error: @param name not found
        [ERROR] * @param vcore_seconds the aggregated number of vcore seconds
        [ERROR] ^
        [ERROR] /testptch/hadoop/hadoop-yarn-project/hadoop-yarn/hadoop-yarn-api/src/main/java/org/apache/hadoop/yarn/api/records/ApplicationResourceUsageReport.java:222: warning: no @param for vcoreSeconds
        [ERROR] public abstract void setPreemptedVcoreSeconds(long vcoreSeconds);
        [ERROR] ^
        
        Show
        eepayne Eric Payne added a comment - Chang Li . Sorry, I should have been more specific. Can you please fix the following javadocs errors. These came from the new methods that you created: [ERROR] /testptch/hadoop/hadoop-yarn-project/hadoop-yarn/hadoop-yarn-api/src/main/java/org/apache/hadoop/yarn/api/records/ApplicationResourceUsageReport.java:199: error: @param name not found [ERROR] * @param memory_seconds the aggregated amount of memory seconds [ERROR] ^ [ERROR] /testptch/hadoop/hadoop-yarn-project/hadoop-yarn/hadoop-yarn-api/src/main/java/org/apache/hadoop/yarn/api/records/ApplicationResourceUsageReport.java:203: warning: no @param for memorySeconds [ERROR] public abstract void setPreemptedMemorySeconds(long memorySeconds); [ERROR] ^ [ERROR] /testptch/hadoop/hadoop-yarn-project/hadoop-yarn/hadoop-yarn-api/src/main/java/org/apache/hadoop/yarn/api/records/ApplicationResourceUsageReport.java:218: error: @param name not found [ERROR] * @param vcore_seconds the aggregated number of vcore seconds [ERROR] ^ [ERROR] /testptch/hadoop/hadoop-yarn-project/hadoop-yarn/hadoop-yarn-api/src/main/java/org/apache/hadoop/yarn/api/records/ApplicationResourceUsageReport.java:222: warning: no @param for vcoreSeconds [ERROR] public abstract void setPreemptedVcoreSeconds(long vcoreSeconds); [ERROR] ^
        Hide
        hadoopqa Hadoop QA added a comment -
        -1 overall



        Vote Subsystem Runtime Comment
        0 reexec 0m 20s Docker mode activated.
        +1 @author 0m 0s The patch does not contain any @author tags.
        +1 test4tests 0m 0s The patch appears to include 11 new or modified test files.
        0 mvndep 0m 10s Maven dependency ordering for branch
        +1 mvninstall 8m 2s trunk passed
        +1 compile 6m 29s trunk passed
        +1 checkstyle 1m 0s trunk passed
        +1 mvnsite 3m 44s trunk passed
        +1 mvneclipse 2m 19s trunk passed
        +1 findbugs 5m 43s trunk passed
        +1 javadoc 2m 50s trunk passed
        0 mvndep 0m 10s Maven dependency ordering for patch
        +1 mvninstall 2m 24s the patch passed
        +1 compile 5m 10s the patch passed
        +1 cc 5m 10s the patch passed
        +1 javac 5m 10s the patch passed
        -0 checkstyle 1m 1s hadoop-yarn-project/hadoop-yarn: The patch generated 10 new + 915 unchanged - 10 fixed = 925 total (was 925)
        +1 mvnsite 3m 40s the patch passed
        +1 mvneclipse 2m 14s the patch passed
        +1 whitespace 0m 0s The patch has no whitespace issues.
        +1 findbugs 6m 10s the patch passed
        -1 javadoc 0m 31s hadoop-yarn-project_hadoop-yarn_hadoop-yarn-server_hadoop-yarn-server-resourcemanager generated 1 new + 924 unchanged - 0 fixed = 925 total (was 924)
        +1 unit 0m 35s hadoop-yarn-api in the patch passed.
        +1 unit 2m 27s hadoop-yarn-common in the patch passed.
        +1 unit 0m 36s hadoop-yarn-server-common in the patch passed.
        +1 unit 3m 22s hadoop-yarn-server-applicationhistoryservice in the patch passed.
        +1 unit 40m 39s hadoop-yarn-server-resourcemanager in the patch passed.
        +1 unit 16m 12s hadoop-yarn-client in the patch passed.
        +1 asflicense 0m 37s The patch does not generate ASF License warnings.
        128m 8s



        Subsystem Report/Notes
        Docker Image:yetus/hadoop:e809691
        JIRA Issue YARN-4218
        JIRA Patch URL https://issues.apache.org/jira/secure/attachment/12838311/YARN-4218.006.patch
        Optional Tests asflicense compile javac javadoc mvninstall mvnsite unit findbugs checkstyle cc
        uname Linux f50d5ca73db9 3.13.0-95-generic #142-Ubuntu SMP Fri Aug 12 17:00:09 UTC 2016 x86_64 x86_64 x86_64 GNU/Linux
        Build tool maven
        Personality /testptch/hadoop/patchprocess/precommit/personality/provided.sh
        git revision trunk / 86ac1ad
        Default Java 1.8.0_101
        findbugs v3.0.0
        checkstyle https://builds.apache.org/job/PreCommit-YARN-Build/13855/artifact/patchprocess/diff-checkstyle-hadoop-yarn-project_hadoop-yarn.txt
        javadoc https://builds.apache.org/job/PreCommit-YARN-Build/13855/artifact/patchprocess/diff-javadoc-javadoc-hadoop-yarn-project_hadoop-yarn_hadoop-yarn-server_hadoop-yarn-server-resourcemanager.txt
        Test Results https://builds.apache.org/job/PreCommit-YARN-Build/13855/testReport/
        modules C: hadoop-yarn-project/hadoop-yarn/hadoop-yarn-api hadoop-yarn-project/hadoop-yarn/hadoop-yarn-common hadoop-yarn-project/hadoop-yarn/hadoop-yarn-server/hadoop-yarn-server-common hadoop-yarn-project/hadoop-yarn/hadoop-yarn-server/hadoop-yarn-server-applicationhistoryservice hadoop-yarn-project/hadoop-yarn/hadoop-yarn-server/hadoop-yarn-server-resourcemanager hadoop-yarn-project/hadoop-yarn/hadoop-yarn-client U: hadoop-yarn-project/hadoop-yarn
        Console output https://builds.apache.org/job/PreCommit-YARN-Build/13855/console
        Powered by Apache Yetus 0.4.0-SNAPSHOT http://yetus.apache.org

        This message was automatically generated.

        Show
        hadoopqa Hadoop QA added a comment - -1 overall Vote Subsystem Runtime Comment 0 reexec 0m 20s Docker mode activated. +1 @author 0m 0s The patch does not contain any @author tags. +1 test4tests 0m 0s The patch appears to include 11 new or modified test files. 0 mvndep 0m 10s Maven dependency ordering for branch +1 mvninstall 8m 2s trunk passed +1 compile 6m 29s trunk passed +1 checkstyle 1m 0s trunk passed +1 mvnsite 3m 44s trunk passed +1 mvneclipse 2m 19s trunk passed +1 findbugs 5m 43s trunk passed +1 javadoc 2m 50s trunk passed 0 mvndep 0m 10s Maven dependency ordering for patch +1 mvninstall 2m 24s the patch passed +1 compile 5m 10s the patch passed +1 cc 5m 10s the patch passed +1 javac 5m 10s the patch passed -0 checkstyle 1m 1s hadoop-yarn-project/hadoop-yarn: The patch generated 10 new + 915 unchanged - 10 fixed = 925 total (was 925) +1 mvnsite 3m 40s the patch passed +1 mvneclipse 2m 14s the patch passed +1 whitespace 0m 0s The patch has no whitespace issues. +1 findbugs 6m 10s the patch passed -1 javadoc 0m 31s hadoop-yarn-project_hadoop-yarn_hadoop-yarn-server_hadoop-yarn-server-resourcemanager generated 1 new + 924 unchanged - 0 fixed = 925 total (was 924) +1 unit 0m 35s hadoop-yarn-api in the patch passed. +1 unit 2m 27s hadoop-yarn-common in the patch passed. +1 unit 0m 36s hadoop-yarn-server-common in the patch passed. +1 unit 3m 22s hadoop-yarn-server-applicationhistoryservice in the patch passed. +1 unit 40m 39s hadoop-yarn-server-resourcemanager in the patch passed. +1 unit 16m 12s hadoop-yarn-client in the patch passed. +1 asflicense 0m 37s The patch does not generate ASF License warnings. 128m 8s Subsystem Report/Notes Docker Image:yetus/hadoop:e809691 JIRA Issue YARN-4218 JIRA Patch URL https://issues.apache.org/jira/secure/attachment/12838311/YARN-4218.006.patch Optional Tests asflicense compile javac javadoc mvninstall mvnsite unit findbugs checkstyle cc uname Linux f50d5ca73db9 3.13.0-95-generic #142-Ubuntu SMP Fri Aug 12 17:00:09 UTC 2016 x86_64 x86_64 x86_64 GNU/Linux Build tool maven Personality /testptch/hadoop/patchprocess/precommit/personality/provided.sh git revision trunk / 86ac1ad Default Java 1.8.0_101 findbugs v3.0.0 checkstyle https://builds.apache.org/job/PreCommit-YARN-Build/13855/artifact/patchprocess/diff-checkstyle-hadoop-yarn-project_hadoop-yarn.txt javadoc https://builds.apache.org/job/PreCommit-YARN-Build/13855/artifact/patchprocess/diff-javadoc-javadoc-hadoop-yarn-project_hadoop-yarn_hadoop-yarn-server_hadoop-yarn-server-resourcemanager.txt Test Results https://builds.apache.org/job/PreCommit-YARN-Build/13855/testReport/ modules C: hadoop-yarn-project/hadoop-yarn/hadoop-yarn-api hadoop-yarn-project/hadoop-yarn/hadoop-yarn-common hadoop-yarn-project/hadoop-yarn/hadoop-yarn-server/hadoop-yarn-server-common hadoop-yarn-project/hadoop-yarn/hadoop-yarn-server/hadoop-yarn-server-applicationhistoryservice hadoop-yarn-project/hadoop-yarn/hadoop-yarn-server/hadoop-yarn-server-resourcemanager hadoop-yarn-project/hadoop-yarn/hadoop-yarn-client U: hadoop-yarn-project/hadoop-yarn Console output https://builds.apache.org/job/PreCommit-YARN-Build/13855/console Powered by Apache Yetus 0.4.0-SNAPSHOT http://yetus.apache.org This message was automatically generated.
        Hide
        hadoopqa Hadoop QA added a comment -
        -1 overall



        Vote Subsystem Runtime Comment
        0 reexec 0m 22s Docker mode activated.
        +1 @author 0m 0s The patch does not contain any @author tags.
        +1 test4tests 0m 0s The patch appears to include 10 new or modified test files.
        0 mvndep 0m 35s Maven dependency ordering for branch
        +1 mvninstall 6m 34s branch-2 passed
        +1 compile 1m 50s branch-2 passed with JDK v1.8.0_101
        +1 compile 2m 12s branch-2 passed with JDK v1.7.0_111
        +1 checkstyle 0m 51s branch-2 passed
        +1 mvnsite 2m 53s branch-2 passed
        +1 mvneclipse 1m 29s branch-2 passed
        +1 findbugs 5m 42s branch-2 passed
        +1 javadoc 1m 56s branch-2 passed with JDK v1.8.0_101
        +1 javadoc 2m 8s branch-2 passed with JDK v1.7.0_111
        0 mvndep 0m 10s Maven dependency ordering for patch
        +1 mvninstall 2m 28s the patch passed
        +1 compile 2m 1s the patch passed with JDK v1.8.0_101
        +1 cc 2m 1s the patch passed
        +1 javac 2m 1s the patch passed
        +1 compile 2m 16s the patch passed with JDK v1.7.0_111
        +1 cc 2m 16s the patch passed
        +1 javac 2m 16s the patch passed
        -0 checkstyle 0m 53s hadoop-yarn-project/hadoop-yarn: The patch generated 10 new + 922 unchanged - 10 fixed = 932 total (was 932)
        +1 mvnsite 2m 49s the patch passed
        +1 mvneclipse 1m 24s the patch passed
        +1 whitespace 0m 0s The patch has no whitespace issues.
        +1 findbugs 6m 53s the patch passed
        -1 javadoc 0m 20s hadoop-yarn-project_hadoop-yarn_hadoop-yarn-server_hadoop-yarn-server-resourcemanager-jdk1.8.0_101 with JDK v1.8.0_101 generated 1 new + 924 unchanged - 0 fixed = 925 total (was 924)
        +1 javadoc 2m 3s the patch passed with JDK v1.7.0_111
        +1 unit 0m 27s hadoop-yarn-api in the patch passed with JDK v1.7.0_111.
        +1 unit 2m 27s hadoop-yarn-common in the patch passed with JDK v1.7.0_111.
        +1 unit 0m 29s hadoop-yarn-server-common in the patch passed with JDK v1.7.0_111.
        +1 unit 3m 14s hadoop-yarn-server-applicationhistoryservice in the patch passed with JDK v1.7.0_111.
        +1 unit 37m 38s hadoop-yarn-server-resourcemanager in the patch passed with JDK v1.7.0_111.
        +1 unit 16m 29s hadoop-yarn-client in the patch passed with JDK v1.7.0_111.
        +1 asflicense 0m 20s The patch does not generate ASF License warnings.
        178m 4s



        Subsystem Report/Notes
        Docker Image:yetus/hadoop:b59b8b7
        JIRA Issue YARN-4218
        JIRA Patch URL https://issues.apache.org/jira/secure/attachment/12838315/YARN-4218-branch-2.003.patch
        Optional Tests asflicense compile javac javadoc mvninstall mvnsite unit findbugs checkstyle cc
        uname Linux c8a46f03832f 3.13.0-36-lowlatency #63-Ubuntu SMP PREEMPT Wed Sep 3 21:56:12 UTC 2014 x86_64 x86_64 x86_64 GNU/Linux
        Build tool maven
        Personality /testptch/hadoop/patchprocess/precommit/personality/provided.sh
        git revision branch-2 / f7b2542
        Default Java 1.7.0_111
        Multi-JDK versions /usr/lib/jvm/java-8-oracle:1.8.0_101 /usr/lib/jvm/java-7-openjdk-amd64:1.7.0_111
        findbugs v3.0.0
        checkstyle https://builds.apache.org/job/PreCommit-YARN-Build/13856/artifact/patchprocess/diff-checkstyle-hadoop-yarn-project_hadoop-yarn.txt
        javadoc https://builds.apache.org/job/PreCommit-YARN-Build/13856/artifact/patchprocess/diff-javadoc-javadoc-hadoop-yarn-project_hadoop-yarn_hadoop-yarn-server_hadoop-yarn-server-resourcemanager-jdk1.8.0_101.txt
        JDK v1.7.0_111 Test Results https://builds.apache.org/job/PreCommit-YARN-Build/13856/testReport/
        modules C: hadoop-yarn-project/hadoop-yarn/hadoop-yarn-api hadoop-yarn-project/hadoop-yarn/hadoop-yarn-common hadoop-yarn-project/hadoop-yarn/hadoop-yarn-server/hadoop-yarn-server-common hadoop-yarn-project/hadoop-yarn/hadoop-yarn-server/hadoop-yarn-server-applicationhistoryservice hadoop-yarn-project/hadoop-yarn/hadoop-yarn-server/hadoop-yarn-server-resourcemanager hadoop-yarn-project/hadoop-yarn/hadoop-yarn-client U: hadoop-yarn-project/hadoop-yarn
        Console output https://builds.apache.org/job/PreCommit-YARN-Build/13856/console
        Powered by Apache Yetus 0.4.0-SNAPSHOT http://yetus.apache.org

        This message was automatically generated.

        Show
        hadoopqa Hadoop QA added a comment - -1 overall Vote Subsystem Runtime Comment 0 reexec 0m 22s Docker mode activated. +1 @author 0m 0s The patch does not contain any @author tags. +1 test4tests 0m 0s The patch appears to include 10 new or modified test files. 0 mvndep 0m 35s Maven dependency ordering for branch +1 mvninstall 6m 34s branch-2 passed +1 compile 1m 50s branch-2 passed with JDK v1.8.0_101 +1 compile 2m 12s branch-2 passed with JDK v1.7.0_111 +1 checkstyle 0m 51s branch-2 passed +1 mvnsite 2m 53s branch-2 passed +1 mvneclipse 1m 29s branch-2 passed +1 findbugs 5m 42s branch-2 passed +1 javadoc 1m 56s branch-2 passed with JDK v1.8.0_101 +1 javadoc 2m 8s branch-2 passed with JDK v1.7.0_111 0 mvndep 0m 10s Maven dependency ordering for patch +1 mvninstall 2m 28s the patch passed +1 compile 2m 1s the patch passed with JDK v1.8.0_101 +1 cc 2m 1s the patch passed +1 javac 2m 1s the patch passed +1 compile 2m 16s the patch passed with JDK v1.7.0_111 +1 cc 2m 16s the patch passed +1 javac 2m 16s the patch passed -0 checkstyle 0m 53s hadoop-yarn-project/hadoop-yarn: The patch generated 10 new + 922 unchanged - 10 fixed = 932 total (was 932) +1 mvnsite 2m 49s the patch passed +1 mvneclipse 1m 24s the patch passed +1 whitespace 0m 0s The patch has no whitespace issues. +1 findbugs 6m 53s the patch passed -1 javadoc 0m 20s hadoop-yarn-project_hadoop-yarn_hadoop-yarn-server_hadoop-yarn-server-resourcemanager-jdk1.8.0_101 with JDK v1.8.0_101 generated 1 new + 924 unchanged - 0 fixed = 925 total (was 924) +1 javadoc 2m 3s the patch passed with JDK v1.7.0_111 +1 unit 0m 27s hadoop-yarn-api in the patch passed with JDK v1.7.0_111. +1 unit 2m 27s hadoop-yarn-common in the patch passed with JDK v1.7.0_111. +1 unit 0m 29s hadoop-yarn-server-common in the patch passed with JDK v1.7.0_111. +1 unit 3m 14s hadoop-yarn-server-applicationhistoryservice in the patch passed with JDK v1.7.0_111. +1 unit 37m 38s hadoop-yarn-server-resourcemanager in the patch passed with JDK v1.7.0_111. +1 unit 16m 29s hadoop-yarn-client in the patch passed with JDK v1.7.0_111. +1 asflicense 0m 20s The patch does not generate ASF License warnings. 178m 4s Subsystem Report/Notes Docker Image:yetus/hadoop:b59b8b7 JIRA Issue YARN-4218 JIRA Patch URL https://issues.apache.org/jira/secure/attachment/12838315/YARN-4218-branch-2.003.patch Optional Tests asflicense compile javac javadoc mvninstall mvnsite unit findbugs checkstyle cc uname Linux c8a46f03832f 3.13.0-36-lowlatency #63-Ubuntu SMP PREEMPT Wed Sep 3 21:56:12 UTC 2014 x86_64 x86_64 x86_64 GNU/Linux Build tool maven Personality /testptch/hadoop/patchprocess/precommit/personality/provided.sh git revision branch-2 / f7b2542 Default Java 1.7.0_111 Multi-JDK versions /usr/lib/jvm/java-8-oracle:1.8.0_101 /usr/lib/jvm/java-7-openjdk-amd64:1.7.0_111 findbugs v3.0.0 checkstyle https://builds.apache.org/job/PreCommit-YARN-Build/13856/artifact/patchprocess/diff-checkstyle-hadoop-yarn-project_hadoop-yarn.txt javadoc https://builds.apache.org/job/PreCommit-YARN-Build/13856/artifact/patchprocess/diff-javadoc-javadoc-hadoop-yarn-project_hadoop-yarn_hadoop-yarn-server_hadoop-yarn-server-resourcemanager-jdk1.8.0_101.txt JDK v1.7.0_111 Test Results https://builds.apache.org/job/PreCommit-YARN-Build/13856/testReport/ modules C: hadoop-yarn-project/hadoop-yarn/hadoop-yarn-api hadoop-yarn-project/hadoop-yarn/hadoop-yarn-common hadoop-yarn-project/hadoop-yarn/hadoop-yarn-server/hadoop-yarn-server-common hadoop-yarn-project/hadoop-yarn/hadoop-yarn-server/hadoop-yarn-server-applicationhistoryservice hadoop-yarn-project/hadoop-yarn/hadoop-yarn-server/hadoop-yarn-server-resourcemanager hadoop-yarn-project/hadoop-yarn/hadoop-yarn-client U: hadoop-yarn-project/hadoop-yarn Console output https://builds.apache.org/job/PreCommit-YARN-Build/13856/console Powered by Apache Yetus 0.4.0-SNAPSHOT http://yetus.apache.org This message was automatically generated.
        Hide
        eepayne Eric Payne added a comment -

        +1

        Thanks Chang Li for the patches and the work done on this JIRA. I will commit this.

        Show
        eepayne Eric Payne added a comment - +1 Thanks Chang Li for the patches and the work done on this JIRA. I will commit this.
        Hide
        hudson Hudson added a comment -

        SUCCESS: Integrated in Jenkins build Hadoop-trunk-Commit #10815 (See https://builds.apache.org/job/Hadoop-trunk-Commit/10815/)
        YARN-4218. Metric for resource*time that was preempted. Contributed by (epayne: rev 93eeb13164707d0e3556c2bf737bd2ee09a335c6)

        • (edit) hadoop-yarn-project/hadoop-yarn/hadoop-yarn-common/src/main/java/org/apache/hadoop/yarn/api/records/impl/pb/ApplicationResourceUsageReportPBImpl.java
        • (edit) hadoop-yarn-project/hadoop-yarn/hadoop-yarn-server/hadoop-yarn-server-resourcemanager/src/main/java/org/apache/hadoop/yarn/server/resourcemanager/rmcontainer/RMContainerImpl.java
        • (edit) hadoop-yarn-project/hadoop-yarn/hadoop-yarn-server/hadoop-yarn-server-resourcemanager/src/main/java/org/apache/hadoop/yarn/server/resourcemanager/metrics/TimelineServiceV1Publisher.java
        • (edit) hadoop-yarn-project/hadoop-yarn/hadoop-yarn-server/hadoop-yarn-server-resourcemanager/src/main/java/org/apache/hadoop/yarn/server/resourcemanager/rmapp/RMAppMetrics.java
        • (edit) hadoop-yarn-project/hadoop-yarn/hadoop-yarn-server/hadoop-yarn-server-resourcemanager/src/main/java/org/apache/hadoop/yarn/server/resourcemanager/webapp/RMAppBlock.java
        • (edit) hadoop-yarn-project/hadoop-yarn/hadoop-yarn-server/hadoop-yarn-server-resourcemanager/src/test/java/org/apache/hadoop/yarn/server/resourcemanager/webapp/TestAppPage.java
        • (edit) hadoop-yarn-project/hadoop-yarn/hadoop-yarn-server/hadoop-yarn-server-resourcemanager/src/test/java/org/apache/hadoop/yarn/server/resourcemanager/TestAppManager.java
        • (edit) hadoop-yarn-project/hadoop-yarn/hadoop-yarn-api/src/main/java/org/apache/hadoop/yarn/api/records/ApplicationResourceUsageReport.java
        • (edit) hadoop-yarn-project/hadoop-yarn/hadoop-yarn-server/hadoop-yarn-server-applicationhistoryservice/src/main/java/org/apache/hadoop/yarn/server/applicationhistoryservice/ApplicationHistoryManagerOnTimelineStore.java
        • (edit) hadoop-yarn-project/hadoop-yarn/hadoop-yarn-server/hadoop-yarn-server-resourcemanager/src/test/java/org/apache/hadoop/yarn/server/resourcemanager/recovery/TestZKRMStateStore.java
        • (edit) hadoop-yarn-project/hadoop-yarn/hadoop-yarn-server/hadoop-yarn-server-resourcemanager/src/test/java/org/apache/hadoop/yarn/server/resourcemanager/metrics/TestSystemMetricsPublisherForV2.java
        • (edit) hadoop-yarn-project/hadoop-yarn/hadoop-yarn-server/hadoop-yarn-server-resourcemanager/src/main/java/org/apache/hadoop/yarn/server/resourcemanager/recovery/records/impl/pb/ApplicationAttemptStateDataPBImpl.java
        • (edit) hadoop-yarn-project/hadoop-yarn/hadoop-yarn-server/hadoop-yarn-server-resourcemanager/src/main/java/org/apache/hadoop/yarn/server/resourcemanager/rmapp/RMAppImpl.java
        • (edit) hadoop-yarn-project/hadoop-yarn/hadoop-yarn-api/src/main/proto/yarn_protos.proto
        • (edit) hadoop-yarn-project/hadoop-yarn/hadoop-yarn-server/hadoop-yarn-server-resourcemanager/src/main/java/org/apache/hadoop/yarn/server/resourcemanager/RMServerUtils.java
        • (edit) hadoop-yarn-project/hadoop-yarn/hadoop-yarn-server/hadoop-yarn-server-resourcemanager/src/test/java/org/apache/hadoop/yarn/server/resourcemanager/applicationsmanager/MockAsm.java
        • (edit) hadoop-yarn-project/hadoop-yarn/hadoop-yarn-server/hadoop-yarn-server-resourcemanager/src/main/java/org/apache/hadoop/yarn/server/resourcemanager/webapp/dao/AppInfo.java
        • (edit) hadoop-yarn-project/hadoop-yarn/hadoop-yarn-server/hadoop-yarn-server-applicationhistoryservice/src/test/java/org/apache/hadoop/yarn/server/applicationhistoryservice/TestApplicationHistoryManagerOnTimelineStore.java
        • (edit) hadoop-yarn-project/hadoop-yarn/hadoop-yarn-server/hadoop-yarn-server-resourcemanager/src/main/java/org/apache/hadoop/yarn/server/resourcemanager/scheduler/SchedulerApplicationAttempt.java
        • (edit) hadoop-yarn-project/hadoop-yarn/hadoop-yarn-server/hadoop-yarn-server-resourcemanager/src/main/proto/yarn_server_resourcemanager_recovery.proto
        • (edit) hadoop-yarn-project/hadoop-yarn/hadoop-yarn-server/hadoop-yarn-server-resourcemanager/src/main/java/org/apache/hadoop/yarn/server/resourcemanager/metrics/TimelineServiceV2Publisher.java
        • (edit) hadoop-yarn-project/hadoop-yarn/hadoop-yarn-client/src/main/java/org/apache/hadoop/yarn/client/cli/ApplicationCLI.java
        • (edit) hadoop-yarn-project/hadoop-yarn/hadoop-yarn-server/hadoop-yarn-server-resourcemanager/src/test/java/org/apache/hadoop/yarn/server/resourcemanager/metrics/TestSystemMetricsPublisher.java
        • (edit) hadoop-yarn-project/hadoop-yarn/hadoop-yarn-server/hadoop-yarn-server-resourcemanager/src/main/java/org/apache/hadoop/yarn/server/resourcemanager/RMAppManager.java
        • (edit) hadoop-yarn-project/hadoop-yarn/hadoop-yarn-server/hadoop-yarn-server-resourcemanager/src/test/java/org/apache/hadoop/yarn/server/resourcemanager/webapp/TestRMWebServicesApps.java
        • (edit) hadoop-yarn-project/hadoop-yarn/hadoop-yarn-server/hadoop-yarn-server-common/src/main/java/org/apache/hadoop/yarn/server/metrics/ApplicationMetricsConstants.java
        • (edit) hadoop-yarn-project/hadoop-yarn/hadoop-yarn-server/hadoop-yarn-server-common/src/main/java/org/apache/hadoop/yarn/server/utils/BuilderUtils.java
        • (edit) hadoop-yarn-project/hadoop-yarn/hadoop-yarn-server/hadoop-yarn-server-resourcemanager/src/main/java/org/apache/hadoop/yarn/server/resourcemanager/rmapp/attempt/RMAppAttemptImpl.java
        • (edit) hadoop-yarn-project/hadoop-yarn/hadoop-yarn-server/hadoop-yarn-server-resourcemanager/src/main/java/org/apache/hadoop/yarn/server/resourcemanager/rmapp/attempt/RMAppAttemptMetrics.java
        • (edit) hadoop-yarn-project/hadoop-yarn/hadoop-yarn-server/hadoop-yarn-server-resourcemanager/src/test/java/org/apache/hadoop/yarn/server/resourcemanager/recovery/RMStateStoreTestBase.java
        • (edit) hadoop-yarn-project/hadoop-yarn/hadoop-yarn-client/src/test/java/org/apache/hadoop/yarn/client/cli/TestYarnCLI.java
        • (edit) hadoop-yarn-project/hadoop-yarn/hadoop-yarn-server/hadoop-yarn-server-resourcemanager/src/main/java/org/apache/hadoop/yarn/server/resourcemanager/recovery/RMStateStore.java
        • (edit) hadoop-yarn-project/hadoop-yarn/hadoop-yarn-server/hadoop-yarn-server-resourcemanager/src/test/java/org/apache/hadoop/yarn/server/resourcemanager/webapp/TestRMWebAppFairScheduler.java
        • (edit) hadoop-yarn-project/hadoop-yarn/hadoop-yarn-server/hadoop-yarn-server-resourcemanager/src/main/java/org/apache/hadoop/yarn/server/resourcemanager/recovery/records/ApplicationAttemptStateData.java
        Show
        hudson Hudson added a comment - SUCCESS: Integrated in Jenkins build Hadoop-trunk-Commit #10815 (See https://builds.apache.org/job/Hadoop-trunk-Commit/10815/ ) YARN-4218 . Metric for resource*time that was preempted. Contributed by (epayne: rev 93eeb13164707d0e3556c2bf737bd2ee09a335c6) (edit) hadoop-yarn-project/hadoop-yarn/hadoop-yarn-common/src/main/java/org/apache/hadoop/yarn/api/records/impl/pb/ApplicationResourceUsageReportPBImpl.java (edit) hadoop-yarn-project/hadoop-yarn/hadoop-yarn-server/hadoop-yarn-server-resourcemanager/src/main/java/org/apache/hadoop/yarn/server/resourcemanager/rmcontainer/RMContainerImpl.java (edit) hadoop-yarn-project/hadoop-yarn/hadoop-yarn-server/hadoop-yarn-server-resourcemanager/src/main/java/org/apache/hadoop/yarn/server/resourcemanager/metrics/TimelineServiceV1Publisher.java (edit) hadoop-yarn-project/hadoop-yarn/hadoop-yarn-server/hadoop-yarn-server-resourcemanager/src/main/java/org/apache/hadoop/yarn/server/resourcemanager/rmapp/RMAppMetrics.java (edit) hadoop-yarn-project/hadoop-yarn/hadoop-yarn-server/hadoop-yarn-server-resourcemanager/src/main/java/org/apache/hadoop/yarn/server/resourcemanager/webapp/RMAppBlock.java (edit) hadoop-yarn-project/hadoop-yarn/hadoop-yarn-server/hadoop-yarn-server-resourcemanager/src/test/java/org/apache/hadoop/yarn/server/resourcemanager/webapp/TestAppPage.java (edit) hadoop-yarn-project/hadoop-yarn/hadoop-yarn-server/hadoop-yarn-server-resourcemanager/src/test/java/org/apache/hadoop/yarn/server/resourcemanager/TestAppManager.java (edit) hadoop-yarn-project/hadoop-yarn/hadoop-yarn-api/src/main/java/org/apache/hadoop/yarn/api/records/ApplicationResourceUsageReport.java (edit) hadoop-yarn-project/hadoop-yarn/hadoop-yarn-server/hadoop-yarn-server-applicationhistoryservice/src/main/java/org/apache/hadoop/yarn/server/applicationhistoryservice/ApplicationHistoryManagerOnTimelineStore.java (edit) hadoop-yarn-project/hadoop-yarn/hadoop-yarn-server/hadoop-yarn-server-resourcemanager/src/test/java/org/apache/hadoop/yarn/server/resourcemanager/recovery/TestZKRMStateStore.java (edit) hadoop-yarn-project/hadoop-yarn/hadoop-yarn-server/hadoop-yarn-server-resourcemanager/src/test/java/org/apache/hadoop/yarn/server/resourcemanager/metrics/TestSystemMetricsPublisherForV2.java (edit) hadoop-yarn-project/hadoop-yarn/hadoop-yarn-server/hadoop-yarn-server-resourcemanager/src/main/java/org/apache/hadoop/yarn/server/resourcemanager/recovery/records/impl/pb/ApplicationAttemptStateDataPBImpl.java (edit) hadoop-yarn-project/hadoop-yarn/hadoop-yarn-server/hadoop-yarn-server-resourcemanager/src/main/java/org/apache/hadoop/yarn/server/resourcemanager/rmapp/RMAppImpl.java (edit) hadoop-yarn-project/hadoop-yarn/hadoop-yarn-api/src/main/proto/yarn_protos.proto (edit) hadoop-yarn-project/hadoop-yarn/hadoop-yarn-server/hadoop-yarn-server-resourcemanager/src/main/java/org/apache/hadoop/yarn/server/resourcemanager/RMServerUtils.java (edit) hadoop-yarn-project/hadoop-yarn/hadoop-yarn-server/hadoop-yarn-server-resourcemanager/src/test/java/org/apache/hadoop/yarn/server/resourcemanager/applicationsmanager/MockAsm.java (edit) hadoop-yarn-project/hadoop-yarn/hadoop-yarn-server/hadoop-yarn-server-resourcemanager/src/main/java/org/apache/hadoop/yarn/server/resourcemanager/webapp/dao/AppInfo.java (edit) hadoop-yarn-project/hadoop-yarn/hadoop-yarn-server/hadoop-yarn-server-applicationhistoryservice/src/test/java/org/apache/hadoop/yarn/server/applicationhistoryservice/TestApplicationHistoryManagerOnTimelineStore.java (edit) hadoop-yarn-project/hadoop-yarn/hadoop-yarn-server/hadoop-yarn-server-resourcemanager/src/main/java/org/apache/hadoop/yarn/server/resourcemanager/scheduler/SchedulerApplicationAttempt.java (edit) hadoop-yarn-project/hadoop-yarn/hadoop-yarn-server/hadoop-yarn-server-resourcemanager/src/main/proto/yarn_server_resourcemanager_recovery.proto (edit) hadoop-yarn-project/hadoop-yarn/hadoop-yarn-server/hadoop-yarn-server-resourcemanager/src/main/java/org/apache/hadoop/yarn/server/resourcemanager/metrics/TimelineServiceV2Publisher.java (edit) hadoop-yarn-project/hadoop-yarn/hadoop-yarn-client/src/main/java/org/apache/hadoop/yarn/client/cli/ApplicationCLI.java (edit) hadoop-yarn-project/hadoop-yarn/hadoop-yarn-server/hadoop-yarn-server-resourcemanager/src/test/java/org/apache/hadoop/yarn/server/resourcemanager/metrics/TestSystemMetricsPublisher.java (edit) hadoop-yarn-project/hadoop-yarn/hadoop-yarn-server/hadoop-yarn-server-resourcemanager/src/main/java/org/apache/hadoop/yarn/server/resourcemanager/RMAppManager.java (edit) hadoop-yarn-project/hadoop-yarn/hadoop-yarn-server/hadoop-yarn-server-resourcemanager/src/test/java/org/apache/hadoop/yarn/server/resourcemanager/webapp/TestRMWebServicesApps.java (edit) hadoop-yarn-project/hadoop-yarn/hadoop-yarn-server/hadoop-yarn-server-common/src/main/java/org/apache/hadoop/yarn/server/metrics/ApplicationMetricsConstants.java (edit) hadoop-yarn-project/hadoop-yarn/hadoop-yarn-server/hadoop-yarn-server-common/src/main/java/org/apache/hadoop/yarn/server/utils/BuilderUtils.java (edit) hadoop-yarn-project/hadoop-yarn/hadoop-yarn-server/hadoop-yarn-server-resourcemanager/src/main/java/org/apache/hadoop/yarn/server/resourcemanager/rmapp/attempt/RMAppAttemptImpl.java (edit) hadoop-yarn-project/hadoop-yarn/hadoop-yarn-server/hadoop-yarn-server-resourcemanager/src/main/java/org/apache/hadoop/yarn/server/resourcemanager/rmapp/attempt/RMAppAttemptMetrics.java (edit) hadoop-yarn-project/hadoop-yarn/hadoop-yarn-server/hadoop-yarn-server-resourcemanager/src/test/java/org/apache/hadoop/yarn/server/resourcemanager/recovery/RMStateStoreTestBase.java (edit) hadoop-yarn-project/hadoop-yarn/hadoop-yarn-client/src/test/java/org/apache/hadoop/yarn/client/cli/TestYarnCLI.java (edit) hadoop-yarn-project/hadoop-yarn/hadoop-yarn-server/hadoop-yarn-server-resourcemanager/src/main/java/org/apache/hadoop/yarn/server/resourcemanager/recovery/RMStateStore.java (edit) hadoop-yarn-project/hadoop-yarn/hadoop-yarn-server/hadoop-yarn-server-resourcemanager/src/test/java/org/apache/hadoop/yarn/server/resourcemanager/webapp/TestRMWebAppFairScheduler.java (edit) hadoop-yarn-project/hadoop-yarn/hadoop-yarn-server/hadoop-yarn-server-resourcemanager/src/main/java/org/apache/hadoop/yarn/server/resourcemanager/recovery/records/ApplicationAttemptStateData.java
        Hide
        eepayne Eric Payne added a comment -

        Thanks Chang Li. I committed this JIRA to trunk, branch-2, and branch-2.8.

        Show
        eepayne Eric Payne added a comment - Thanks Chang Li . I committed this JIRA to trunk, branch-2, and branch-2.8.

          People

          • Assignee:
            lichangleo Chang Li
            Reporter:
            lichangleo Chang Li
          • Votes:
            0 Vote for this issue
            Watchers:
            9 Start watching this issue

            Dates

            • Created:
              Updated:
              Resolved:

              Development