Uploaded image for project: 'Hadoop YARN'
  1. Hadoop YARN
  2. YARN-4145

Make RMHATestBase abstract so its not run when running all tests under that namespace

    Details

    • Type: Improvement
    • Status: Resolved
    • Priority: Minor
    • Resolution: Fixed
    • Affects Version/s: None
    • Fix Version/s: 2.8.0, 3.0.0-alpha1
    • Component/s: None
    • Labels:
      None
    • Hadoop Flags:
      Reviewed

      Description

      Make it abstract to avoid running it as a test

      1. YARN-4145.001.patch
        1.0 kB
        Anubhav Dhoot

        Activity

        Hide
        hadoopqa Hadoop QA added a comment -



        -1 overall



        Vote Subsystem Runtime Comment
        0 pre-patch 7m 2s Pre-patch trunk compilation is healthy.
        +1 @author 0m 0s The patch does not contain any @author tags.
        +1 tests included 0m 0s The patch appears to include 1 new or modified test files.
        +1 javac 8m 6s There were no new javac warning messages.
        +1 release audit 0m 21s The applied patch does not increase the total number of release audit warnings.
        +1 checkstyle 0m 54s There were no new checkstyle issues.
        +1 whitespace 0m 0s The patch has no lines that end in whitespace.
        +1 install 1m 30s mvn install still works.
        +1 eclipse:eclipse 0m 33s The patch built with eclipse:eclipse.
        +1 findbugs 1m 30s The patch does not introduce any new Findbugs (version 3.0.0) warnings.
        -1 yarn tests 54m 4s Tests failed in hadoop-yarn-server-resourcemanager.
            74m 4s  



        Reason Tests
        Timed out tests org.apache.hadoop.yarn.server.resourcemanager.scheduler.fifo.TestFifoScheduler
          org.apache.hadoop.yarn.server.resourcemanager.scheduler.capacity.TestCapacityScheduler
          org.apache.hadoop.yarn.server.resourcemanager.webapp.TestRMWebServicesAppsModification



        Subsystem Report/Notes
        Patch URL http://issues.apache.org/jira/secure/attachment/12755259/YARN-4145.001.patch
        Optional Tests javac unit findbugs checkstyle
        git revision trunk / f103a70
        hadoop-yarn-server-resourcemanager test log https://builds.apache.org/job/PreCommit-YARN-Build/9081/artifact/patchprocess/testrun_hadoop-yarn-server-resourcemanager.txt
        Test Results https://builds.apache.org/job/PreCommit-YARN-Build/9081/testReport/
        Java 1.7.0_55
        uname Linux asf901.gq1.ygridcore.net 3.13.0-36-lowlatency #63-Ubuntu SMP PREEMPT Wed Sep 3 21:56:12 UTC 2014 x86_64 x86_64 x86_64 GNU/Linux
        Console output https://builds.apache.org/job/PreCommit-YARN-Build/9081/console

        This message was automatically generated.

        Show
        hadoopqa Hadoop QA added a comment - -1 overall Vote Subsystem Runtime Comment 0 pre-patch 7m 2s Pre-patch trunk compilation is healthy. +1 @author 0m 0s The patch does not contain any @author tags. +1 tests included 0m 0s The patch appears to include 1 new or modified test files. +1 javac 8m 6s There were no new javac warning messages. +1 release audit 0m 21s The applied patch does not increase the total number of release audit warnings. +1 checkstyle 0m 54s There were no new checkstyle issues. +1 whitespace 0m 0s The patch has no lines that end in whitespace. +1 install 1m 30s mvn install still works. +1 eclipse:eclipse 0m 33s The patch built with eclipse:eclipse. +1 findbugs 1m 30s The patch does not introduce any new Findbugs (version 3.0.0) warnings. -1 yarn tests 54m 4s Tests failed in hadoop-yarn-server-resourcemanager.     74m 4s   Reason Tests Timed out tests org.apache.hadoop.yarn.server.resourcemanager.scheduler.fifo.TestFifoScheduler   org.apache.hadoop.yarn.server.resourcemanager.scheduler.capacity.TestCapacityScheduler   org.apache.hadoop.yarn.server.resourcemanager.webapp.TestRMWebServicesAppsModification Subsystem Report/Notes Patch URL http://issues.apache.org/jira/secure/attachment/12755259/YARN-4145.001.patch Optional Tests javac unit findbugs checkstyle git revision trunk / f103a70 hadoop-yarn-server-resourcemanager test log https://builds.apache.org/job/PreCommit-YARN-Build/9081/artifact/patchprocess/testrun_hadoop-yarn-server-resourcemanager.txt Test Results https://builds.apache.org/job/PreCommit-YARN-Build/9081/testReport/ Java 1.7.0_55 uname Linux asf901.gq1.ygridcore.net 3.13.0-36-lowlatency #63-Ubuntu SMP PREEMPT Wed Sep 3 21:56:12 UTC 2014 x86_64 x86_64 x86_64 GNU/Linux Console output https://builds.apache.org/job/PreCommit-YARN-Build/9081/console This message was automatically generated.
        Hide
        adhoot Anubhav Dhoot added a comment -

        The timed out tests are not related to this base class.

        Show
        adhoot Anubhav Dhoot added a comment - The timed out tests are not related to this base class.
        Hide
        rkanter Robert Kanter added a comment -

        +1 LGTM

        Show
        rkanter Robert Kanter added a comment - +1 LGTM
        Hide
        rkanter Robert Kanter added a comment -

        Thanks Anubhav. Committed to trunk and branch-2!

        Show
        rkanter Robert Kanter added a comment - Thanks Anubhav. Committed to trunk and branch-2!
        Hide
        hudson Hudson added a comment -

        FAILURE: Integrated in Hadoop-trunk-Commit #8436 (See https://builds.apache.org/job/Hadoop-trunk-Commit/8436/)
        YARN-4145. Make RMHATestBase abstract so its not run when running all tests under that namespace (adhoot via rkanter) (rkanter: rev ea4bb2749f966a5eaf712d1dbb2c845df0f5ca67)

        • hadoop-yarn-project/CHANGES.txt
        • hadoop-yarn-project/hadoop-yarn/hadoop-yarn-server/hadoop-yarn-server-resourcemanager/src/test/java/org/apache/hadoop/yarn/server/resourcemanager/RMHATestBase.java
        Show
        hudson Hudson added a comment - FAILURE: Integrated in Hadoop-trunk-Commit #8436 (See https://builds.apache.org/job/Hadoop-trunk-Commit/8436/ ) YARN-4145 . Make RMHATestBase abstract so its not run when running all tests under that namespace (adhoot via rkanter) (rkanter: rev ea4bb2749f966a5eaf712d1dbb2c845df0f5ca67) hadoop-yarn-project/CHANGES.txt hadoop-yarn-project/hadoop-yarn/hadoop-yarn-server/hadoop-yarn-server-resourcemanager/src/test/java/org/apache/hadoop/yarn/server/resourcemanager/RMHATestBase.java
        Hide
        hudson Hudson added a comment -

        FAILURE: Integrated in Hadoop-Yarn-trunk-Java8 #380 (See https://builds.apache.org/job/Hadoop-Yarn-trunk-Java8/380/)
        YARN-4145. Make RMHATestBase abstract so its not run when running all tests under that namespace (adhoot via rkanter) (rkanter: rev ea4bb2749f966a5eaf712d1dbb2c845df0f5ca67)

        • hadoop-yarn-project/CHANGES.txt
        • hadoop-yarn-project/hadoop-yarn/hadoop-yarn-server/hadoop-yarn-server-resourcemanager/src/test/java/org/apache/hadoop/yarn/server/resourcemanager/RMHATestBase.java
        Show
        hudson Hudson added a comment - FAILURE: Integrated in Hadoop-Yarn-trunk-Java8 #380 (See https://builds.apache.org/job/Hadoop-Yarn-trunk-Java8/380/ ) YARN-4145 . Make RMHATestBase abstract so its not run when running all tests under that namespace (adhoot via rkanter) (rkanter: rev ea4bb2749f966a5eaf712d1dbb2c845df0f5ca67) hadoop-yarn-project/CHANGES.txt hadoop-yarn-project/hadoop-yarn/hadoop-yarn-server/hadoop-yarn-server-resourcemanager/src/test/java/org/apache/hadoop/yarn/server/resourcemanager/RMHATestBase.java
        Hide
        hudson Hudson added a comment -

        FAILURE: Integrated in Hadoop-Yarn-trunk #1112 (See https://builds.apache.org/job/Hadoop-Yarn-trunk/1112/)
        YARN-4145. Make RMHATestBase abstract so its not run when running all tests under that namespace (adhoot via rkanter) (rkanter: rev ea4bb2749f966a5eaf712d1dbb2c845df0f5ca67)

        • hadoop-yarn-project/hadoop-yarn/hadoop-yarn-server/hadoop-yarn-server-resourcemanager/src/test/java/org/apache/hadoop/yarn/server/resourcemanager/RMHATestBase.java
        • hadoop-yarn-project/CHANGES.txt
        Show
        hudson Hudson added a comment - FAILURE: Integrated in Hadoop-Yarn-trunk #1112 (See https://builds.apache.org/job/Hadoop-Yarn-trunk/1112/ ) YARN-4145 . Make RMHATestBase abstract so its not run when running all tests under that namespace (adhoot via rkanter) (rkanter: rev ea4bb2749f966a5eaf712d1dbb2c845df0f5ca67) hadoop-yarn-project/hadoop-yarn/hadoop-yarn-server/hadoop-yarn-server-resourcemanager/src/test/java/org/apache/hadoop/yarn/server/resourcemanager/RMHATestBase.java hadoop-yarn-project/CHANGES.txt
        Hide
        hudson Hudson added a comment -

        FAILURE: Integrated in Hadoop-Mapreduce-trunk-Java8 #374 (See https://builds.apache.org/job/Hadoop-Mapreduce-trunk-Java8/374/)
        YARN-4145. Make RMHATestBase abstract so its not run when running all tests under that namespace (adhoot via rkanter) (rkanter: rev ea4bb2749f966a5eaf712d1dbb2c845df0f5ca67)

        • hadoop-yarn-project/CHANGES.txt
        • hadoop-yarn-project/hadoop-yarn/hadoop-yarn-server/hadoop-yarn-server-resourcemanager/src/test/java/org/apache/hadoop/yarn/server/resourcemanager/RMHATestBase.java
        Show
        hudson Hudson added a comment - FAILURE: Integrated in Hadoop-Mapreduce-trunk-Java8 #374 (See https://builds.apache.org/job/Hadoop-Mapreduce-trunk-Java8/374/ ) YARN-4145 . Make RMHATestBase abstract so its not run when running all tests under that namespace (adhoot via rkanter) (rkanter: rev ea4bb2749f966a5eaf712d1dbb2c845df0f5ca67) hadoop-yarn-project/CHANGES.txt hadoop-yarn-project/hadoop-yarn/hadoop-yarn-server/hadoop-yarn-server-resourcemanager/src/test/java/org/apache/hadoop/yarn/server/resourcemanager/RMHATestBase.java
        Hide
        hudson Hudson added a comment -

        FAILURE: Integrated in Hadoop-Hdfs-trunk #2299 (See https://builds.apache.org/job/Hadoop-Hdfs-trunk/2299/)
        YARN-4145. Make RMHATestBase abstract so its not run when running all tests under that namespace (adhoot via rkanter) (rkanter: rev ea4bb2749f966a5eaf712d1dbb2c845df0f5ca67)

        • hadoop-yarn-project/hadoop-yarn/hadoop-yarn-server/hadoop-yarn-server-resourcemanager/src/test/java/org/apache/hadoop/yarn/server/resourcemanager/RMHATestBase.java
        • hadoop-yarn-project/CHANGES.txt
        Show
        hudson Hudson added a comment - FAILURE: Integrated in Hadoop-Hdfs-trunk #2299 (See https://builds.apache.org/job/Hadoop-Hdfs-trunk/2299/ ) YARN-4145 . Make RMHATestBase abstract so its not run when running all tests under that namespace (adhoot via rkanter) (rkanter: rev ea4bb2749f966a5eaf712d1dbb2c845df0f5ca67) hadoop-yarn-project/hadoop-yarn/hadoop-yarn-server/hadoop-yarn-server-resourcemanager/src/test/java/org/apache/hadoop/yarn/server/resourcemanager/RMHATestBase.java hadoop-yarn-project/CHANGES.txt
        Hide
        hudson Hudson added a comment -

        SUCCESS: Integrated in Hadoop-Mapreduce-trunk #2322 (See https://builds.apache.org/job/Hadoop-Mapreduce-trunk/2322/)
        YARN-4145. Make RMHATestBase abstract so its not run when running all tests under that namespace (adhoot via rkanter) (rkanter: rev ea4bb2749f966a5eaf712d1dbb2c845df0f5ca67)

        • hadoop-yarn-project/hadoop-yarn/hadoop-yarn-server/hadoop-yarn-server-resourcemanager/src/test/java/org/apache/hadoop/yarn/server/resourcemanager/RMHATestBase.java
        • hadoop-yarn-project/CHANGES.txt
        Show
        hudson Hudson added a comment - SUCCESS: Integrated in Hadoop-Mapreduce-trunk #2322 (See https://builds.apache.org/job/Hadoop-Mapreduce-trunk/2322/ ) YARN-4145 . Make RMHATestBase abstract so its not run when running all tests under that namespace (adhoot via rkanter) (rkanter: rev ea4bb2749f966a5eaf712d1dbb2c845df0f5ca67) hadoop-yarn-project/hadoop-yarn/hadoop-yarn-server/hadoop-yarn-server-resourcemanager/src/test/java/org/apache/hadoop/yarn/server/resourcemanager/RMHATestBase.java hadoop-yarn-project/CHANGES.txt
        Hide
        hudson Hudson added a comment -

        FAILURE: Integrated in Hadoop-Hdfs-trunk-Java8 #360 (See https://builds.apache.org/job/Hadoop-Hdfs-trunk-Java8/360/)
        YARN-4145. Make RMHATestBase abstract so its not run when running all tests under that namespace (adhoot via rkanter) (rkanter: rev ea4bb2749f966a5eaf712d1dbb2c845df0f5ca67)

        • hadoop-yarn-project/CHANGES.txt
        • hadoop-yarn-project/hadoop-yarn/hadoop-yarn-server/hadoop-yarn-server-resourcemanager/src/test/java/org/apache/hadoop/yarn/server/resourcemanager/RMHATestBase.java
        Show
        hudson Hudson added a comment - FAILURE: Integrated in Hadoop-Hdfs-trunk-Java8 #360 (See https://builds.apache.org/job/Hadoop-Hdfs-trunk-Java8/360/ ) YARN-4145 . Make RMHATestBase abstract so its not run when running all tests under that namespace (adhoot via rkanter) (rkanter: rev ea4bb2749f966a5eaf712d1dbb2c845df0f5ca67) hadoop-yarn-project/CHANGES.txt hadoop-yarn-project/hadoop-yarn/hadoop-yarn-server/hadoop-yarn-server-resourcemanager/src/test/java/org/apache/hadoop/yarn/server/resourcemanager/RMHATestBase.java

          People

          • Assignee:
            adhoot Anubhav Dhoot
            Reporter:
            adhoot Anubhav Dhoot
          • Votes:
            0 Vote for this issue
            Watchers:
            5 Start watching this issue

            Dates

            • Created:
              Updated:
              Resolved:

              Development