Uploaded image for project: 'Hadoop YARN'
  1. Hadoop YARN
  2. YARN-2747

TestAggregatedLogFormat fails in trunk

    XMLWordPrintableJSON

    Details

    • Type: Test
    • Status: Closed
    • Priority: Major
    • Resolution: Fixed
    • Affects Version/s: None
    • Fix Version/s: 2.6.0
    • Component/s: None
    • Labels:
      None
    • Hadoop Flags:
      Reviewed

      Description

      Running org.apache.hadoop.yarn.logaggregation.TestAggregatedLogFormat
      Tests run: 3, Failures: 1, Errors: 0, Skipped: 0, Time elapsed: 1.105 sec <<< FAILURE! - in org.apache.hadoop.yarn.logaggregation.TestAggregatedLogFormat
      testContainerLogsFileAccess(org.apache.hadoop.yarn.logaggregation.TestAggregatedLogFormat) Time elapsed: 0.047 sec <<< FAILURE!
      java.lang.AssertionError: null
      at org.junit.Assert.fail(Assert.java:86)
      at org.junit.Assert.assertTrue(Assert.java:41)
      at org.junit.Assert.assertTrue(Assert.java:52)
      at org.apache.hadoop.yarn.logaggregation.TestAggregatedLogFormat.testContainerLogsFileAccess(TestAggregatedLogFormat.java:346)

        Attachments

        1. YARN-2747.1.patch
          2 kB
          Xuan Gong

          Issue Links

            Activity

              People

              • Assignee:
                xgong Xuan Gong
                Reporter:
                xgong Xuan Gong
              • Votes:
                0 Vote for this issue
                Watchers:
                6 Start watching this issue

                Dates

                • Created:
                  Updated:
                  Resolved: