Uploaded image for project: 'Hadoop YARN'
  1. Hadoop YARN
  2. YARN-2584

TestContainerManagerSecurity fails on trunk

    XMLWordPrintableJSON

    Details

    • Type: Test
    • Status: Closed
    • Priority: Major
    • Resolution: Fixed
    • Affects Version/s: None
    • Fix Version/s: 2.6.0
    • Component/s: None
    • Labels:
      None

      Description

      Tests run: 4, Failures: 2, Errors: 0, Skipped: 0, Time elapsed: 561.964 sec <<< FAILURE! - in org.apache.hadoop.yarn.server.TestContainerManagerSecurity
      testContainerManager[0](org.apache.hadoop.yarn.server.TestContainerManagerSecurity)  Time elapsed: 259.553 sec  <<< FAILURE!
      java.lang.AssertionError: null
      	at org.junit.Assert.fail(Assert.java:86)
      	at org.junit.Assert.assertTrue(Assert.java:41)
      	at org.junit.Assert.assertFalse(Assert.java:64)
      	at org.junit.Assert.assertFalse(Assert.java:74)
      	at org.apache.hadoop.yarn.server.TestContainerManagerSecurity.waitForContainerToFinishOnNM(TestContainerManagerSecurity.java:365)
      	at org.apache.hadoop.yarn.server.TestContainerManagerSecurity.testNMTokens(TestContainerManagerSecurity.java:304)
      	at org.apache.hadoop.yarn.server.TestContainerManagerSecurity.testContainerManager(TestContainerManagerSecurity.java:149)
      
      testContainerManager[1](org.apache.hadoop.yarn.server.TestContainerManagerSecurity)  Time elapsed: 258.762 sec  <<< FAILURE!
      java.lang.AssertionError: null
      	at org.junit.Assert.fail(Assert.java:86)
      	at org.junit.Assert.assertTrue(Assert.java:41)
      	at org.junit.Assert.assertFalse(Assert.java:64)
      	at org.junit.Assert.assertFalse(Assert.java:74)
      	at org.apache.hadoop.yarn.server.TestContainerManagerSecurity.waitForContainerToFinishOnNM(TestContainerManagerSecurity.java:365)
      	at org.apache.hadoop.yarn.server.TestContainerManagerSecurity.testNMTokens(TestContainerManagerSecurity.java:304)
      	at org.apache.hadoop.yarn.server.TestContainerManagerSecurity.testContainerManager(TestContainerManagerSecurity.java:149)
      

        Attachments

        1. YARN-2584.1.patch
          5 kB
          Jian He

          Issue Links

            Activity

              People

              • Assignee:
                jianhe Jian He
                Reporter:
                zjshen Zhijie Shen
              • Votes:
                0 Vote for this issue
                Watchers:
                4 Start watching this issue

                Dates

                • Created:
                  Updated:
                  Resolved: