Uploaded image for project: 'Hadoop YARN'
  1. Hadoop YARN
  2. YARN-2452

TestRMApplicationHistoryWriter fails with FairScheduler

Log workAgile BoardRank to TopRank to BottomAttach filesAttach ScreenshotBulk Copy AttachmentsBulk Move AttachmentsVotersWatch issueWatchersCreate sub-taskConvert to sub-taskMoveLinkCloneLabelsUpdate Comment AuthorReplace String in CommentUpdate Comment VisibilityDelete Comments
    XMLWordPrintableJSON

Details

    • Bug
    • Status: Closed
    • Major
    • Resolution: Fixed
    • None
    • 2.6.0
    • None
    • None
    • Reviewed

    Description

      TestRMApplicationHistoryWriter is failed for FairScheduler. The failure is the following:
      T E S T S
      -------------------------------------------------------
      Running org.apache.hadoop.yarn.server.resourcemanager.ahs.TestRMApplicationHistoryWriter
      Tests run: 5, Failures: 1, Errors: 0, Skipped: 0, Time elapsed: 69.311 sec <<< FAILURE! - in org.apache.hadoop.yarn.server.resourcemanager.ahs.TestRMApplicationHistoryWriter
      testRMWritingMassiveHistory(org.apache.hadoop.yarn.server.resourcemanager.ahs.TestRMApplicationHistoryWriter) Time elapsed: 66.261 sec <<< FAILURE!
      java.lang.AssertionError: expected:<10000> but was:<200>
      at org.junit.Assert.fail(Assert.java:88)
      at org.junit.Assert.failNotEquals(Assert.java:743)
      at org.junit.Assert.assertEquals(Assert.java:118)
      at org.junit.Assert.assertEquals(Assert.java:555)
      at org.junit.Assert.assertEquals(Assert.java:542)
      at org.apache.hadoop.yarn.server.resourcemanager.ahs.TestRMApplicationHistoryWriter.testRMWritingMassiveHistory(TestRMApplicationHistoryWriter.java:430)
      at org.apache.hadoop.yarn.server.resourcemanager.ahs.TestRMApplicationHistoryWriter.testRMWritingMassiveHistory(TestRMApplicationHistoryWriter.java:391)

      Attachments

        Activity

          This comment will be Viewable by All Users Viewable by All Users
          Cancel

          People

            zxu Zhihai Xu Assign to me
            zxu Zhihai Xu
            Votes:
            0 Vote for this issue
            Watchers:
            7 Start watching this issue

            Dates

              Created:
              Updated:
              Resolved:

              Slack

                Issue deployment