Uploaded image for project: 'Hadoop YARN'
  1. Hadoop YARN
  2. YARN-2158

TestRMWebServicesAppsModification sometimes fails in trunk

VotersStop watchingWatchersCreate sub-taskLinkCloneUpdate Comment AuthorReplace String in CommentUpdate Comment VisibilityDelete Comments
    XMLWordPrintableJSON

Details

    • Test
    • Status: Closed
    • Minor
    • Resolution: Fixed
    • None
    • 2.6.0
    • None
    • None
    • Reviewed

    Description

      From https://builds.apache.org/job/Hadoop-Yarn-trunk/582/console :

      Tests run: 10, Failures: 1, Errors: 0, Skipped: 0, Time elapsed: 66.144 sec <<< FAILURE! - in org.apache.hadoop.yarn.server.resourcemanager.webapp.TestRMWebServicesAppsModification
      testSingleAppKill[1](org.apache.hadoop.yarn.server.resourcemanager.webapp.TestRMWebServicesAppsModification)  Time elapsed: 2.297 sec  <<< FAILURE!
      java.lang.AssertionError: app state incorrect
      	at org.junit.Assert.fail(Assert.java:88)
      	at org.junit.Assert.assertTrue(Assert.java:41)
      	at org.apache.hadoop.yarn.server.resourcemanager.webapp.TestRMWebServicesAppsModification.verifyAppStateJson(TestRMWebServicesAppsModification.java:398)
      	at org.apache.hadoop.yarn.server.resourcemanager.webapp.TestRMWebServicesAppsModification.testSingleAppKill(TestRMWebServicesAppsModification.java:289)
      

      Attachments

        1. apache-yarn-2158.0.patch
          2 kB
          Varun Vasudev
        2. apache-yarn-2158.1.patch
          10 kB
          Varun Vasudev

        Activity

          This comment will be Viewable by All Users Viewable by All Users
          Cancel

          People

            vvasudev Varun Vasudev
            yuzhihong@gmail.com Ted Yu
            Votes:
            0 Vote for this issue
            Watchers:
            6 Stop watching this issue

            Dates

              Created:
              Updated:
              Resolved:

              Slack

                Issue deployment