Uploaded image for project: 'Struts 2'
  1. Struts 2
  2. WW-3633

building trunk/xwork-core@1125860 fails test: testNeedsReload(com.opensymphony.xwork2.config.providers.XmlConfigurationProviderTest)

    XMLWordPrintableJSON

    Details

    • Type: Bug
    • Status: Closed
    • Priority: Major
    • Resolution: Fixed
    • Affects Version/s: 2.3.1
    • Fix Version/s: 2.3.1
    • Component/s: Other
    • Labels:
      None
    • Environment:

      Description

      jpyeron@reclaimed /projects/struts/struts2/trunk
      $ svn info
      Path: .
      URL: http://svn.apache.org/repos/asf/struts/struts2/trunk
      Repository Root: http://svn.apache.org/repos/asf
      Repository UUID: 13f79535-47bb-0310-9956-ffa450edef68
      Revision: 1125860
      Node Kind: directory
      Schedule: normal
      Last Changed Author: lukaszlenart
      Last Changed Rev: 1103618
      Last Changed Date: 2011-05-16 02:19:33 -0400 (Mon, 16 May 2011)

      jpyeron@reclaimed /projects/struts/struts2/trunk
      $ cd /projects/struts/struts2/trunk/xwork-core/ && mvn clean && mvn && cd /projects/struts/struts2/trunk/core/ && mvn clean && mvn
      <SNIP/>
      Results :

      Failed tests:
      testNeedsReload(com.opensymphony.xwork2.config.providers.XmlConfigurationProviderTest)

      Tests run: 657, Failures: 1, Errors: 0, Skipped: 0

      [INFO] ------------------------------------------------------------------------
      [INFO] BUILD FAILURE
      [INFO] ------------------------------------------------------------------------
      [INFO] Total time: 1:58.641s
      [INFO] Finished at: Sat May 21 23:44:14 EDT 2011
      [INFO] Final Memory: 12M/53M
      [INFO] ------------------------------------------------------------------------
      [ERROR] Failed to execute goal org.apache.maven.plugins:maven-surefire-plugin:2.6:test (default-test) on project xwork-core: There are test failures.
      [ERROR]
      [ERROR] Please refer to C:\Documents and Settings\All Users\Desktop\projects\struts\struts2\trunk\xwork-core\target\surefire-reports for the individual test results.
      [ERROR] -> [Help 1]
      [ERROR]
      [ERROR] To see the full stack trace of the errors, re-run Maven with the -e switch.
      [ERROR] Re-run Maven using the -X switch to enable full debug logging.
      [ERROR]
      [ERROR] For more information about the errors and possible solutions, please read the following articles:
      [ERROR] [Help 1] http://cwiki.apache.org/confluence/display/MAVEN/MojoFailureException

      is this similar to WW-2203 ?

        Attachments

        1. WW-3633-v2.patch
          2 kB
          Jason Pyeron

          Activity

            People

            • Assignee:
              lukaszlenart Lukasz Lenart
              Reporter:
              jpyeron Jason Pyeron
            • Votes:
              0 Vote for this issue
              Watchers:
              0 Start watching this issue

              Dates

              • Created:
                Updated:
                Resolved: