Whirr
  1. Whirr
  2. WHIRR-352

mvn package assembly:assembly fails

    Details

    • Type: Bug Bug
    • Status: Resolved
    • Priority: Major Major
    • Resolution: Fixed
    • Affects Version/s: 0.6.0
    • Fix Version/s: 0.7.0
    • Component/s: build
    • Labels:
    • Environment:

      linux

      Description

      mvn package assembly:assembly fails. Output ends with:

      [ERROR] BUILD ERROR
      [INFO] ------------------------------------------------------------------------
      [INFO] An error has occurred in Checkstyle report generation.

      Embedded error: Failed during checkstyle execution
      Could not find resource './build-tools/src/main/resources/checkstyle.xml'.
      [INFO] ------------------------------------------------------------------------
      [INFO] For more information, run Maven with the -e switch
      [INFO] ------------------------------------------------------------------------

      1. WHIRR-352.patch
        4 kB
        David Alves
      2. WHIRR-352.patch
        3 kB
        David Alves
      3. WHIRR-352.patch
        2 kB
        Karel Vervaeke

        Issue Links

          Activity

          Hide
          Karel Vervaeke added a comment -
          Show
          Karel Vervaeke added a comment - Made some changes to the pom following this information: http://maven.apache.org/plugins/maven-checkstyle-plugin/examples/multi-module-config.html
          Hide
          Karel Vervaeke added a comment -

          You may also want to set failOnError=true.

          Show
          Karel Vervaeke added a comment - You may also want to set failOnError=true.
          Hide
          Karel Vervaeke added a comment -

          s/failOnError/failsOnError/. Time for caffeine.

          Show
          Karel Vervaeke added a comment - s/failOnError/failsOnError/. Time for caffeine.
          Hide
          Andrei Savu added a comment -

          What maven version are you using? Are you seeing this error while packaging the current trunk? We had this problem in the past and I had the impression that we found a fix.

          Show
          Andrei Savu added a comment - What maven version are you using? Are you seeing this error while packaging the current trunk? We had this problem in the past and I had the impression that we found a fix.
          Hide
          Karel Vervaeke added a comment -

          Apache Maven 2.2.1 (r801777; 2009-08-06 21:16:01+0200)
          Java version: 1.6.0_26
          Java home: /usr/lib/jvm/java-6-sun-1.6.0.26/jre
          Default locale: en_US, platform encoding: UTF-8
          OS name: "linux" version: "2.6.38-10-generic" arch: "amd64" Family: "unix"

          Show
          Karel Vervaeke added a comment - Apache Maven 2.2.1 (r801777; 2009-08-06 21:16:01+0200) Java version: 1.6.0_26 Java home: /usr/lib/jvm/java-6-sun-1.6.0.26/jre Default locale: en_US, platform encoding: UTF-8 OS name: "linux" version: "2.6.38-10-generic" arch: "amd64" Family: "unix"
          Hide
          Andrei Savu added a comment -

          I'm moving this to 0.7.0. On my machine I'm able to run mvn package assembly:assembly without errors.

          Show
          Andrei Savu added a comment - I'm moving this to 0.7.0. On my machine I'm able to run mvn package assembly:assembly without errors.
          Hide
          Karel Vervaeke added a comment -

          BTW, I don't get the error with maven 3.

          Show
          Karel Vervaeke added a comment - BTW, I don't get the error with maven 3.
          Hide
          Thomas Jungblut added a comment -

          Hey, I get this problem too.
          I'm on the current trunk and followed the instructions in the wiki.
          When I'm in the whirr-examples project I run "mvn install" and get the following error (using -e parameter):

          [INFO] ------------------------------------------------------------------------
          [INFO] BUILD FAILURE
          [INFO] ------------------------------------------------------------------------
          [INFO] Total time: 9.717s
          [INFO] Finished at: Mon Aug 08 20:09:42 CEST 2011
          [INFO] Final Memory: 24M/194M
          [INFO] ------------------------------------------------------------------------
          [ERROR] Failed to execute goal org.apache.maven.plugins:maven-checkstyle-plugin:2.6:checkstyle (default) on project whirr-examples: An error has occurred in Checkstyle report generation. Failed during checkstyle execution: Unable to find configuration file at location ./build-tools/src/main/resources/checkstyle.xml: Could not find resource './build-tools/src/main/resources/checkstyle.xml'. -> [Help 1]
          org.apache.maven.lifecycle.LifecycleExecutionException: Failed to execute goal org.apache.maven.plugins:maven-checkstyle-plugin:2.6:checkstyle (default) on project whirr-examples: An error has occurred in Checkstyle report generation.
          	at org.apache.maven.lifecycle.internal.MojoExecutor.execute(MojoExecutor.java:217)
          	at org.apache.maven.lifecycle.internal.MojoExecutor.execute(MojoExecutor.java:153)
          	at org.apache.maven.lifecycle.internal.MojoExecutor.execute(MojoExecutor.java:145)
          	at org.apache.maven.lifecycle.internal.LifecycleModuleBuilder.buildProject(LifecycleModuleBuilder.java:84)
          	at org.apache.maven.lifecycle.internal.LifecycleModuleBuilder.buildProject(LifecycleModuleBuilder.java:59)
          	at org.apache.maven.lifecycle.internal.LifecycleStarter.singleThreadedBuild(LifecycleStarter.java:183)
          	at org.apache.maven.lifecycle.internal.LifecycleStarter.execute(LifecycleStarter.java:161)
          	at org.apache.maven.DefaultMaven.doExecute(DefaultMaven.java:319)
          	at org.apache.maven.DefaultMaven.execute(DefaultMaven.java:156)
          	at org.apache.maven.cli.MavenCli.execute(MavenCli.java:537)
          	at org.apache.maven.cli.MavenCli.doMain(MavenCli.java:196)
          	at org.apache.maven.cli.MavenCli.main(MavenCli.java:141)
          	at sun.reflect.NativeMethodAccessorImpl.invoke0(Native Method)
          	at sun.reflect.NativeMethodAccessorImpl.invoke(NativeMethodAccessorImpl.java:39)
          	at sun.reflect.DelegatingMethodAccessorImpl.invoke(DelegatingMethodAccessorImpl.java:25)
          	at java.lang.reflect.Method.invoke(Method.java:597)
          	at org.codehaus.plexus.classworlds.launcher.Launcher.launchEnhanced(Launcher.java:290)
          	at org.codehaus.plexus.classworlds.launcher.Launcher.launch(Launcher.java:230)
          	at org.codehaus.plexus.classworlds.launcher.Launcher.mainWithExitCode(Launcher.java:409)
          	at org.codehaus.plexus.classworlds.launcher.Launcher.main(Launcher.java:352)
          Caused by: org.apache.maven.plugin.MojoExecutionException: An error has occurred in Checkstyle report generation.
          	at org.apache.maven.reporting.AbstractMavenReport.execute(AbstractMavenReport.java:122)
          	at org.apache.maven.plugin.DefaultBuildPluginManager.executeMojo(DefaultBuildPluginManager.java:101)
          	at org.apache.maven.lifecycle.internal.MojoExecutor.execute(MojoExecutor.java:209)
          	... 19 more
          Caused by: org.apache.maven.reporting.MavenReportException: Failed during checkstyle execution
          	at org.apache.maven.plugin.checkstyle.CheckstyleReport.executeReport(CheckstyleReport.java:597)
          	at org.apache.maven.reporting.AbstractMavenReport.generate(AbstractMavenReport.java:190)
          	at org.apache.maven.reporting.AbstractMavenReport.execute(AbstractMavenReport.java:99)
          	... 21 more
          Caused by: org.apache.maven.plugin.checkstyle.CheckstyleExecutorException: Unable to find configuration file at location ./build-tools/src/main/resources/checkstyle.xml
          	at org.apache.maven.plugin.checkstyle.DefaultCheckstyleExecutor.getConfigFile(DefaultCheckstyleExecutor.java:481)
          	at org.apache.maven.plugin.checkstyle.DefaultCheckstyleExecutor.getConfiguration(DefaultCheckstyleExecutor.java:236)
          	at org.apache.maven.plugin.checkstyle.DefaultCheckstyleExecutor.executeCheckstyle(DefaultCheckstyleExecutor.java:173)
          	at org.apache.maven.plugin.checkstyle.CheckstyleReport.executeReport(CheckstyleReport.java:578)
          	... 23 more
          Caused by: org.codehaus.plexus.resource.loader.ResourceNotFoundException: Could not find resource './build-tools/src/main/resources/checkstyle.xml'.
          	at org.codehaus.plexus.resource.DefaultResourceManager.getResource(DefaultResourceManager.java:173)
          	at org.codehaus.plexus.resource.DefaultResourceManager.getResourceAsFile(DefaultResourceManager.java:91)
          	at org.apache.maven.plugin.checkstyle.DefaultCheckstyleExecutor.getConfigFile(DefaultCheckstyleExecutor.java:471)
          	... 26 more
          

          Which is actually fine, because there is no ./build-tools/ dir in the whirr-examples package.
          I'm totally wondering why checkstyle is getting called.

          Maven version:

          Apache Maven 3.0.3 (r1075438; 2011-02-28 18:31:09+0100)
          Maven home: /usr/local/mvn
          Java version: 1.6.0_22, vendor: Sun Microsystems Inc.
          Java home: /usr/local/jdk1.6.0_22/jre
          Default locale: de_DE, platform encoding: UTF-8
          OS name: "linux", version: "2.6.32-28-generic", arch: "amd64", family: "unix"
          
          Show
          Thomas Jungblut added a comment - Hey, I get this problem too. I'm on the current trunk and followed the instructions in the wiki. When I'm in the whirr-examples project I run "mvn install" and get the following error (using -e parameter): [INFO] ------------------------------------------------------------------------ [INFO] BUILD FAILURE [INFO] ------------------------------------------------------------------------ [INFO] Total time: 9.717s [INFO] Finished at: Mon Aug 08 20:09:42 CEST 2011 [INFO] Final Memory: 24M/194M [INFO] ------------------------------------------------------------------------ [ERROR] Failed to execute goal org.apache.maven.plugins:maven-checkstyle-plugin:2.6:checkstyle (default) on project whirr-examples: An error has occurred in Checkstyle report generation. Failed during checkstyle execution: Unable to find configuration file at location ./build-tools/src/main/resources/checkstyle.xml: Could not find resource './build-tools/src/main/resources/checkstyle.xml'. -> [Help 1] org.apache.maven.lifecycle.LifecycleExecutionException: Failed to execute goal org.apache.maven.plugins:maven-checkstyle-plugin:2.6:checkstyle (default) on project whirr-examples: An error has occurred in Checkstyle report generation. at org.apache.maven.lifecycle.internal.MojoExecutor.execute(MojoExecutor.java:217) at org.apache.maven.lifecycle.internal.MojoExecutor.execute(MojoExecutor.java:153) at org.apache.maven.lifecycle.internal.MojoExecutor.execute(MojoExecutor.java:145) at org.apache.maven.lifecycle.internal.LifecycleModuleBuilder.buildProject(LifecycleModuleBuilder.java:84) at org.apache.maven.lifecycle.internal.LifecycleModuleBuilder.buildProject(LifecycleModuleBuilder.java:59) at org.apache.maven.lifecycle.internal.LifecycleStarter.singleThreadedBuild(LifecycleStarter.java:183) at org.apache.maven.lifecycle.internal.LifecycleStarter.execute(LifecycleStarter.java:161) at org.apache.maven.DefaultMaven.doExecute(DefaultMaven.java:319) at org.apache.maven.DefaultMaven.execute(DefaultMaven.java:156) at org.apache.maven.cli.MavenCli.execute(MavenCli.java:537) at org.apache.maven.cli.MavenCli.doMain(MavenCli.java:196) at org.apache.maven.cli.MavenCli.main(MavenCli.java:141) at sun.reflect.NativeMethodAccessorImpl.invoke0(Native Method) at sun.reflect.NativeMethodAccessorImpl.invoke(NativeMethodAccessorImpl.java:39) at sun.reflect.DelegatingMethodAccessorImpl.invoke(DelegatingMethodAccessorImpl.java:25) at java.lang.reflect.Method.invoke(Method.java:597) at org.codehaus.plexus.classworlds.launcher.Launcher.launchEnhanced(Launcher.java:290) at org.codehaus.plexus.classworlds.launcher.Launcher.launch(Launcher.java:230) at org.codehaus.plexus.classworlds.launcher.Launcher.mainWithExitCode(Launcher.java:409) at org.codehaus.plexus.classworlds.launcher.Launcher.main(Launcher.java:352) Caused by: org.apache.maven.plugin.MojoExecutionException: An error has occurred in Checkstyle report generation. at org.apache.maven.reporting.AbstractMavenReport.execute(AbstractMavenReport.java:122) at org.apache.maven.plugin.DefaultBuildPluginManager.executeMojo(DefaultBuildPluginManager.java:101) at org.apache.maven.lifecycle.internal.MojoExecutor.execute(MojoExecutor.java:209) ... 19 more Caused by: org.apache.maven.reporting.MavenReportException: Failed during checkstyle execution at org.apache.maven.plugin.checkstyle.CheckstyleReport.executeReport(CheckstyleReport.java:597) at org.apache.maven.reporting.AbstractMavenReport.generate(AbstractMavenReport.java:190) at org.apache.maven.reporting.AbstractMavenReport.execute(AbstractMavenReport.java:99) ... 21 more Caused by: org.apache.maven.plugin.checkstyle.CheckstyleExecutorException: Unable to find configuration file at location ./build-tools/src/main/resources/checkstyle.xml at org.apache.maven.plugin.checkstyle.DefaultCheckstyleExecutor.getConfigFile(DefaultCheckstyleExecutor.java:481) at org.apache.maven.plugin.checkstyle.DefaultCheckstyleExecutor.getConfiguration(DefaultCheckstyleExecutor.java:236) at org.apache.maven.plugin.checkstyle.DefaultCheckstyleExecutor.executeCheckstyle(DefaultCheckstyleExecutor.java:173) at org.apache.maven.plugin.checkstyle.CheckstyleReport.executeReport(CheckstyleReport.java:578) ... 23 more Caused by: org.codehaus.plexus.resource.loader.ResourceNotFoundException: Could not find resource './build-tools/src/main/resources/checkstyle.xml'. at org.codehaus.plexus.resource.DefaultResourceManager.getResource(DefaultResourceManager.java:173) at org.codehaus.plexus.resource.DefaultResourceManager.getResourceAsFile(DefaultResourceManager.java:91) at org.apache.maven.plugin.checkstyle.DefaultCheckstyleExecutor.getConfigFile(DefaultCheckstyleExecutor.java:471) ... 26 more Which is actually fine, because there is no ./build-tools/ dir in the whirr-examples package. I'm totally wondering why checkstyle is getting called. Maven version: Apache Maven 3.0.3 (r1075438; 2011-02-28 18:31:09+0100) Maven home: /usr/local/mvn Java version: 1.6.0_22, vendor: Sun Microsystems Inc. Java home: /usr/local/jdk1.6.0_22/jre Default locale: de_DE, platform encoding: UTF-8 OS name: "linux", version: "2.6.32-28-generic", arch: "amd64", family: "unix"
          Hide
          Tom White added a comment -

          Does it work from the top-level?

          Show
          Tom White added a comment - Does it work from the top-level?
          Hide
          Thomas Jungblut added a comment -

          Yes it's fine:

          [INFO] Reactor Summary:
          [INFO] 
          [INFO] Whirr ............................................. SUCCESS [8.271s]
          [INFO] Apache Whirr Build Tools .......................... SUCCESS [1.573s]
          [INFO] Apache Whirr Core ................................. SUCCESS [20.042s]
          [INFO] Apache Whirr Voldemort ............................ SUCCESS [3.600s]
          [INFO] Apache Whirr Cassandra ............................ SUCCESS [3.244s]
          [INFO] Apache Whirr Hadoop ............................... SUCCESS [26.588s]
          [INFO] Apache Whirr ZooKeeper ............................ SUCCESS [3.057s]
          [INFO] Apache Whirr HBase ................................ SUCCESS [4.078s]
          [INFO] Apache Whirr CDH .................................. SUCCESS [2.805s]
          [INFO] Apache Whirr ElasticSearch ........................ SUCCESS [5.238s]
          [INFO] Apache Whirr Hama ................................. SUCCESS [3.219s]
          [INFO] Apache Whirr CLI .................................. SUCCESS [7.678s]
          [INFO] Apache Whirr Examples ............................. SUCCESS [2.883s]
          [INFO] ------------------------------------------------------------------------
          [INFO] BUILD SUCCESS
          [INFO] ------------------------------------------------------------------------
          [INFO] Total time: 1:33.983s
          [INFO] Finished at: Wed Aug 10 15:43:05 CEST 2011
          [INFO] Final Memory: 49M/359M
          [INFO] ------------------------------------------------------------------------
          
          Show
          Thomas Jungblut added a comment - Yes it's fine: [INFO] Reactor Summary: [INFO] [INFO] Whirr ............................................. SUCCESS [8.271s] [INFO] Apache Whirr Build Tools .......................... SUCCESS [1.573s] [INFO] Apache Whirr Core ................................. SUCCESS [20.042s] [INFO] Apache Whirr Voldemort ............................ SUCCESS [3.600s] [INFO] Apache Whirr Cassandra ............................ SUCCESS [3.244s] [INFO] Apache Whirr Hadoop ............................... SUCCESS [26.588s] [INFO] Apache Whirr ZooKeeper ............................ SUCCESS [3.057s] [INFO] Apache Whirr HBase ................................ SUCCESS [4.078s] [INFO] Apache Whirr CDH .................................. SUCCESS [2.805s] [INFO] Apache Whirr ElasticSearch ........................ SUCCESS [5.238s] [INFO] Apache Whirr Hama ................................. SUCCESS [3.219s] [INFO] Apache Whirr CLI .................................. SUCCESS [7.678s] [INFO] Apache Whirr Examples ............................. SUCCESS [2.883s] [INFO] ------------------------------------------------------------------------ [INFO] BUILD SUCCESS [INFO] ------------------------------------------------------------------------ [INFO] Total time: 1:33.983s [INFO] Finished at: Wed Aug 10 15:43:05 CEST 2011 [INFO] Final Memory: 49M/359M [INFO] ------------------------------------------------------------------------
          Hide
          Karel Vervaeke added a comment -

          I'm running it from the top level and I still get the error.

          As far as I understand checkstyle is triggered in the 'core' module, and it's looking for the checkstyle.xml under core/build-tools/...

          Also running with -e:
          (git log -1 && mvn package assembly:assembly -e) >../stdout.txt 2>&1

          – stdout.txt

          commit 423d69d3e7a2a69343912ea6fd323721d60b4111
          Author: Andrei Savu <asavu@apache.org>
          Date: Sun Aug 7 22:04:54 2011 +0000

          WHIRR-339. Allow to specify hbase-site.xml properties through cluster configuration file (Bruno Dumon via asavu)

          git-svn-id: https://svn.apache.org/repos/asf/incubator/whirr/trunk@1154780 13f79535-47bb-0310-9956-ffa450edef68
          + Error stacktraces are turned on.
          [INFO] Scanning for projects...
          [INFO] Reactor build order:
          [INFO] Whirr
          [INFO] Apache Whirr Build Tools
          [INFO] Apache Whirr Core
          [INFO] Apache Whirr Voldemort
          [INFO] Apache Whirr Cassandra
          [INFO] Apache Whirr Hadoop
          [INFO] Apache Whirr ZooKeeper
          [INFO] Apache Whirr HBase
          [INFO] Apache Whirr CDH
          [INFO] Apache Whirr ElasticSearch
          [INFO] Apache Whirr Hama
          [INFO] Apache Whirr CLI
          [INFO] Apache Whirr Examples
          [INFO] ------------------------------------------------------------------------
          [INFO] Building Whirr
          [INFO] task-segment: [package]
          [INFO] ------------------------------------------------------------------------
          [INFO] [enforcer:enforce

          {execution: enforce-java}

          ]
          [INFO] Setting property: classpath.resource.loader.class => 'org.codehaus.plexus.velocity.ContextClassLoaderResourceLoader'.
          [INFO] Setting property: velocimacro.messages.on => 'false'.
          [INFO] Setting property: resource.loader => 'classpath'.
          [INFO] Setting property: resource.manager.logwhenfound => 'false'.
          [INFO] [remote-resources:process

          {execution: default}

          ]
          [INFO] [site:attach-descriptor

          {execution: default-attach-descriptor}

          ]
          [INFO] Parent project loaded from repository.
          [INFO] [checkstyle:checkstyle

          {execution: default}

          ]
          [INFO] [jar:test-jar

          {execution: default}

          ]
          [WARNING] JAR will be empty - no content was marked for inclusion!
          [INFO] Building jar: /home/karel/work/outerthought/whirr/target/whirr-0.6.0-incubating-SNAPSHOT-tests.jar
          [INFO] Preparing source:jar
          [WARNING] Removing: jar from forked lifecycle, to prevent recursive invocation.
          [INFO] [enforcer:enforce

          {execution: enforce-java}

          ]
          [INFO] [source:jar

          {execution: default}

          ]
          [INFO] [apache-rat:check

          {execution: default}

          ]
          [INFO] Exclude: **/BUILD.txt
          [INFO] Exclude: **/CHANGES.txt
          [INFO] Exclude: **/NOTICE-src.txt
          [INFO] Exclude: .git/**
          [INFO] Exclude: .gitignore
          [INFO] Exclude: */.json
          [INFO] Exclude: **/src/main/resources/version-banner.txt
          [INFO] Exclude: docs/**
          [INFO] Exclude: */.log*
          [INFO] Exclude: .idea/**
          [INFO] Exclude: src/site/resources/images/whirr-logo.ai
          [INFO] ------------------------------------------------------------------------
          [INFO] Building Apache Whirr Build Tools
          [INFO] task-segment: [package]
          [INFO] ------------------------------------------------------------------------
          [INFO] [enforcer:enforce

          {execution: enforce-java}

          ]
          [INFO] [remote-resources:process

          {execution: default}

          ]
          [INFO] [resources:resources

          {execution: default-resources}

          ]
          [INFO] Using 'UTF-8' encoding to copy filtered resources.
          [INFO] Copying 1 resource
          [INFO] Copying 3 resources
          [INFO] [compiler:compile

          {execution: default-compile}

          ]
          [INFO] No sources to compile
          [INFO] [resources:testResources

          {execution: default-testResources}

          ]
          [INFO] Using 'UTF-8' encoding to copy filtered resources.
          [INFO] skip non existing resourceDirectory /home/karel/work/outerthought/whirr/build-tools/src/test/resources
          [INFO] Copying 3 resources
          [INFO] [compiler:testCompile

          {execution: default-testCompile}

          ]
          [INFO] No sources to compile
          [INFO] [surefire:test

          {execution: default-test}

          ]
          [INFO] Surefire report directory: /home/karel/work/outerthought/whirr/build-tools/target/surefire-reports

          -------------------------------------------------------
          T E S T S
          -------------------------------------------------------
          There are no tests to run.

          Results :

          Tests run: 0, Failures: 0, Errors: 0, Skipped: 0

          [INFO] [jar:jar

          {execution: default-jar}

          ]
          [INFO] Building jar: /home/karel/work/outerthought/whirr/build-tools/target/whirr-build-tools-0.6.0-incubating-SNAPSHOT.jar
          [INFO] [checkstyle:checkstyle

          {execution: default}

          ]
          [INFO] [jar:test-jar

          {execution: default}

          ]
          [INFO] Building jar: /home/karel/work/outerthought/whirr/build-tools/target/whirr-build-tools-0.6.0-incubating-SNAPSHOT-tests.jar
          [INFO] Preparing source:jar
          [WARNING] Removing: jar from forked lifecycle, to prevent recursive invocation.
          [INFO] [enforcer:enforce

          {execution: enforce-java}

          ]
          [INFO] [source:jar

          {execution: default}

          ]
          [INFO] Building jar: /home/karel/work/outerthought/whirr/build-tools/target/whirr-build-tools-0.6.0-incubating-SNAPSHOT-sources.jar
          [INFO] [apache-rat:check

          {execution: default}

          ]
          [INFO] Exclude: **/BUILD.txt
          [INFO] Exclude: **/CHANGES.txt
          [INFO] Exclude: **/NOTICE-src.txt
          [INFO] Exclude: .git/**
          [INFO] Exclude: .gitignore
          [INFO] Exclude: */.json
          [INFO] Exclude: **/src/main/resources/version-banner.txt
          [INFO] Exclude: docs/**
          [INFO] Exclude: */.log*
          [INFO] Exclude: .idea/**
          [INFO] Exclude: src/site/resources/images/whirr-logo.ai
          [INFO] ------------------------------------------------------------------------
          [INFO] Building Apache Whirr Core
          [INFO] task-segment: [package]
          [INFO] ------------------------------------------------------------------------
          [INFO] [enforcer:enforce

          {execution: enforce-java}

          ]
          [INFO] [remote-resources:process

          {execution: default}

          ]
          [INFO] [resources:resources

          {execution: default-resources}

          ]
          [INFO] Using 'UTF-8' encoding to copy filtered resources.
          [INFO] Copying 9 resources
          [INFO] Copying 3 resources
          [INFO] [compiler:compile

          {execution: default-compile}

          ]
          [INFO] Compiling 41 source files to /home/karel/work/outerthought/whirr/core/target/classes
          [INFO] [resources:testResources

          {execution: default-testResources}

          ]
          [INFO] Using 'UTF-8' encoding to copy filtered resources.
          [INFO] Copying 4 resources
          [INFO] Copying 3 resources
          [INFO] [compiler:testCompile

          {execution: default-testCompile}

          ]
          [INFO] Compiling 14 source files to /home/karel/work/outerthought/whirr/core/target/test-classes
          [INFO] [surefire:test

          {execution: default-test}

          ]
          [INFO] Surefire report directory: /home/karel/work/outerthought/whirr/core/target/surefire-reports

          -------------------------------------------------------
          T E S T S
          -------------------------------------------------------
          Running org.apache.whirr.service.TemplateBuilderStrategyTest
          Tests run: 3, Failures: 0, Errors: 0, Skipped: 0, Time elapsed: 1.272 sec
          Running org.apache.whirr.command.AbstractClusterCommandTest
          Tests run: 1, Failures: 0, Errors: 0, Skipped: 0, Time elapsed: 0.252 sec
          Running org.apache.whirr.service.jclouds.StatementBuilderTest
          Tests run: 1, Failures: 0, Errors: 0, Skipped: 0, Time elapsed: 0.074 sec
          Running org.apache.whirr.ClusterSpecTest
          2011-08-10 16:12:13,721 WARN [org.apache.whirr.InstanceTemplate] (main) Role name 'nn' is deprecated, use 'hadoop-namenode'
          2011-08-10 16:12:13,721 WARN [org.apache.whirr.InstanceTemplate] (main) Role name 'jt' is deprecated, use 'hadoop-jobtracker'
          2011-08-10 16:12:13,721 WARN [org.apache.whirr.InstanceTemplate] (main) Role name 'tt' is deprecated, use 'hadoop-tasktracker'
          2011-08-10 16:12:13,721 WARN [org.apache.whirr.InstanceTemplate] (main) Role name 'dn' is deprecated, use 'hadoop-datanode'
          2011-08-10 16:12:13,722 WARN [org.apache.whirr.InstanceTemplate] (main) Role name 'zk' is deprecated, use 'zookeeper'
          2011-08-10 16:12:13,864 WARN [org.apache.whirr.ClusterSpec] (main) Please use provider "aws-ec2" instead of "ec2"
          2011-08-10 16:12:14,085 WARN [org.apache.whirr.ClusterSpec] (main) Please use provider "cloudservers-us" instead of "cloudservers"
          Tests run: 21, Failures: 0, Errors: 0, Skipped: 0, Time elapsed: 1.262 sec
          Running org.apache.whirr.ClusterControllerFactoryTest
          Tests run: 2, Failures: 0, Errors: 0, Skipped: 0, Time elapsed: 0.011 sec
          Running org.apache.whirr.service.jclouds.TakeLoginCredentialsFromWhirrPropertiesTest
          Tests run: 4, Failures: 0, Errors: 0, Skipped: 0, Time elapsed: 0.012 sec
          Running org.apache.whirr.util.KeyPairTest
          Tests run: 2, Failures: 0, Errors: 0, Skipped: 0, Time elapsed: 0.301 sec
          Running org.apache.whirr.ClusterTest
          Tests run: 3, Failures: 0, Errors: 0, Skipped: 0, Time elapsed: 0.014 sec
          Running org.apache.whirr.actions.BootstrapClusterActionTest
          2011-08-10 16:12:14,851 WARN [org.apache.whirr.InstanceTemplate] (main) Role name 'jt' is deprecated, use 'hadoop-jobtracker'
          2011-08-10 16:12:14,851 WARN [org.apache.whirr.InstanceTemplate] (main) Role name 'nn' is deprecated, use 'hadoop-namenode'
          2011-08-10 16:12:14,851 WARN [org.apache.whirr.InstanceTemplate] (main) Role name 'dn' is deprecated, use 'hadoop-datanode'
          2011-08-10 16:12:14,851 WARN [org.apache.whirr.InstanceTemplate] (main) Role name 'tt' is deprecated, use 'hadoop-tasktracker'
          2011-08-10 16:12:14,851 WARN [org.apache.whirr.ClusterSpec] (main) Please use provider "aws-ec2" instead of "ec2"
          2011-08-10 16:12:14,907 INFO [org.apache.whirr.actions.BootstrapClusterAction] (main) Bootstrapping cluster
          2011-08-10 16:12:14,912 INFO [org.apache.whirr.actions.BootstrapClusterAction] (main) Configuring template
          2011-08-10 16:12:14,926 INFO [org.apache.whirr.actions.BootstrapClusterAction] (main) Configuring template
          2011-08-10 16:12:14,932 INFO [org.apache.whirr.actions.BootstrapClusterActionTest] (pool-1-thread-2) [hadoop-datanode, hadoop-tasktracker] - Node successfully started: nodeId10
          2011-08-10 16:12:14,932 INFO [org.apache.whirr.actions.BootstrapClusterActionTest] (pool-1-thread-4) [hadoop-jobtracker, hadoop-namenode] - Node failing to start: nodeId20
          2011-08-10 16:12:14,932 INFO [org.apache.whirr.actions.BootstrapClusterActionTest] (pool-1-thread-2) [hadoop-datanode, hadoop-tasktracker] - Node successfully started: nodeId11
          2011-08-10 16:12:14,933 INFO [org.apache.whirr.actions.BootstrapClusterActionTest] (pool-1-thread-2) [hadoop-datanode, hadoop-tasktracker] - Node successfully started: nodeId12
          2011-08-10 16:12:14,933 INFO [org.apache.whirr.actions.BootstrapClusterActionTest] (pool-1-thread-2) [hadoop-datanode, hadoop-tasktracker] - Node failing to start: nodeId13
          2011-08-10 16:12:14,938 INFO [org.apache.whirr.actions.BootstrapClusterActionTest] (pool-1-thread-5) [hadoop-jobtracker, hadoop-namenode] - Node successfully started: nodeId30
          2011-08-10 16:12:14,939 INFO [org.apache.whirr.actions.BootstrapClusterAction] (pool-1-thread-4) Deleting failed node node nodeId13
          2011-08-10 16:12:14,939 INFO [org.apache.whirr.actions.BootstrapClusterAction] (pool-1-thread-4) Node deleted: nodeId13
          2011-08-10 16:12:14,940 INFO [org.apache.whirr.actions.BootstrapClusterAction] (pool-1-thread-2) Deleting failed node node nodeId20
          2011-08-10 16:12:14,940 INFO [org.apache.whirr.actions.BootstrapClusterAction] (pool-1-thread-2) Node deleted: nodeId20
          2011-08-10 16:12:15,053 WARN [org.apache.whirr.InstanceTemplate] (main) Role name 'jt' is deprecated, use 'hadoop-jobtracker'
          2011-08-10 16:12:15,054 WARN [org.apache.whirr.InstanceTemplate] (main) Role name 'nn' is deprecated, use 'hadoop-namenode'
          2011-08-10 16:12:15,054 WARN [org.apache.whirr.InstanceTemplate] (main) Role name 'dn' is deprecated, use 'hadoop-datanode'
          2011-08-10 16:12:15,054 WARN [org.apache.whirr.InstanceTemplate] (main) Role name 'tt' is deprecated, use 'hadoop-tasktracker'
          2011-08-10 16:12:15,054 WARN [org.apache.whirr.ClusterSpec] (main) Please use provider "aws-ec2" instead of "ec2"
          2011-08-10 16:12:15,059 INFO [org.apache.whirr.actions.BootstrapClusterAction] (main) Bootstrapping cluster
          2011-08-10 16:12:15,059 INFO [org.apache.whirr.actions.BootstrapClusterAction] (main) Configuring template
          2011-08-10 16:12:15,062 INFO [org.apache.whirr.actions.BootstrapClusterActionTest] (pool-2-thread-2) [hadoop-datanode, hadoop-tasktracker] - Node successfully started: nodeId10
          2011-08-10 16:12:15,062 INFO [org.apache.whirr.actions.BootstrapClusterAction] (main) Configuring template
          2011-08-10 16:12:15,062 INFO [org.apache.whirr.actions.BootstrapClusterActionTest] (pool-2-thread-2) [hadoop-datanode, hadoop-tasktracker] - Node failing to start: nodeId11
          2011-08-10 16:12:15,062 INFO [org.apache.whirr.actions.BootstrapClusterActionTest] (pool-2-thread-2) [hadoop-datanode, hadoop-tasktracker] - Node failing to start: nodeId12
          2011-08-10 16:12:15,063 INFO [org.apache.whirr.actions.BootstrapClusterActionTest] (pool-2-thread-2) [hadoop-datanode, hadoop-tasktracker] - Node failing to start: nodeId13
          2011-08-10 16:12:15,064 INFO [org.apache.whirr.actions.BootstrapClusterActionTest] (pool-2-thread-3) [hadoop-datanode, hadoop-tasktracker] - Node successfully started: nodeId20
          2011-08-10 16:12:15,064 INFO [org.apache.whirr.actions.BootstrapClusterActionTest] (pool-2-thread-3) [hadoop-datanode, hadoop-tasktracker] - Node failing to start: nodeId21
          2011-08-10 16:12:15,064 INFO [org.apache.whirr.actions.BootstrapClusterActionTest] (pool-2-thread-3) [hadoop-datanode, hadoop-tasktracker] - Node failing to start: nodeId22
          2011-08-10 16:12:15,066 INFO [org.apache.whirr.actions.BootstrapClusterAction] (pool-2-thread-3) Deleting failed node node nodeId13
          2011-08-10 16:12:15,068 INFO [org.apache.whirr.actions.BootstrapClusterAction] (pool-2-thread-3) Node deleted: nodeId13
          2011-08-10 16:12:15,068 INFO [org.apache.whirr.actions.BootstrapClusterAction] (pool-2-thread-3) Deleting failed node node nodeId22
          2011-08-10 16:12:15,068 INFO [org.apache.whirr.actions.BootstrapClusterAction] (pool-2-thread-5) Deleting failed node node nodeId21
          2011-08-10 16:12:15,068 INFO [org.apache.whirr.actions.BootstrapClusterActionTest] (pool-2-thread-4) [hadoop-jobtracker, hadoop-namenode] - Node successfully started: nodeId30
          2011-08-10 16:12:15,068 INFO [org.apache.whirr.actions.BootstrapClusterAction] (pool-2-thread-3) Node deleted: nodeId22
          2011-08-10 16:12:15,069 INFO [org.apache.whirr.actions.BootstrapClusterAction] (pool-2-thread-6) Deleting failed node node nodeId12
          2011-08-10 16:12:15,069 INFO [org.apache.whirr.actions.BootstrapClusterAction] (pool-2-thread-5) Node deleted: nodeId21
          2011-08-10 16:12:15,069 INFO [org.apache.whirr.actions.BootstrapClusterAction] (pool-2-thread-7) Deleting failed node node nodeId11
          2011-08-10 16:12:15,070 INFO [org.apache.whirr.actions.BootstrapClusterAction] (pool-2-thread-6) Node deleted: nodeId12
          2011-08-10 16:12:15,070 INFO [org.apache.whirr.actions.BootstrapClusterAction] (pool-2-thread-7) Node deleted: nodeId11
          Tests run: 2, Failures: 0, Errors: 0, Skipped: 0, Time elapsed: 0.302 sec
          Running org.apache.whirr.service.jclouds.RunUrlStatementTest
          Tests run: 6, Failures: 0, Errors: 0, Skipped: 0, Time elapsed: 0.431 sec

          Results :

          Tests run: 45, Failures: 0, Errors: 0, Skipped: 0

          [INFO] [jar:jar

          {execution: default-jar}

          ]
          [INFO] Building jar: /home/karel/work/outerthought/whirr/core/target/whirr-core-0.6.0-incubating-SNAPSHOT.jar
          [INFO] [checkstyle:checkstyle

          {execution: default}

          ]
          [INFO]
          [WARNING] Unable to locate Source XRef to link to - DISABLED
          [INFO] [jar:test-jar

          {execution: default}

          ]
          [INFO] Building jar: /home/karel/work/outerthought/whirr/core/target/whirr-core-0.6.0-incubating-SNAPSHOT-tests.jar
          [INFO] Preparing source:jar
          [WARNING] Removing: jar from forked lifecycle, to prevent recursive invocation.
          [INFO] [enforcer:enforce

          {execution: enforce-java}

          ]
          [INFO] [source:jar

          {execution: default}

          ]
          [INFO] Building jar: /home/karel/work/outerthought/whirr/core/target/whirr-core-0.6.0-incubating-SNAPSHOT-sources.jar
          [INFO] [apache-rat:check

          {execution: default}

          ]
          [INFO] Exclude: **/BUILD.txt
          [INFO] Exclude: **/CHANGES.txt
          [INFO] Exclude: **/NOTICE-src.txt
          [INFO] Exclude: .git/**
          [INFO] Exclude: .gitignore
          [INFO] Exclude: */.json
          [INFO] Exclude: **/src/main/resources/version-banner.txt
          [INFO] Exclude: docs/**
          [INFO] Exclude: */.log*
          [INFO] Exclude: .idea/**
          [INFO] Exclude: src/site/resources/images/whirr-logo.ai
          [INFO] ------------------------------------------------------------------------
          [INFO] Building Apache Whirr Voldemort
          [INFO] task-segment: [package]
          [INFO] ------------------------------------------------------------------------
          [INFO] [enforcer:enforce

          {execution: enforce-java}

          ]
          [INFO] [remote-resources:process

          {execution: default}

          ]
          [INFO] [resources:resources

          {execution: default-resources}

          ]
          [INFO] Using 'UTF-8' encoding to copy filtered resources.
          [INFO] Copying 6 resources
          [INFO] Copying 3 resources
          [INFO] [compiler:compile

          {execution: default-compile}

          ]
          [INFO] Compiling 2 source files to /home/karel/work/outerthought/whirr/services/voldemort/target/classes
          [INFO] [resources:testResources

          {execution: default-testResources}

          ]
          [INFO] Using 'UTF-8' encoding to copy filtered resources.
          [INFO] Copying 2 resources
          [INFO] Copying 3 resources
          [INFO] [compiler:testCompile

          {execution: default-testCompile}

          ]
          [INFO] Compiling 1 source file to /home/karel/work/outerthought/whirr/services/voldemort/target/test-classes
          [INFO] [surefire:test

          {execution: default-test}

          ]
          [INFO] Surefire report directory: /home/karel/work/outerthought/whirr/services/voldemort/target/surefire-reports

          -------------------------------------------------------
          T E S T S
          -------------------------------------------------------
          There are no tests to run.

          Results :

          Tests run: 0, Failures: 0, Errors: 0, Skipped: 0

          [INFO] [jar:jar

          {execution: default-jar}

          ]
          [INFO] Building jar: /home/karel/work/outerthought/whirr/services/voldemort/target/whirr-voldemort-0.6.0-incubating-SNAPSHOT.jar
          [INFO] [checkstyle:checkstyle

          {execution: default}

          ]
          [INFO]
          [WARNING] Unable to locate Source XRef to link to - DISABLED
          [INFO] [jar:test-jar

          {execution: default}

          ]
          [INFO] Building jar: /home/karel/work/outerthought/whirr/services/voldemort/target/whirr-voldemort-0.6.0-incubating-SNAPSHOT-tests.jar
          [INFO] Preparing source:jar
          [WARNING] Removing: jar from forked lifecycle, to prevent recursive invocation.
          [INFO] [enforcer:enforce

          {execution: enforce-java}

          ]
          [INFO] [source:jar

          {execution: default}

          ]
          [INFO] Building jar: /home/karel/work/outerthought/whirr/services/voldemort/target/whirr-voldemort-0.6.0-incubating-SNAPSHOT-sources.jar
          [INFO] [apache-rat:check

          {execution: default}

          ]
          [INFO] Exclude: **/BUILD.txt
          [INFO] Exclude: **/CHANGES.txt
          [INFO] Exclude: **/NOTICE-src.txt
          [INFO] Exclude: .git/**
          [INFO] Exclude: .gitignore
          [INFO] Exclude: */.json
          [INFO] Exclude: **/src/main/resources/version-banner.txt
          [INFO] Exclude: docs/**
          [INFO] Exclude: */.log*
          [INFO] Exclude: .idea/**
          [INFO] Exclude: src/site/resources/images/whirr-logo.ai
          [INFO] ------------------------------------------------------------------------
          [INFO] Building Apache Whirr Cassandra
          [INFO] task-segment: [package]
          [INFO] ------------------------------------------------------------------------
          [INFO] [enforcer:enforce

          {execution: enforce-java}

          ]
          [INFO] [remote-resources:process

          {execution: default}

          ]
          [INFO] [resources:resources

          {execution: default-resources}

          ]
          [INFO] Using 'UTF-8' encoding to copy filtered resources.
          [INFO] Copying 6 resources
          [INFO] Copying 3 resources
          [INFO] [compiler:compile

          {execution: default-compile}

          ]
          [INFO] Compiling 1 source file to /home/karel/work/outerthought/whirr/services/cassandra/target/classes
          [INFO] [resources:testResources

          {execution: default-testResources}

          ]
          [INFO] Using 'UTF-8' encoding to copy filtered resources.
          [INFO] Copying 2 resources
          [INFO] Copying 3 resources
          [INFO] [compiler:testCompile

          {execution: default-testCompile}

          ]
          [INFO] Compiling 2 source files to /home/karel/work/outerthought/whirr/services/cassandra/target/test-classes
          [INFO] [surefire:test

          {execution: default-test}

          ]
          [INFO] Surefire report directory: /home/karel/work/outerthought/whirr/services/cassandra/target/surefire-reports

          -------------------------------------------------------
          T E S T S
          -------------------------------------------------------
          Running org.apache.whirr.service.cassandra.CassandraClusterActionHandlerTest
          Tests run: 1, Failures: 0, Errors: 0, Skipped: 0, Time elapsed: 0.23 sec

          Results :

          Tests run: 1, Failures: 0, Errors: 0, Skipped: 0

          [INFO] [jar:jar

          {execution: default-jar}

          ]
          [INFO] Building jar: /home/karel/work/outerthought/whirr/services/cassandra/target/whirr-cassandra-0.6.0-incubating-SNAPSHOT.jar
          [INFO] [checkstyle:checkstyle

          {execution: default}

          ]
          [INFO]
          [WARNING] Unable to locate Source XRef to link to - DISABLED
          [INFO] [jar:test-jar

          {execution: default}

          ]
          [INFO] Building jar: /home/karel/work/outerthought/whirr/services/cassandra/target/whirr-cassandra-0.6.0-incubating-SNAPSHOT-tests.jar
          [INFO] Preparing source:jar
          [WARNING] Removing: jar from forked lifecycle, to prevent recursive invocation.
          [INFO] [enforcer:enforce

          {execution: enforce-java}

          ]
          [INFO] [source:jar

          {execution: default}

          ]
          [INFO] Building jar: /home/karel/work/outerthought/whirr/services/cassandra/target/whirr-cassandra-0.6.0-incubating-SNAPSHOT-sources.jar
          [INFO] [apache-rat:check

          {execution: default}

          ]
          [INFO] Exclude: **/BUILD.txt
          [INFO] Exclude: **/CHANGES.txt
          [INFO] Exclude: **/NOTICE-src.txt
          [INFO] Exclude: .git/**
          [INFO] Exclude: .gitignore
          [INFO] Exclude: */.json
          [INFO] Exclude: **/src/main/resources/version-banner.txt
          [INFO] Exclude: docs/**
          [INFO] Exclude: */.log*
          [INFO] Exclude: .idea/**
          [INFO] Exclude: src/site/resources/images/whirr-logo.ai
          [INFO] ------------------------------------------------------------------------
          [INFO] Building Apache Whirr Hadoop
          [INFO] task-segment: [package]
          [INFO] ------------------------------------------------------------------------
          [INFO] [enforcer:enforce

          {execution: enforce-java}

          ]
          [INFO] [remote-resources:process

          {execution: default}

          ]
          [INFO] [resources:resources

          {execution: default-resources}

          ]
          [INFO] Using 'UTF-8' encoding to copy filtered resources.
          [INFO] Copying 4 resources
          [INFO] Copying 3 resources
          [INFO] [compiler:compile

          {execution: default-compile}

          ]
          [INFO] Compiling 9 source files to /home/karel/work/outerthought/whirr/services/hadoop/target/classes
          [INFO] [resources:testResources

          {execution: default-testResources}

          ]
          [INFO] Using 'UTF-8' encoding to copy filtered resources.
          [INFO] Copying 2 resources
          [INFO] Copying 3 resources
          [INFO] [compiler:testCompile

          {execution: default-testCompile}

          ]
          [INFO] Compiling 7 source files to /home/karel/work/outerthought/whirr/services/hadoop/target/test-classes
          [INFO] [surefire:test

          {execution: default-test}

          ]
          [INFO] Surefire report directory: /home/karel/work/outerthought/whirr/services/hadoop/target/surefire-reports

          -------------------------------------------------------
          T E S T S
          -------------------------------------------------------
          Running org.apache.whirr.service.hadoop.HadoopConfigurationConverterTest
          Tests run: 2, Failures: 0, Errors: 0, Skipped: 0, Time elapsed: 0.29 sec
          Running org.apache.whirr.service.hadoop.HadoopConfigurationBuilderTest
          Tests run: 5, Failures: 0, Errors: 0, Skipped: 0, Time elapsed: 21.575 sec

          Results :

          Tests run: 7, Failures: 0, Errors: 0, Skipped: 0

          [INFO] [jar:jar

          {execution: default-jar}

          ]
          [INFO] Building jar: /home/karel/work/outerthought/whirr/services/hadoop/target/whirr-hadoop-0.6.0-incubating-SNAPSHOT.jar
          [INFO] [checkstyle:checkstyle

          {execution: default}

          ]
          [INFO]
          [WARNING] Unable to locate Source XRef to link to - DISABLED
          [INFO] [jar:test-jar

          {execution: default}

          ]
          [INFO] Building jar: /home/karel/work/outerthought/whirr/services/hadoop/target/whirr-hadoop-0.6.0-incubating-SNAPSHOT-tests.jar
          [INFO] Preparing source:jar
          [WARNING] Removing: jar from forked lifecycle, to prevent recursive invocation.
          [INFO] [enforcer:enforce

          {execution: enforce-java}

          ]
          [INFO] [source:jar

          {execution: default}

          ]
          [INFO] Building jar: /home/karel/work/outerthought/whirr/services/hadoop/target/whirr-hadoop-0.6.0-incubating-SNAPSHOT-sources.jar
          [INFO] [apache-rat:check

          {execution: default}

          ]
          [INFO] Exclude: **/BUILD.txt
          [INFO] Exclude: **/CHANGES.txt
          [INFO] Exclude: **/NOTICE-src.txt
          [INFO] Exclude: .git/**
          [INFO] Exclude: .gitignore
          [INFO] Exclude: */.json
          [INFO] Exclude: **/src/main/resources/version-banner.txt
          [INFO] Exclude: docs/**
          [INFO] Exclude: */.log*
          [INFO] Exclude: .idea/**
          [INFO] Exclude: src/site/resources/images/whirr-logo.ai
          [INFO] ------------------------------------------------------------------------
          [INFO] Building Apache Whirr ZooKeeper
          [INFO] task-segment: [package]
          [INFO] ------------------------------------------------------------------------
          [INFO] [enforcer:enforce

          {execution: enforce-java}

          ]
          [INFO] [remote-resources:process

          {execution: default}

          ]
          [INFO] [resources:resources

          {execution: default-resources}

          ]
          [INFO] Using 'UTF-8' encoding to copy filtered resources.
          [INFO] Copying 7 resources
          [INFO] Copying 3 resources
          [INFO] [compiler:compile

          {execution: default-compile}

          ]
          [INFO] Compiling 2 source files to /home/karel/work/outerthought/whirr/services/zookeeper/target/classes
          [INFO] [resources:testResources

          {execution: default-testResources}

          ]
          [INFO] Using 'UTF-8' encoding to copy filtered resources.
          [INFO] Copying 2 resources
          [INFO] Copying 3 resources
          [INFO] [compiler:testCompile

          {execution: default-testCompile}

          ]
          [INFO] Compiling 1 source file to /home/karel/work/outerthought/whirr/services/zookeeper/target/test-classes
          [INFO] [surefire:test

          {execution: default-test}

          ]
          [INFO] Surefire report directory: /home/karel/work/outerthought/whirr/services/zookeeper/target/surefire-reports

          -------------------------------------------------------
          T E S T S
          -------------------------------------------------------
          There are no tests to run.

          Results :

          Tests run: 0, Failures: 0, Errors: 0, Skipped: 0

          [INFO] [jar:jar

          {execution: default-jar}

          ]
          [INFO] Building jar: /home/karel/work/outerthought/whirr/services/zookeeper/target/whirr-zookeeper-0.6.0-incubating-SNAPSHOT.jar
          [INFO] [checkstyle:checkstyle

          {execution: default}

          ]
          [INFO]
          [WARNING] Unable to locate Source XRef to link to - DISABLED
          [INFO] [jar:test-jar

          {execution: default}

          ]
          [INFO] Building jar: /home/karel/work/outerthought/whirr/services/zookeeper/target/whirr-zookeeper-0.6.0-incubating-SNAPSHOT-tests.jar
          [INFO] Preparing source:jar
          [WARNING] Removing: jar from forked lifecycle, to prevent recursive invocation.
          [INFO] [enforcer:enforce

          {execution: enforce-java}

          ]
          [INFO] [source:jar

          {execution: default}

          ]
          [INFO] Building jar: /home/karel/work/outerthought/whirr/services/zookeeper/target/whirr-zookeeper-0.6.0-incubating-SNAPSHOT-sources.jar
          [INFO] [apache-rat:check

          {execution: default}

          ]
          [INFO] Exclude: **/BUILD.txt
          [INFO] Exclude: **/CHANGES.txt
          [INFO] Exclude: **/NOTICE-src.txt
          [INFO] Exclude: .git/**
          [INFO] Exclude: .gitignore
          [INFO] Exclude: */.json
          [INFO] Exclude: **/src/main/resources/version-banner.txt
          [INFO] Exclude: docs/**
          [INFO] Exclude: */.log*
          [INFO] Exclude: .idea/**
          [INFO] Exclude: src/site/resources/images/whirr-logo.ai
          [INFO] ------------------------------------------------------------------------
          [INFO] Building Apache Whirr HBase
          [INFO] task-segment: [package]
          [INFO] ------------------------------------------------------------------------
          [INFO] [enforcer:enforce

          {execution: enforce-java}

          ]
          [INFO] [remote-resources:process

          {execution: default}

          ]
          [INFO] [resources:resources

          {execution: default-resources}

          ]
          [INFO] Using 'UTF-8' encoding to copy filtered resources.
          [INFO] Copying 4 resources
          [INFO] Copying 3 resources
          [INFO] [compiler:compile

          {execution: default-compile}

          ]
          [INFO] Compiling 10 source files to /home/karel/work/outerthought/whirr/services/hbase/target/classes
          [INFO] [resources:testResources

          {execution: default-testResources}

          ]
          [INFO] Using 'UTF-8' encoding to copy filtered resources.
          [INFO] Copying 3 resources
          [INFO] Copying 3 resources
          [INFO] [compiler:testCompile

          {execution: default-testCompile}

          ]
          [INFO] Compiling 4 source files to /home/karel/work/outerthought/whirr/services/hbase/target/test-classes
          [INFO] [surefire:test

          {execution: default-test}

          ]
          [INFO] Surefire report directory: /home/karel/work/outerthought/whirr/services/hbase/target/surefire-reports

          -------------------------------------------------------
          T E S T S
          -------------------------------------------------------
          There are no tests to run.

          Results :

          Tests run: 0, Failures: 0, Errors: 0, Skipped: 0

          [INFO] [jar:jar

          {execution: default-jar}

          ]
          [INFO] Building jar: /home/karel/work/outerthought/whirr/services/hbase/target/whirr-hbase-0.6.0-incubating-SNAPSHOT.jar
          [INFO] [checkstyle:checkstyle

          {execution: default}

          ]
          [INFO]
          [WARNING] Unable to locate Source XRef to link to - DISABLED
          [INFO] [jar:test-jar

          {execution: default}

          ]
          [INFO] Building jar: /home/karel/work/outerthought/whirr/services/hbase/target/whirr-hbase-0.6.0-incubating-SNAPSHOT-tests.jar
          [INFO] Preparing source:jar
          [WARNING] Removing: jar from forked lifecycle, to prevent recursive invocation.
          [INFO] [enforcer:enforce

          {execution: enforce-java}

          ]
          [INFO] [source:jar

          {execution: default}

          ]
          [INFO] Building jar: /home/karel/work/outerthought/whirr/services/hbase/target/whirr-hbase-0.6.0-incubating-SNAPSHOT-sources.jar
          [INFO] [apache-rat:check

          {execution: default}

          ]
          [INFO] Exclude: **/BUILD.txt
          [INFO] Exclude: **/CHANGES.txt
          [INFO] Exclude: **/NOTICE-src.txt
          [INFO] Exclude: .git/**
          [INFO] Exclude: .gitignore
          [INFO] Exclude: */.json
          [INFO] Exclude: **/src/main/resources/version-banner.txt
          [INFO] Exclude: docs/**
          [INFO] Exclude: */.log*
          [INFO] Exclude: .idea/**
          [INFO] Exclude: src/site/resources/images/whirr-logo.ai
          [INFO] ------------------------------------------------------------------------
          [INFO] Building Apache Whirr CDH
          [INFO] task-segment: [package]
          [INFO] ------------------------------------------------------------------------
          [INFO] [enforcer:enforce

          {execution: enforce-java}

          ]
          [INFO] [remote-resources:process

          {execution: default}

          ]
          [INFO] [resources:resources

          {execution: default-resources}

          ]
          [INFO] Using 'UTF-8' encoding to copy filtered resources.
          [INFO] Copying 6 resources
          [INFO] Copying 3 resources
          [INFO] [compiler:compile

          {execution: default-compile}

          ]
          [INFO] No sources to compile
          [INFO] [resources:testResources

          {execution: default-testResources}

          ]
          [INFO] Using 'UTF-8' encoding to copy filtered resources.
          [INFO] Copying 4 resources
          [INFO] Copying 3 resources
          [INFO] [compiler:testCompile

          {execution: default-testCompile}

          ]
          [INFO] Compiling 3 source files to /home/karel/work/outerthought/whirr/services/cdh/target/test-classes
          [INFO] [surefire:test

          {execution: default-test}

          ]
          [INFO] Surefire report directory: /home/karel/work/outerthought/whirr/services/cdh/target/surefire-reports

          -------------------------------------------------------
          T E S T S
          -------------------------------------------------------
          There are no tests to run.

          Results :

          Tests run: 0, Failures: 0, Errors: 0, Skipped: 0

          [INFO] [jar:jar

          {execution: default-jar}

          ]
          [INFO] Building jar: /home/karel/work/outerthought/whirr/services/cdh/target/whirr-cdh-0.6.0-incubating-SNAPSHOT.jar
          [INFO] [checkstyle:checkstyle

          {execution: default}

          ]
          [INFO] [jar:test-jar

          {execution: default}

          ]
          [INFO] Building jar: /home/karel/work/outerthought/whirr/services/cdh/target/whirr-cdh-0.6.0-incubating-SNAPSHOT-tests.jar
          [INFO] Preparing source:jar
          [WARNING] Removing: jar from forked lifecycle, to prevent recursive invocation.
          [INFO] [enforcer:enforce

          {execution: enforce-java}

          ]
          [INFO] [source:jar

          {execution: default}

          ]
          [INFO] Building jar: /home/karel/work/outerthought/whirr/services/cdh/target/whirr-cdh-0.6.0-incubating-SNAPSHOT-sources.jar
          [INFO] [apache-rat:check

          {execution: default}

          ]
          [INFO] Exclude: **/BUILD.txt
          [INFO] Exclude: **/CHANGES.txt
          [INFO] Exclude: **/NOTICE-src.txt
          [INFO] Exclude: .git/**
          [INFO] Exclude: .gitignore
          [INFO] Exclude: */.json
          [INFO] Exclude: **/src/main/resources/version-banner.txt
          [INFO] Exclude: docs/**
          [INFO] Exclude: */.log*
          [INFO] Exclude: .idea/**
          [INFO] Exclude: src/site/resources/images/whirr-logo.ai
          [INFO] ------------------------------------------------------------------------
          [INFO] Building Apache Whirr ElasticSearch
          [INFO] task-segment: [package]
          [INFO] ------------------------------------------------------------------------
          [INFO] [enforcer:enforce

          {execution: enforce-java}

          ]
          [INFO] [remote-resources:process

          {execution: default}

          ]
          [INFO] [resources:resources

          {execution: default-resources}

          ]
          [INFO] Using 'UTF-8' encoding to copy filtered resources.
          [INFO] Copying 7 resources
          [INFO] Copying 3 resources
          [INFO] [compiler:compile

          {execution: default-compile}

          ]
          [INFO] Compiling 2 source files to /home/karel/work/outerthought/whirr/services/elasticsearch/target/classes
          [INFO] [resources:testResources

          {execution: default-testResources}

          ]
          [INFO] Using 'UTF-8' encoding to copy filtered resources.
          [INFO] Copying 1 resource
          [INFO] Copying 3 resources
          [INFO] [compiler:testCompile

          {execution: default-testCompile}

          ]
          [INFO] Compiling 2 source files to /home/karel/work/outerthought/whirr/services/elasticsearch/target/test-classes
          [INFO] [surefire:test

          {execution: default-test}

          ]
          [INFO] Surefire report directory: /home/karel/work/outerthought/whirr/services/elasticsearch/target/surefire-reports

          -------------------------------------------------------
          T E S T S
          -------------------------------------------------------
          Running org.apache.whirr.service.elasticsearch.ElasticSearchConfigurationBuilderTest
          Tests run: 4, Failures: 0, Errors: 0, Skipped: 0, Time elapsed: 1.472 sec

          Results :

          Tests run: 4, Failures: 0, Errors: 0, Skipped: 0

          [INFO] [jar:jar

          {execution: default-jar}

          ]
          [INFO] Building jar: /home/karel/work/outerthought/whirr/services/elasticsearch/target/whirr-elasticsearch-0.6.0-incubating-SNAPSHOT.jar
          [INFO] [checkstyle:checkstyle

          {execution: default}

          ]
          [INFO]
          [WARNING] Unable to locate Source XRef to link to - DISABLED
          [INFO] [jar:test-jar

          {execution: default}

          ]
          [INFO] Building jar: /home/karel/work/outerthought/whirr/services/elasticsearch/target/whirr-elasticsearch-0.6.0-incubating-SNAPSHOT-tests.jar
          [INFO] Preparing source:jar
          [WARNING] Removing: jar from forked lifecycle, to prevent recursive invocation.
          [INFO] [enforcer:enforce

          {execution: enforce-java}

          ]
          [INFO] [source:jar

          {execution: default}

          ]
          [INFO] Building jar: /home/karel/work/outerthought/whirr/services/elasticsearch/target/whirr-elasticsearch-0.6.0-incubating-SNAPSHOT-sources.jar
          [INFO] [apache-rat:check

          {execution: default}

          ]
          [INFO] Exclude: **/BUILD.txt
          [INFO] Exclude: **/CHANGES.txt
          [INFO] Exclude: **/NOTICE-src.txt
          [INFO] Exclude: .git/**
          [INFO] Exclude: .gitignore
          [INFO] Exclude: */.json
          [INFO] Exclude: **/src/main/resources/version-banner.txt
          [INFO] Exclude: docs/**
          [INFO] Exclude: */.log*
          [INFO] Exclude: .idea/**
          [INFO] Exclude: src/site/resources/images/whirr-logo.ai
          [INFO] ------------------------------------------------------------------------
          [INFO] Building Apache Whirr Hama
          [INFO] task-segment: [package]
          [INFO] ------------------------------------------------------------------------
          [INFO] [enforcer:enforce

          {execution: enforce-java}

          ]
          [INFO] [remote-resources:process

          {execution: default}

          ]
          [INFO] [resources:resources

          {execution: default-resources}

          ]
          [INFO] Using 'UTF-8' encoding to copy filtered resources.
          [INFO] Copying 5 resources
          [INFO] Copying 3 resources
          [INFO] [compiler:compile

          {execution: default-compile}

          ]
          [INFO] Compiling 5 source files to /home/karel/work/outerthought/whirr/services/hama/target/classes
          [INFO] [resources:testResources

          {execution: default-testResources}

          ]
          [INFO] Using 'UTF-8' encoding to copy filtered resources.
          [INFO] Copying 1 resource
          [INFO] Copying 3 resources
          [INFO] [compiler:testCompile

          {execution: default-testCompile}

          ]
          [INFO] Compiling 2 source files to /home/karel/work/outerthought/whirr/services/hama/target/test-classes
          [INFO] [surefire:test

          {execution: default-test}

          ]
          [INFO] Surefire report directory: /home/karel/work/outerthought/whirr/services/hama/target/surefire-reports

          -------------------------------------------------------
          T E S T S
          -------------------------------------------------------
          There are no tests to run.

          Results :

          Tests run: 0, Failures: 0, Errors: 0, Skipped: 0

          [INFO] [jar:jar

          {execution: default-jar}

          ]
          [INFO] Building jar: /home/karel/work/outerthought/whirr/services/hama/target/whirr-hama-0.6.0-incubating-SNAPSHOT.jar
          [INFO] [checkstyle:checkstyle

          {execution: default}

          ]
          [INFO]
          [WARNING] Unable to locate Source XRef to link to - DISABLED
          [INFO] [jar:test-jar

          {execution: default}

          ]
          [INFO] Building jar: /home/karel/work/outerthought/whirr/services/hama/target/whirr-hama-0.6.0-incubating-SNAPSHOT-tests.jar
          [INFO] Preparing source:jar
          [WARNING] Removing: jar from forked lifecycle, to prevent recursive invocation.
          [INFO] [enforcer:enforce

          {execution: enforce-java}

          ]
          [INFO] [source:jar

          {execution: default}

          ]
          [INFO] Building jar: /home/karel/work/outerthought/whirr/services/hama/target/whirr-hama-0.6.0-incubating-SNAPSHOT-sources.jar
          [INFO] [apache-rat:check

          {execution: default}

          ]
          [INFO] Exclude: **/BUILD.txt
          [INFO] Exclude: **/CHANGES.txt
          [INFO] Exclude: **/NOTICE-src.txt
          [INFO] Exclude: .git/**
          [INFO] Exclude: .gitignore
          [INFO] Exclude: */.json
          [INFO] Exclude: **/src/main/resources/version-banner.txt
          [INFO] Exclude: docs/**
          [INFO] Exclude: */.log*
          [INFO] Exclude: .idea/**
          [INFO] Exclude: src/site/resources/images/whirr-logo.ai
          [INFO] ------------------------------------------------------------------------
          [INFO] Building Apache Whirr CLI
          [INFO] task-segment: [package]
          [INFO] ------------------------------------------------------------------------
          [INFO] [enforcer:enforce

          {execution: enforce-java}

          ]
          [INFO] [remote-resources:process

          {execution: default}

          ]
          [INFO] [resources:resources

          {execution: default-resources}

          ]
          [INFO] Using 'UTF-8' encoding to copy filtered resources.
          [INFO] Copying 4 resources
          [INFO] Copying 3 resources
          [INFO] [compiler:compile

          {execution: default-compile}

          ]
          [INFO] Compiling 8 source files to /home/karel/work/outerthought/whirr/cli/target/classes
          [INFO] [resources:testResources

          {execution: default-testResources}

          ]
          [INFO] Using 'UTF-8' encoding to copy filtered resources.
          [INFO] skip non existing resourceDirectory /home/karel/work/outerthought/whirr/cli/src/test/resources
          [INFO] Copying 3 resources
          [INFO] [compiler:testCompile

          {execution: default-testCompile}

          ]
          [INFO] Compiling 8 source files to /home/karel/work/outerthought/whirr/cli/target/test-classes
          [INFO] [surefire:test

          {execution: default-test}

          ]
          [INFO] Surefire report directory: /home/karel/work/outerthought/whirr/cli/target/surefire-reports

          -------------------------------------------------------
          T E S T S
          -------------------------------------------------------
          Running org.apache.whirr.cli.command.ListClusterCommandTest
          Tests run: 2, Failures: 0, Errors: 0, Skipped: 0, Time elapsed: 1.229 sec
          Running org.apache.whirr.cli.command.RunScriptCommandTest
          Tests run: 3, Failures: 0, Errors: 0, Skipped: 0, Time elapsed: 0.352 sec
          Running org.apache.whirr.cli.command.DestroyInstanceCommandTest
          Tests run: 2, Failures: 0, Errors: 0, Skipped: 0, Time elapsed: 0.176 sec
          Running org.apache.whirr.cli.command.LaunchClusterCommandTest
          Role name 'jt' is deprecated, use 'hadoop-jobtracker'
          Role name 'nn' is deprecated, use 'hadoop-namenode'
          Role name 'dn' is deprecated, use 'hadoop-datanode'
          Role name 'tt' is deprecated, use 'hadoop-tasktracker'
          Please use provider "aws-ec2" instead of "ec2"
          Role name 'jt' is deprecated, use 'hadoop-jobtracker'
          Role name 'nn' is deprecated, use 'hadoop-namenode'
          Role name 'tt' is deprecated, use 'hadoop-tasktracker'
          Role name 'dn' is deprecated, use 'hadoop-datanode'
          Please use provider "aws-ec2" instead of "ec2"
          Tests run: 3, Failures: 0, Errors: 0, Skipped: 0, Time elapsed: 0.336 sec
          Running org.apache.whirr.cli.command.VersionCommandTest
          Tests run: 1, Failures: 0, Errors: 0, Skipped: 0, Time elapsed: 0.006 sec
          Running org.apache.whirr.cli.command.DestroyClusterCommandTest
          Tests run: 2, Failures: 0, Errors: 0, Skipped: 0, Time elapsed: 0.358 sec
          Running org.apache.whirr.cli.MainTest
          Tests run: 3, Failures: 0, Errors: 0, Skipped: 0, Time elapsed: 0.044 sec

          Results :

          Tests run: 16, Failures: 0, Errors: 0, Skipped: 0

          [INFO] [jar:jar

          {execution: default-jar}

          ]
          [INFO] Building jar: /home/karel/work/outerthought/whirr/cli/target/whirr-cli-0.6.0-incubating-SNAPSHOT.jar
          [INFO] [checkstyle:checkstyle

          {execution: default}

          ]
          [INFO]
          [WARNING] Unable to locate Source XRef to link to - DISABLED
          [INFO] [jar:test-jar

          {execution: default}

          ]
          [INFO] Building jar: /home/karel/work/outerthought/whirr/cli/target/whirr-cli-0.6.0-incubating-SNAPSHOT-tests.jar
          [INFO] Preparing source:jar
          [WARNING] Removing: jar from forked lifecycle, to prevent recursive invocation.
          [INFO] [enforcer:enforce

          {execution: enforce-java}

          ]
          [INFO] [source:jar

          {execution: default}

          ]
          [INFO] Building jar: /home/karel/work/outerthought/whirr/cli/target/whirr-cli-0.6.0-incubating-SNAPSHOT-sources.jar
          [INFO] [apache-rat:check

          {execution: default}

          ]
          [INFO] Exclude: **/BUILD.txt
          [INFO] Exclude: **/CHANGES.txt
          [INFO] Exclude: **/NOTICE-src.txt
          [INFO] Exclude: .git/**
          [INFO] Exclude: .gitignore
          [INFO] Exclude: */.json
          [INFO] Exclude: **/src/main/resources/version-banner.txt
          [INFO] Exclude: docs/**
          [INFO] Exclude: */.log*
          [INFO] Exclude: .idea/**
          [INFO] Exclude: src/site/resources/images/whirr-logo.ai
          [INFO] ------------------------------------------------------------------------
          [INFO] Building Apache Whirr Examples
          [INFO] task-segment: [package]
          [INFO] ------------------------------------------------------------------------
          [INFO] [enforcer:enforce

          {execution: enforce-java}

          ]
          [INFO] [remote-resources:process

          {execution: default}

          ]
          [INFO] [resources:resources

          {execution: default-resources}

          ]
          [INFO] Using 'UTF-8' encoding to copy filtered resources.
          [INFO] Copying 2 resources
          [INFO] Copying 3 resources
          [INFO] [compiler:compile

          {execution: default-compile}

          ]
          [INFO] Compiling 3 source files to /home/karel/work/outerthought/whirr/examples/target/classes
          [INFO] [resources:testResources

          {execution: default-testResources}

          ]
          [INFO] Using 'UTF-8' encoding to copy filtered resources.
          [INFO] skip non existing resourceDirectory /home/karel/work/outerthought/whirr/examples/src/test/resources
          [INFO] Copying 3 resources
          [INFO] [compiler:testCompile

          {execution: default-testCompile}

          ]
          [INFO] No sources to compile
          [INFO] [surefire:test

          {execution: default-test}

          ]
          [INFO] Surefire report directory: /home/karel/work/outerthought/whirr/examples/target/surefire-reports

          -------------------------------------------------------
          T E S T S
          -------------------------------------------------------
          There are no tests to run.

          Results :

          Tests run: 0, Failures: 0, Errors: 0, Skipped: 0

          [INFO] [jar:jar

          {execution: default-jar}

          ]
          [INFO] Building jar: /home/karel/work/outerthought/whirr/examples/target/whirr-examples-0.6.0-incubating-SNAPSHOT.jar
          [INFO] [checkstyle:checkstyle

          {execution: default}

          ]
          [INFO]
          [WARNING] Unable to locate Source XRef to link to - DISABLED
          [INFO] [jar:test-jar

          {execution: default}

          ]
          [INFO] Building jar: /home/karel/work/outerthought/whirr/examples/target/whirr-examples-0.6.0-incubating-SNAPSHOT-tests.jar
          [INFO] Preparing source:jar
          [WARNING] Removing: jar from forked lifecycle, to prevent recursive invocation.
          [INFO] [enforcer:enforce

          {execution: enforce-java}

          ]
          [INFO] [source:jar

          {execution: default}

          ]
          [INFO] Building jar: /home/karel/work/outerthought/whirr/examples/target/whirr-examples-0.6.0-incubating-SNAPSHOT-sources.jar
          [INFO] [apache-rat:check

          {execution: default}

          ]
          [INFO] Exclude: **/BUILD.txt
          [INFO] Exclude: **/CHANGES.txt
          [INFO] Exclude: **/NOTICE-src.txt
          [INFO] Exclude: .git/**
          [INFO] Exclude: .gitignore
          [INFO] Exclude: */.json
          [INFO] Exclude: **/src/main/resources/version-banner.txt
          [INFO] Exclude: docs/**
          [INFO] Exclude: */.log*
          [INFO] Exclude: .idea/**
          [INFO] Exclude: src/site/resources/images/whirr-logo.ai
          [INFO] ------------------------------------------------------------------------
          [INFO] Building Whirr
          [INFO] task-segment: [assembly:assembly] (aggregator-style)
          [INFO] ------------------------------------------------------------------------
          [INFO] Preparing assembly:assembly
          [INFO] ------------------------------------------------------------------------
          [INFO] Building Whirr
          [INFO] ------------------------------------------------------------------------
          [INFO] [enforcer:enforce

          {execution: enforce-java}

          ]
          [INFO] [remote-resources:process

          {execution: default}

          ]
          [INFO] [site:attach-descriptor

          {execution: default-attach-descriptor}

          ]
          [INFO] [checkstyle:checkstyle

          {execution: default}

          ]
          [INFO] [jar:test-jar

          {execution: default}

          ]
          [WARNING] JAR will be empty - no content was marked for inclusion!
          [INFO] Preparing source:jar
          [WARNING] Removing: jar from forked lifecycle, to prevent recursive invocation.
          [INFO] [enforcer:enforce

          {execution: enforce-java}

          ]
          [INFO] [source:jar

          {execution: default}

          ]
          [INFO] [apache-rat:check

          {execution: default}

          ]
          [INFO] Exclude: **/BUILD.txt
          [INFO] Exclude: **/CHANGES.txt
          [INFO] Exclude: **/NOTICE-src.txt
          [INFO] Exclude: .git/**
          [INFO] Exclude: .gitignore
          [INFO] Exclude: */.json
          [INFO] Exclude: **/src/main/resources/version-banner.txt
          [INFO] Exclude: docs/**
          [INFO] Exclude: */.log*
          [INFO] Exclude: .idea/**
          [INFO] Exclude: src/site/resources/images/whirr-logo.ai
          [INFO] ------------------------------------------------------------------------
          [INFO] Building Apache Whirr Build Tools
          [INFO] ------------------------------------------------------------------------
          [WARNING] Removing: jar from forked lifecycle, to prevent recursive invocation.
          [INFO] [enforcer:enforce

          {execution: enforce-java}

          ]
          [INFO] [remote-resources:process

          {execution: default}

          ]
          [INFO] [resources:resources

          {execution: default-resources}

          ]
          [INFO] Using 'UTF-8' encoding to copy filtered resources.
          [INFO] Copying 1 resource
          [INFO] Copying 3 resources
          [INFO] Copying 3 resources
          [INFO] [compiler:compile

          {execution: default-compile}

          ]
          [INFO] No sources to compile
          [INFO] [resources:testResources

          {execution: default-testResources}

          ]
          [INFO] Using 'UTF-8' encoding to copy filtered resources.
          [INFO] skip non existing resourceDirectory /home/karel/work/outerthought/whirr/build-tools/src/test/resources
          [INFO] Copying 3 resources
          [INFO] Copying 3 resources
          [INFO] [compiler:testCompile

          {execution: default-testCompile}

          ]
          [INFO] No sources to compile
          [INFO] [surefire:test

          {execution: default-test}

          ]
          [INFO] Surefire report directory: /home/karel/work/outerthought/whirr/build-tools/target/surefire-reports

          -------------------------------------------------------
          T E S T S
          -------------------------------------------------------
          There are no tests to run.

          Results :

          Tests run: 0, Failures: 0, Errors: 0, Skipped: 0

          [INFO] [jar:jar

          {execution: default-jar}

          ]
          [INFO] Building jar: /home/karel/work/outerthought/whirr/build-tools/target/whirr-build-tools-0.6.0-incubating-SNAPSHOT.jar
          [INFO] [checkstyle:checkstyle

          {execution: default}

          ]
          [INFO] [jar:test-jar

          {execution: default}

          ]
          [INFO] Building jar: /home/karel/work/outerthought/whirr/build-tools/target/whirr-build-tools-0.6.0-incubating-SNAPSHOT-tests.jar
          [INFO] [apache-rat:check

          {execution: default}

          ]
          [INFO] Exclude: **/BUILD.txt
          [INFO] Exclude: **/CHANGES.txt
          [INFO] Exclude: **/NOTICE-src.txt
          [INFO] Exclude: .git/**
          [INFO] Exclude: .gitignore
          [INFO] Exclude: */.json
          [INFO] Exclude: **/src/main/resources/version-banner.txt
          [INFO] Exclude: docs/**
          [INFO] Exclude: */.log*
          [INFO] Exclude: .idea/**
          [INFO] Exclude: src/site/resources/images/whirr-logo.ai
          [INFO] ------------------------------------------------------------------------
          [INFO] Building Apache Whirr Core
          [INFO] ------------------------------------------------------------------------
          [WARNING] Removing: jar from forked lifecycle, to prevent recursive invocation.
          [INFO] [enforcer:enforce

          {execution: enforce-java}

          ]
          [INFO] [remote-resources:process

          {execution: default}

          ]
          [INFO] [resources:resources

          {execution: default-resources}

          ]
          [INFO] Using 'UTF-8' encoding to copy filtered resources.
          [INFO] Copying 9 resources
          [INFO] Copying 3 resources
          [INFO] Copying 3 resources
          [INFO] [compiler:compile

          {execution: default-compile}

          ]
          [INFO] Compiling 5 source files to /home/karel/work/outerthought/whirr/core/target/classes
          [INFO] [resources:testResources

          {execution: default-testResources}

          ]
          [INFO] Using 'UTF-8' encoding to copy filtered resources.
          [INFO] Copying 4 resources
          [INFO] Copying 3 resources
          [INFO] Copying 3 resources
          [INFO] [compiler:testCompile

          {execution: default-testCompile}

          ]
          [INFO] Nothing to compile - all classes are up to date
          [INFO] [surefire:test

          {execution: default-test}

          ]
          [INFO] Surefire report directory: /home/karel/work/outerthought/whirr/core/target/surefire-reports

          -------------------------------------------------------
          T E S T S
          -------------------------------------------------------
          Running org.apache.whirr.service.TemplateBuilderStrategyTest
          Tests run: 3, Failures: 0, Errors: 0, Skipped: 0, Time elapsed: 1.426 sec
          Running org.apache.whirr.command.AbstractClusterCommandTest
          Tests run: 1, Failures: 0, Errors: 0, Skipped: 0, Time elapsed: 0.085 sec
          Running org.apache.whirr.service.jclouds.StatementBuilderTest
          Tests run: 1, Failures: 0, Errors: 0, Skipped: 0, Time elapsed: 0.069 sec
          Running org.apache.whirr.ClusterSpecTest
          2011-08-10 16:13:17,213 WARN [org.apache.whirr.InstanceTemplate] (main) Role name 'nn' is deprecated, use 'hadoop-namenode'
          2011-08-10 16:13:17,213 WARN [org.apache.whirr.InstanceTemplate] (main) Role name 'jt' is deprecated, use 'hadoop-jobtracker'
          2011-08-10 16:13:17,214 WARN [org.apache.whirr.InstanceTemplate] (main) Role name 'tt' is deprecated, use 'hadoop-tasktracker'
          2011-08-10 16:13:17,214 WARN [org.apache.whirr.InstanceTemplate] (main) Role name 'dn' is deprecated, use 'hadoop-datanode'
          2011-08-10 16:13:17,214 WARN [org.apache.whirr.InstanceTemplate] (main) Role name 'zk' is deprecated, use 'zookeeper'
          2011-08-10 16:13:17,345 WARN [org.apache.whirr.ClusterSpec] (main) Please use provider "aws-ec2" instead of "ec2"
          2011-08-10 16:13:17,575 WARN [org.apache.whirr.ClusterSpec] (main) Please use provider "cloudservers-us" instead of "cloudservers"
          Tests run: 21, Failures: 0, Errors: 0, Skipped: 0, Time elapsed: 1.401 sec
          Running org.apache.whirr.ClusterControllerFactoryTest
          Tests run: 2, Failures: 0, Errors: 0, Skipped: 0, Time elapsed: 0.012 sec
          Running org.apache.whirr.service.jclouds.TakeLoginCredentialsFromWhirrPropertiesTest
          Tests run: 4, Failures: 0, Errors: 0, Skipped: 0, Time elapsed: 0.011 sec
          Running org.apache.whirr.util.KeyPairTest
          Tests run: 2, Failures: 0, Errors: 0, Skipped: 0, Time elapsed: 0.117 sec
          Running org.apache.whirr.ClusterTest
          Tests run: 3, Failures: 0, Errors: 0, Skipped: 0, Time elapsed: 0.013 sec
          Running org.apache.whirr.actions.BootstrapClusterActionTest
          2011-08-10 16:13:17,976 WARN [org.apache.whirr.InstanceTemplate] (main) Role name 'jt' is deprecated, use 'hadoop-jobtracker'
          2011-08-10 16:13:17,976 WARN [org.apache.whirr.InstanceTemplate] (main) Role name 'nn' is deprecated, use 'hadoop-namenode'
          2011-08-10 16:13:17,976 WARN [org.apache.whirr.InstanceTemplate] (main) Role name 'dn' is deprecated, use 'hadoop-datanode'
          2011-08-10 16:13:17,976 WARN [org.apache.whirr.InstanceTemplate] (main) Role name 'tt' is deprecated, use 'hadoop-tasktracker'
          2011-08-10 16:13:17,977 WARN [org.apache.whirr.ClusterSpec] (main) Please use provider "aws-ec2" instead of "ec2"
          2011-08-10 16:13:18,034 INFO [org.apache.whirr.actions.BootstrapClusterAction] (main) Bootstrapping cluster
          2011-08-10 16:13:18,038 INFO [org.apache.whirr.actions.BootstrapClusterAction] (main) Configuring template
          2011-08-10 16:13:18,053 INFO [org.apache.whirr.actions.BootstrapClusterAction] (main) Configuring template
          2011-08-10 16:13:18,061 INFO [org.apache.whirr.actions.BootstrapClusterActionTest] (pool-1-thread-2) [hadoop-datanode, hadoop-tasktracker] - Node successfully started: nodeId10
          2011-08-10 16:13:18,061 INFO [org.apache.whirr.actions.BootstrapClusterActionTest] (pool-1-thread-4) [hadoop-jobtracker, hadoop-namenode] - Node failing to start: nodeId20
          2011-08-10 16:13:18,062 INFO [org.apache.whirr.actions.BootstrapClusterActionTest] (pool-1-thread-2) [hadoop-datanode, hadoop-tasktracker] - Node successfully started: nodeId11
          2011-08-10 16:13:18,062 INFO [org.apache.whirr.actions.BootstrapClusterActionTest] (pool-1-thread-2) [hadoop-datanode, hadoop-tasktracker] - Node successfully started: nodeId12
          2011-08-10 16:13:18,062 INFO [org.apache.whirr.actions.BootstrapClusterActionTest] (pool-1-thread-2) [hadoop-datanode, hadoop-tasktracker] - Node failing to start: nodeId13
          2011-08-10 16:13:18,068 INFO [org.apache.whirr.actions.BootstrapClusterAction] (pool-1-thread-2) Deleting failed node node nodeId13
          2011-08-10 16:13:18,068 INFO [org.apache.whirr.actions.BootstrapClusterActionTest] (pool-1-thread-5) [hadoop-jobtracker, hadoop-namenode] - Node successfully started: nodeId30
          2011-08-10 16:13:18,068 INFO [org.apache.whirr.actions.BootstrapClusterAction] (pool-1-thread-4) Deleting failed node node nodeId20
          2011-08-10 16:13:18,069 INFO [org.apache.whirr.actions.BootstrapClusterAction] (pool-1-thread-2) Node deleted: nodeId13
          2011-08-10 16:13:18,069 INFO [org.apache.whirr.actions.BootstrapClusterAction] (pool-1-thread-4) Node deleted: nodeId20
          2011-08-10 16:13:18,179 WARN [org.apache.whirr.InstanceTemplate] (main) Role name 'jt' is deprecated, use 'hadoop-jobtracker'
          2011-08-10 16:13:18,179 WARN [org.apache.whirr.InstanceTemplate] (main) Role name 'nn' is deprecated, use 'hadoop-namenode'
          2011-08-10 16:13:18,179 WARN [org.apache.whirr.InstanceTemplate] (main) Role name 'dn' is deprecated, use 'hadoop-datanode'
          2011-08-10 16:13:18,179 WARN [org.apache.whirr.InstanceTemplate] (main) Role name 'tt' is deprecated, use 'hadoop-tasktracker'
          2011-08-10 16:13:18,179 WARN [org.apache.whirr.ClusterSpec] (main) Please use provider "aws-ec2" instead of "ec2"
          2011-08-10 16:13:18,184 INFO [org.apache.whirr.actions.BootstrapClusterAction] (main) Bootstrapping cluster
          2011-08-10 16:13:18,184 INFO [org.apache.whirr.actions.BootstrapClusterAction] (main) Configuring template
          2011-08-10 16:13:18,187 INFO [org.apache.whirr.actions.BootstrapClusterActionTest] (pool-2-thread-2) [hadoop-datanode, hadoop-tasktracker] - Node successfully started: nodeId10
          2011-08-10 16:13:18,187 INFO [org.apache.whirr.actions.BootstrapClusterAction] (main) Configuring template
          2011-08-10 16:13:18,188 INFO [org.apache.whirr.actions.BootstrapClusterActionTest] (pool-2-thread-2) [hadoop-datanode, hadoop-tasktracker] - Node failing to start: nodeId11
          2011-08-10 16:13:18,188 INFO [org.apache.whirr.actions.BootstrapClusterActionTest] (pool-2-thread-2) [hadoop-datanode, hadoop-tasktracker] - Node failing to start: nodeId12
          2011-08-10 16:13:18,188 INFO [org.apache.whirr.actions.BootstrapClusterActionTest] (pool-2-thread-2) [hadoop-datanode, hadoop-tasktracker] - Node failing to start: nodeId13
          2011-08-10 16:13:18,189 INFO [org.apache.whirr.actions.BootstrapClusterActionTest] (pool-2-thread-3) [hadoop-datanode, hadoop-tasktracker] - Node successfully started: nodeId20
          2011-08-10 16:13:18,190 INFO [org.apache.whirr.actions.BootstrapClusterActionTest] (pool-2-thread-3) [hadoop-datanode, hadoop-tasktracker] - Node failing to start: nodeId21
          2011-08-10 16:13:18,190 INFO [org.apache.whirr.actions.BootstrapClusterActionTest] (pool-2-thread-3) [hadoop-datanode, hadoop-tasktracker] - Node failing to start: nodeId22
          2011-08-10 16:13:18,190 INFO [org.apache.whirr.actions.BootstrapClusterActionTest] (pool-2-thread-4) [hadoop-jobtracker, hadoop-namenode] - Node successfully started: nodeId30
          2011-08-10 16:13:18,191 INFO [org.apache.whirr.actions.BootstrapClusterAction] (pool-2-thread-2) Deleting failed node node nodeId21
          2011-08-10 16:13:18,191 INFO [org.apache.whirr.actions.BootstrapClusterAction] (pool-2-thread-4) Deleting failed node node nodeId22
          2011-08-10 16:13:18,192 INFO [org.apache.whirr.actions.BootstrapClusterAction] (pool-2-thread-2) Node deleted: nodeId21
          2011-08-10 16:13:18,192 INFO [org.apache.whirr.actions.BootstrapClusterAction] (pool-2-thread-4) Node deleted: nodeId22
          2011-08-10 16:13:18,192 INFO [org.apache.whirr.actions.BootstrapClusterAction] (pool-2-thread-2) Deleting failed node node nodeId12
          2011-08-10 16:13:18,193 INFO [org.apache.whirr.actions.BootstrapClusterAction] (pool-2-thread-2) Node deleted: nodeId12
          2011-08-10 16:13:18,192 INFO [org.apache.whirr.actions.BootstrapClusterAction] (pool-2-thread-3) Deleting failed node node nodeId13
          2011-08-10 16:13:18,193 INFO [org.apache.whirr.actions.BootstrapClusterAction] (pool-2-thread-5) Deleting failed node node nodeId11
          2011-08-10 16:13:18,193 INFO [org.apache.whirr.actions.BootstrapClusterAction] (pool-2-thread-3) Node deleted: nodeId13
          2011-08-10 16:13:18,193 INFO [org.apache.whirr.actions.BootstrapClusterAction] (pool-2-thread-5) Node deleted: nodeId11
          Tests run: 2, Failures: 0, Errors: 0, Skipped: 0, Time elapsed: 0.272 sec
          Running org.apache.whirr.service.jclouds.RunUrlStatementTest
          Tests run: 6, Failures: 0, Errors: 0, Skipped: 0, Time elapsed: 0.49 sec

          Results :

          Tests run: 45, Failures: 0, Errors: 0, Skipped: 0

          [INFO] [jar:jar

          {execution: default-jar}

          ]
          [INFO] Building jar: /home/karel/work/outerthought/whirr/core/target/whirr-core-0.6.0-incubating-SNAPSHOT.jar
          [INFO] [checkstyle:checkstyle

          {execution: default}

          ]
          [INFO] ------------------------------------------------------------------------
          [ERROR] BUILD ERROR
          [INFO] ------------------------------------------------------------------------
          [INFO] An error has occurred in Checkstyle report generation.

          Embedded error: Failed during checkstyle execution
          Could not find resource './build-tools/src/main/resources/checkstyle.xml'.
          [INFO] ------------------------------------------------------------------------
          [INFO] Trace
          org.apache.maven.lifecycle.LifecycleExecutionException: An error has occurred in Checkstyle report generation.
          at org.apache.maven.lifecycle.DefaultLifecycleExecutor.executeGoals(DefaultLifecycleExecutor.java:719)
          at org.apache.maven.lifecycle.DefaultLifecycleExecutor.executeGoalWithLifecycle(DefaultLifecycleExecutor.java:556)
          at org.apache.maven.lifecycle.DefaultLifecycleExecutor.forkProjectLifecycle(DefaultLifecycleExecutor.java:1205)
          at org.apache.maven.lifecycle.DefaultLifecycleExecutor.forkLifecycle(DefaultLifecycleExecutor.java:1033)
          at org.apache.maven.lifecycle.DefaultLifecycleExecutor.executeGoals(DefaultLifecycleExecutor.java:643)
          at org.apache.maven.lifecycle.DefaultLifecycleExecutor.executeStandaloneGoal(DefaultLifecycleExecutor.java:569)
          at org.apache.maven.lifecycle.DefaultLifecycleExecutor.executeGoal(DefaultLifecycleExecutor.java:539)
          at org.apache.maven.lifecycle.DefaultLifecycleExecutor.executeGoalAndHandleFailures(DefaultLifecycleExecutor.java:387)
          at org.apache.maven.lifecycle.DefaultLifecycleExecutor.executeTaskSegments(DefaultLifecycleExecutor.java:284)
          at org.apache.maven.lifecycle.DefaultLifecycleExecutor.execute(DefaultLifecycleExecutor.java:180)
          at org.apache.maven.DefaultMaven.doExecute(DefaultMaven.java:328)
          at org.apache.maven.DefaultMaven.execute(DefaultMaven.java:138)
          at org.apache.maven.cli.MavenCli.main(MavenCli.java:362)
          at org.apache.maven.cli.compat.CompatibleMain.main(CompatibleMain.java:60)
          at sun.reflect.NativeMethodAccessorImpl.invoke0(Native Method)
          at sun.reflect.NativeMethodAccessorImpl.invoke(NativeMethodAccessorImpl.java:39)
          at sun.reflect.DelegatingMethodAccessorImpl.invoke(DelegatingMethodAccessorImpl.java:25)
          at java.lang.reflect.Method.invoke(Method.java:597)
          at org.codehaus.classworlds.Launcher.launchEnhanced(Launcher.java:315)
          at org.codehaus.classworlds.Launcher.launch(Launcher.java:255)
          at org.codehaus.classworlds.Launcher.mainWithExitCode(Launcher.java:430)
          at org.codehaus.classworlds.Launcher.main(Launcher.java:375)
          Caused by: org.apache.maven.plugin.MojoExecutionException: An error has occurred in Checkstyle report generation.
          at org.apache.maven.reporting.AbstractMavenReport.execute(AbstractMavenReport.java:122)
          at org.apache.maven.plugin.DefaultPluginManager.executeMojo(DefaultPluginManager.java:490)
          at org.apache.maven.lifecycle.DefaultLifecycleExecutor.executeGoals(DefaultLifecycleExecutor.java:694)
          ... 21 more
          Caused by: org.apache.maven.reporting.MavenReportException: Failed during checkstyle execution
          at org.apache.maven.plugin.checkstyle.CheckstyleReport.executeReport(CheckstyleReport.java:597)
          at org.apache.maven.reporting.AbstractMavenReport.generate(AbstractMavenReport.java:190)
          at org.apache.maven.reporting.AbstractMavenReport.execute(AbstractMavenReport.java:99)
          ... 23 more
          Caused by: org.apache.maven.plugin.checkstyle.CheckstyleExecutorException: Unable to find configuration file at location ./build-tools/src/main/resources/checkstyle.xml
          at org.apache.maven.plugin.checkstyle.DefaultCheckstyleExecutor.getConfigFile(DefaultCheckstyleExecutor.java:481)
          at org.apache.maven.plugin.checkstyle.DefaultCheckstyleExecutor.getConfiguration(DefaultCheckstyleExecutor.java:236)
          at org.apache.maven.plugin.checkstyle.DefaultCheckstyleExecutor.executeCheckstyle(DefaultCheckstyleExecutor.java:173)
          at org.apache.maven.plugin.checkstyle.CheckstyleReport.executeReport(CheckstyleReport.java:578)
          ... 25 more
          Caused by: org.codehaus.plexus.resource.loader.ResourceNotFoundException: Could not find resource './build-tools/src/main/resources/checkstyle.xml'.
          at org.codehaus.plexus.resource.DefaultResourceManager.getResource(DefaultResourceManager.java:173)
          at org.codehaus.plexus.resource.DefaultResourceManager.getResourceAsFile(DefaultResourceManager.java:91)
          at org.apache.maven.plugin.checkstyle.DefaultCheckstyleExecutor.getConfigFile(DefaultCheckstyleExecutor.java:471)
          ... 28 more
          [INFO] ------------------------------------------------------------------------
          [INFO] Total time: 1 minute 24 seconds
          [INFO] Finished at: Wed Aug 10 16:13:18 CEST 2011
          [INFO] Final Memory: 198M/356M
          [INFO] ------------------------------------------------------------------------

          Show
          Karel Vervaeke added a comment - I'm running it from the top level and I still get the error. As far as I understand checkstyle is triggered in the 'core' module, and it's looking for the checkstyle.xml under core/build-tools/... Also running with -e: (git log -1 && mvn package assembly:assembly -e) >../stdout.txt 2>&1 – stdout.txt commit 423d69d3e7a2a69343912ea6fd323721d60b4111 Author: Andrei Savu <asavu@apache.org> Date: Sun Aug 7 22:04:54 2011 +0000 WHIRR-339 . Allow to specify hbase-site.xml properties through cluster configuration file (Bruno Dumon via asavu) git-svn-id: https://svn.apache.org/repos/asf/incubator/whirr/trunk@1154780 13f79535-47bb-0310-9956-ffa450edef68 + Error stacktraces are turned on. [INFO] Scanning for projects... [INFO] Reactor build order: [INFO] Whirr [INFO] Apache Whirr Build Tools [INFO] Apache Whirr Core [INFO] Apache Whirr Voldemort [INFO] Apache Whirr Cassandra [INFO] Apache Whirr Hadoop [INFO] Apache Whirr ZooKeeper [INFO] Apache Whirr HBase [INFO] Apache Whirr CDH [INFO] Apache Whirr ElasticSearch [INFO] Apache Whirr Hama [INFO] Apache Whirr CLI [INFO] Apache Whirr Examples [INFO] ------------------------------------------------------------------------ [INFO] Building Whirr [INFO] task-segment: [package] [INFO] ------------------------------------------------------------------------ [INFO] [enforcer:enforce {execution: enforce-java} ] [INFO] Setting property: classpath.resource.loader.class => 'org.codehaus.plexus.velocity.ContextClassLoaderResourceLoader'. [INFO] Setting property: velocimacro.messages.on => 'false'. [INFO] Setting property: resource.loader => 'classpath'. [INFO] Setting property: resource.manager.logwhenfound => 'false'. [INFO] [remote-resources:process {execution: default} ] [INFO] [site:attach-descriptor {execution: default-attach-descriptor} ] [INFO] Parent project loaded from repository. [INFO] [checkstyle:checkstyle {execution: default} ] [INFO] [jar:test-jar {execution: default} ] [WARNING] JAR will be empty - no content was marked for inclusion! [INFO] Building jar: /home/karel/work/outerthought/whirr/target/whirr-0.6.0-incubating-SNAPSHOT-tests.jar [INFO] Preparing source:jar [WARNING] Removing: jar from forked lifecycle, to prevent recursive invocation. [INFO] [enforcer:enforce {execution: enforce-java} ] [INFO] [source:jar {execution: default} ] [INFO] [apache-rat:check {execution: default} ] [INFO] Exclude: **/BUILD.txt [INFO] Exclude: **/CHANGES.txt [INFO] Exclude: **/NOTICE-src.txt [INFO] Exclude: .git/** [INFO] Exclude: .gitignore [INFO] Exclude: * / .json [INFO] Exclude: **/src/main/resources/version-banner.txt [INFO] Exclude: docs/** [INFO] Exclude: * / .log* [INFO] Exclude: .idea/** [INFO] Exclude: src/site/resources/images/whirr-logo.ai [INFO] ------------------------------------------------------------------------ [INFO] Building Apache Whirr Build Tools [INFO] task-segment: [package] [INFO] ------------------------------------------------------------------------ [INFO] [enforcer:enforce {execution: enforce-java} ] [INFO] [remote-resources:process {execution: default} ] [INFO] [resources:resources {execution: default-resources} ] [INFO] Using 'UTF-8' encoding to copy filtered resources. [INFO] Copying 1 resource [INFO] Copying 3 resources [INFO] [compiler:compile {execution: default-compile} ] [INFO] No sources to compile [INFO] [resources:testResources {execution: default-testResources} ] [INFO] Using 'UTF-8' encoding to copy filtered resources. [INFO] skip non existing resourceDirectory /home/karel/work/outerthought/whirr/build-tools/src/test/resources [INFO] Copying 3 resources [INFO] [compiler:testCompile {execution: default-testCompile} ] [INFO] No sources to compile [INFO] [surefire:test {execution: default-test} ] [INFO] Surefire report directory: /home/karel/work/outerthought/whirr/build-tools/target/surefire-reports ------------------------------------------------------- T E S T S ------------------------------------------------------- There are no tests to run. Results : Tests run: 0, Failures: 0, Errors: 0, Skipped: 0 [INFO] [jar:jar {execution: default-jar} ] [INFO] Building jar: /home/karel/work/outerthought/whirr/build-tools/target/whirr-build-tools-0.6.0-incubating-SNAPSHOT.jar [INFO] [checkstyle:checkstyle {execution: default} ] [INFO] [jar:test-jar {execution: default} ] [INFO] Building jar: /home/karel/work/outerthought/whirr/build-tools/target/whirr-build-tools-0.6.0-incubating-SNAPSHOT-tests.jar [INFO] Preparing source:jar [WARNING] Removing: jar from forked lifecycle, to prevent recursive invocation. [INFO] [enforcer:enforce {execution: enforce-java} ] [INFO] [source:jar {execution: default} ] [INFO] Building jar: /home/karel/work/outerthought/whirr/build-tools/target/whirr-build-tools-0.6.0-incubating-SNAPSHOT-sources.jar [INFO] [apache-rat:check {execution: default} ] [INFO] Exclude: **/BUILD.txt [INFO] Exclude: **/CHANGES.txt [INFO] Exclude: **/NOTICE-src.txt [INFO] Exclude: .git/** [INFO] Exclude: .gitignore [INFO] Exclude: * / .json [INFO] Exclude: **/src/main/resources/version-banner.txt [INFO] Exclude: docs/** [INFO] Exclude: * / .log* [INFO] Exclude: .idea/** [INFO] Exclude: src/site/resources/images/whirr-logo.ai [INFO] ------------------------------------------------------------------------ [INFO] Building Apache Whirr Core [INFO] task-segment: [package] [INFO] ------------------------------------------------------------------------ [INFO] [enforcer:enforce {execution: enforce-java} ] [INFO] [remote-resources:process {execution: default} ] [INFO] [resources:resources {execution: default-resources} ] [INFO] Using 'UTF-8' encoding to copy filtered resources. [INFO] Copying 9 resources [INFO] Copying 3 resources [INFO] [compiler:compile {execution: default-compile} ] [INFO] Compiling 41 source files to /home/karel/work/outerthought/whirr/core/target/classes [INFO] [resources:testResources {execution: default-testResources} ] [INFO] Using 'UTF-8' encoding to copy filtered resources. [INFO] Copying 4 resources [INFO] Copying 3 resources [INFO] [compiler:testCompile {execution: default-testCompile} ] [INFO] Compiling 14 source files to /home/karel/work/outerthought/whirr/core/target/test-classes [INFO] [surefire:test {execution: default-test} ] [INFO] Surefire report directory: /home/karel/work/outerthought/whirr/core/target/surefire-reports ------------------------------------------------------- T E S T S ------------------------------------------------------- Running org.apache.whirr.service.TemplateBuilderStrategyTest Tests run: 3, Failures: 0, Errors: 0, Skipped: 0, Time elapsed: 1.272 sec Running org.apache.whirr.command.AbstractClusterCommandTest Tests run: 1, Failures: 0, Errors: 0, Skipped: 0, Time elapsed: 0.252 sec Running org.apache.whirr.service.jclouds.StatementBuilderTest Tests run: 1, Failures: 0, Errors: 0, Skipped: 0, Time elapsed: 0.074 sec Running org.apache.whirr.ClusterSpecTest 2011-08-10 16:12:13,721 WARN [org.apache.whirr.InstanceTemplate] (main) Role name 'nn' is deprecated, use 'hadoop-namenode' 2011-08-10 16:12:13,721 WARN [org.apache.whirr.InstanceTemplate] (main) Role name 'jt' is deprecated, use 'hadoop-jobtracker' 2011-08-10 16:12:13,721 WARN [org.apache.whirr.InstanceTemplate] (main) Role name 'tt' is deprecated, use 'hadoop-tasktracker' 2011-08-10 16:12:13,721 WARN [org.apache.whirr.InstanceTemplate] (main) Role name 'dn' is deprecated, use 'hadoop-datanode' 2011-08-10 16:12:13,722 WARN [org.apache.whirr.InstanceTemplate] (main) Role name 'zk' is deprecated, use 'zookeeper' 2011-08-10 16:12:13,864 WARN [org.apache.whirr.ClusterSpec] (main) Please use provider "aws-ec2" instead of "ec2" 2011-08-10 16:12:14,085 WARN [org.apache.whirr.ClusterSpec] (main) Please use provider "cloudservers-us" instead of "cloudservers" Tests run: 21, Failures: 0, Errors: 0, Skipped: 0, Time elapsed: 1.262 sec Running org.apache.whirr.ClusterControllerFactoryTest Tests run: 2, Failures: 0, Errors: 0, Skipped: 0, Time elapsed: 0.011 sec Running org.apache.whirr.service.jclouds.TakeLoginCredentialsFromWhirrPropertiesTest Tests run: 4, Failures: 0, Errors: 0, Skipped: 0, Time elapsed: 0.012 sec Running org.apache.whirr.util.KeyPairTest Tests run: 2, Failures: 0, Errors: 0, Skipped: 0, Time elapsed: 0.301 sec Running org.apache.whirr.ClusterTest Tests run: 3, Failures: 0, Errors: 0, Skipped: 0, Time elapsed: 0.014 sec Running org.apache.whirr.actions.BootstrapClusterActionTest 2011-08-10 16:12:14,851 WARN [org.apache.whirr.InstanceTemplate] (main) Role name 'jt' is deprecated, use 'hadoop-jobtracker' 2011-08-10 16:12:14,851 WARN [org.apache.whirr.InstanceTemplate] (main) Role name 'nn' is deprecated, use 'hadoop-namenode' 2011-08-10 16:12:14,851 WARN [org.apache.whirr.InstanceTemplate] (main) Role name 'dn' is deprecated, use 'hadoop-datanode' 2011-08-10 16:12:14,851 WARN [org.apache.whirr.InstanceTemplate] (main) Role name 'tt' is deprecated, use 'hadoop-tasktracker' 2011-08-10 16:12:14,851 WARN [org.apache.whirr.ClusterSpec] (main) Please use provider "aws-ec2" instead of "ec2" 2011-08-10 16:12:14,907 INFO [org.apache.whirr.actions.BootstrapClusterAction] (main) Bootstrapping cluster 2011-08-10 16:12:14,912 INFO [org.apache.whirr.actions.BootstrapClusterAction] (main) Configuring template 2011-08-10 16:12:14,926 INFO [org.apache.whirr.actions.BootstrapClusterAction] (main) Configuring template 2011-08-10 16:12:14,932 INFO [org.apache.whirr.actions.BootstrapClusterActionTest] (pool-1-thread-2) [hadoop-datanode, hadoop-tasktracker] - Node successfully started: nodeId10 2011-08-10 16:12:14,932 INFO [org.apache.whirr.actions.BootstrapClusterActionTest] (pool-1-thread-4) [hadoop-jobtracker, hadoop-namenode] - Node failing to start: nodeId20 2011-08-10 16:12:14,932 INFO [org.apache.whirr.actions.BootstrapClusterActionTest] (pool-1-thread-2) [hadoop-datanode, hadoop-tasktracker] - Node successfully started: nodeId11 2011-08-10 16:12:14,933 INFO [org.apache.whirr.actions.BootstrapClusterActionTest] (pool-1-thread-2) [hadoop-datanode, hadoop-tasktracker] - Node successfully started: nodeId12 2011-08-10 16:12:14,933 INFO [org.apache.whirr.actions.BootstrapClusterActionTest] (pool-1-thread-2) [hadoop-datanode, hadoop-tasktracker] - Node failing to start: nodeId13 2011-08-10 16:12:14,938 INFO [org.apache.whirr.actions.BootstrapClusterActionTest] (pool-1-thread-5) [hadoop-jobtracker, hadoop-namenode] - Node successfully started: nodeId30 2011-08-10 16:12:14,939 INFO [org.apache.whirr.actions.BootstrapClusterAction] (pool-1-thread-4) Deleting failed node node nodeId13 2011-08-10 16:12:14,939 INFO [org.apache.whirr.actions.BootstrapClusterAction] (pool-1-thread-4) Node deleted: nodeId13 2011-08-10 16:12:14,940 INFO [org.apache.whirr.actions.BootstrapClusterAction] (pool-1-thread-2) Deleting failed node node nodeId20 2011-08-10 16:12:14,940 INFO [org.apache.whirr.actions.BootstrapClusterAction] (pool-1-thread-2) Node deleted: nodeId20 2011-08-10 16:12:15,053 WARN [org.apache.whirr.InstanceTemplate] (main) Role name 'jt' is deprecated, use 'hadoop-jobtracker' 2011-08-10 16:12:15,054 WARN [org.apache.whirr.InstanceTemplate] (main) Role name 'nn' is deprecated, use 'hadoop-namenode' 2011-08-10 16:12:15,054 WARN [org.apache.whirr.InstanceTemplate] (main) Role name 'dn' is deprecated, use 'hadoop-datanode' 2011-08-10 16:12:15,054 WARN [org.apache.whirr.InstanceTemplate] (main) Role name 'tt' is deprecated, use 'hadoop-tasktracker' 2011-08-10 16:12:15,054 WARN [org.apache.whirr.ClusterSpec] (main) Please use provider "aws-ec2" instead of "ec2" 2011-08-10 16:12:15,059 INFO [org.apache.whirr.actions.BootstrapClusterAction] (main) Bootstrapping cluster 2011-08-10 16:12:15,059 INFO [org.apache.whirr.actions.BootstrapClusterAction] (main) Configuring template 2011-08-10 16:12:15,062 INFO [org.apache.whirr.actions.BootstrapClusterActionTest] (pool-2-thread-2) [hadoop-datanode, hadoop-tasktracker] - Node successfully started: nodeId10 2011-08-10 16:12:15,062 INFO [org.apache.whirr.actions.BootstrapClusterAction] (main) Configuring template 2011-08-10 16:12:15,062 INFO [org.apache.whirr.actions.BootstrapClusterActionTest] (pool-2-thread-2) [hadoop-datanode, hadoop-tasktracker] - Node failing to start: nodeId11 2011-08-10 16:12:15,062 INFO [org.apache.whirr.actions.BootstrapClusterActionTest] (pool-2-thread-2) [hadoop-datanode, hadoop-tasktracker] - Node failing to start: nodeId12 2011-08-10 16:12:15,063 INFO [org.apache.whirr.actions.BootstrapClusterActionTest] (pool-2-thread-2) [hadoop-datanode, hadoop-tasktracker] - Node failing to start: nodeId13 2011-08-10 16:12:15,064 INFO [org.apache.whirr.actions.BootstrapClusterActionTest] (pool-2-thread-3) [hadoop-datanode, hadoop-tasktracker] - Node successfully started: nodeId20 2011-08-10 16:12:15,064 INFO [org.apache.whirr.actions.BootstrapClusterActionTest] (pool-2-thread-3) [hadoop-datanode, hadoop-tasktracker] - Node failing to start: nodeId21 2011-08-10 16:12:15,064 INFO [org.apache.whirr.actions.BootstrapClusterActionTest] (pool-2-thread-3) [hadoop-datanode, hadoop-tasktracker] - Node failing to start: nodeId22 2011-08-10 16:12:15,066 INFO [org.apache.whirr.actions.BootstrapClusterAction] (pool-2-thread-3) Deleting failed node node nodeId13 2011-08-10 16:12:15,068 INFO [org.apache.whirr.actions.BootstrapClusterAction] (pool-2-thread-3) Node deleted: nodeId13 2011-08-10 16:12:15,068 INFO [org.apache.whirr.actions.BootstrapClusterAction] (pool-2-thread-3) Deleting failed node node nodeId22 2011-08-10 16:12:15,068 INFO [org.apache.whirr.actions.BootstrapClusterAction] (pool-2-thread-5) Deleting failed node node nodeId21 2011-08-10 16:12:15,068 INFO [org.apache.whirr.actions.BootstrapClusterActionTest] (pool-2-thread-4) [hadoop-jobtracker, hadoop-namenode] - Node successfully started: nodeId30 2011-08-10 16:12:15,068 INFO [org.apache.whirr.actions.BootstrapClusterAction] (pool-2-thread-3) Node deleted: nodeId22 2011-08-10 16:12:15,069 INFO [org.apache.whirr.actions.BootstrapClusterAction] (pool-2-thread-6) Deleting failed node node nodeId12 2011-08-10 16:12:15,069 INFO [org.apache.whirr.actions.BootstrapClusterAction] (pool-2-thread-5) Node deleted: nodeId21 2011-08-10 16:12:15,069 INFO [org.apache.whirr.actions.BootstrapClusterAction] (pool-2-thread-7) Deleting failed node node nodeId11 2011-08-10 16:12:15,070 INFO [org.apache.whirr.actions.BootstrapClusterAction] (pool-2-thread-6) Node deleted: nodeId12 2011-08-10 16:12:15,070 INFO [org.apache.whirr.actions.BootstrapClusterAction] (pool-2-thread-7) Node deleted: nodeId11 Tests run: 2, Failures: 0, Errors: 0, Skipped: 0, Time elapsed: 0.302 sec Running org.apache.whirr.service.jclouds.RunUrlStatementTest Tests run: 6, Failures: 0, Errors: 0, Skipped: 0, Time elapsed: 0.431 sec Results : Tests run: 45, Failures: 0, Errors: 0, Skipped: 0 [INFO] [jar:jar {execution: default-jar} ] [INFO] Building jar: /home/karel/work/outerthought/whirr/core/target/whirr-core-0.6.0-incubating-SNAPSHOT.jar [INFO] [checkstyle:checkstyle {execution: default} ] [INFO] [WARNING] Unable to locate Source XRef to link to - DISABLED [INFO] [jar:test-jar {execution: default} ] [INFO] Building jar: /home/karel/work/outerthought/whirr/core/target/whirr-core-0.6.0-incubating-SNAPSHOT-tests.jar [INFO] Preparing source:jar [WARNING] Removing: jar from forked lifecycle, to prevent recursive invocation. [INFO] [enforcer:enforce {execution: enforce-java} ] [INFO] [source:jar {execution: default} ] [INFO] Building jar: /home/karel/work/outerthought/whirr/core/target/whirr-core-0.6.0-incubating-SNAPSHOT-sources.jar [INFO] [apache-rat:check {execution: default} ] [INFO] Exclude: **/BUILD.txt [INFO] Exclude: **/CHANGES.txt [INFO] Exclude: **/NOTICE-src.txt [INFO] Exclude: .git/** [INFO] Exclude: .gitignore [INFO] Exclude: * / .json [INFO] Exclude: **/src/main/resources/version-banner.txt [INFO] Exclude: docs/** [INFO] Exclude: * / .log* [INFO] Exclude: .idea/** [INFO] Exclude: src/site/resources/images/whirr-logo.ai [INFO] ------------------------------------------------------------------------ [INFO] Building Apache Whirr Voldemort [INFO] task-segment: [package] [INFO] ------------------------------------------------------------------------ [INFO] [enforcer:enforce {execution: enforce-java} ] [INFO] [remote-resources:process {execution: default} ] [INFO] [resources:resources {execution: default-resources} ] [INFO] Using 'UTF-8' encoding to copy filtered resources. [INFO] Copying 6 resources [INFO] Copying 3 resources [INFO] [compiler:compile {execution: default-compile} ] [INFO] Compiling 2 source files to /home/karel/work/outerthought/whirr/services/voldemort/target/classes [INFO] [resources:testResources {execution: default-testResources} ] [INFO] Using 'UTF-8' encoding to copy filtered resources. [INFO] Copying 2 resources [INFO] Copying 3 resources [INFO] [compiler:testCompile {execution: default-testCompile} ] [INFO] Compiling 1 source file to /home/karel/work/outerthought/whirr/services/voldemort/target/test-classes [INFO] [surefire:test {execution: default-test} ] [INFO] Surefire report directory: /home/karel/work/outerthought/whirr/services/voldemort/target/surefire-reports ------------------------------------------------------- T E S T S ------------------------------------------------------- There are no tests to run. Results : Tests run: 0, Failures: 0, Errors: 0, Skipped: 0 [INFO] [jar:jar {execution: default-jar} ] [INFO] Building jar: /home/karel/work/outerthought/whirr/services/voldemort/target/whirr-voldemort-0.6.0-incubating-SNAPSHOT.jar [INFO] [checkstyle:checkstyle {execution: default} ] [INFO] [WARNING] Unable to locate Source XRef to link to - DISABLED [INFO] [jar:test-jar {execution: default} ] [INFO] Building jar: /home/karel/work/outerthought/whirr/services/voldemort/target/whirr-voldemort-0.6.0-incubating-SNAPSHOT-tests.jar [INFO] Preparing source:jar [WARNING] Removing: jar from forked lifecycle, to prevent recursive invocation. [INFO] [enforcer:enforce {execution: enforce-java} ] [INFO] [source:jar {execution: default} ] [INFO] Building jar: /home/karel/work/outerthought/whirr/services/voldemort/target/whirr-voldemort-0.6.0-incubating-SNAPSHOT-sources.jar [INFO] [apache-rat:check {execution: default} ] [INFO] Exclude: **/BUILD.txt [INFO] Exclude: **/CHANGES.txt [INFO] Exclude: **/NOTICE-src.txt [INFO] Exclude: .git/** [INFO] Exclude: .gitignore [INFO] Exclude: * / .json [INFO] Exclude: **/src/main/resources/version-banner.txt [INFO] Exclude: docs/** [INFO] Exclude: * / .log* [INFO] Exclude: .idea/** [INFO] Exclude: src/site/resources/images/whirr-logo.ai [INFO] ------------------------------------------------------------------------ [INFO] Building Apache Whirr Cassandra [INFO] task-segment: [package] [INFO] ------------------------------------------------------------------------ [INFO] [enforcer:enforce {execution: enforce-java} ] [INFO] [remote-resources:process {execution: default} ] [INFO] [resources:resources {execution: default-resources} ] [INFO] Using 'UTF-8' encoding to copy filtered resources. [INFO] Copying 6 resources [INFO] Copying 3 resources [INFO] [compiler:compile {execution: default-compile} ] [INFO] Compiling 1 source file to /home/karel/work/outerthought/whirr/services/cassandra/target/classes [INFO] [resources:testResources {execution: default-testResources} ] [INFO] Using 'UTF-8' encoding to copy filtered resources. [INFO] Copying 2 resources [INFO] Copying 3 resources [INFO] [compiler:testCompile {execution: default-testCompile} ] [INFO] Compiling 2 source files to /home/karel/work/outerthought/whirr/services/cassandra/target/test-classes [INFO] [surefire:test {execution: default-test} ] [INFO] Surefire report directory: /home/karel/work/outerthought/whirr/services/cassandra/target/surefire-reports ------------------------------------------------------- T E S T S ------------------------------------------------------- Running org.apache.whirr.service.cassandra.CassandraClusterActionHandlerTest Tests run: 1, Failures: 0, Errors: 0, Skipped: 0, Time elapsed: 0.23 sec Results : Tests run: 1, Failures: 0, Errors: 0, Skipped: 0 [INFO] [jar:jar {execution: default-jar} ] [INFO] Building jar: /home/karel/work/outerthought/whirr/services/cassandra/target/whirr-cassandra-0.6.0-incubating-SNAPSHOT.jar [INFO] [checkstyle:checkstyle {execution: default} ] [INFO] [WARNING] Unable to locate Source XRef to link to - DISABLED [INFO] [jar:test-jar {execution: default} ] [INFO] Building jar: /home/karel/work/outerthought/whirr/services/cassandra/target/whirr-cassandra-0.6.0-incubating-SNAPSHOT-tests.jar [INFO] Preparing source:jar [WARNING] Removing: jar from forked lifecycle, to prevent recursive invocation. [INFO] [enforcer:enforce {execution: enforce-java} ] [INFO] [source:jar {execution: default} ] [INFO] Building jar: /home/karel/work/outerthought/whirr/services/cassandra/target/whirr-cassandra-0.6.0-incubating-SNAPSHOT-sources.jar [INFO] [apache-rat:check {execution: default} ] [INFO] Exclude: **/BUILD.txt [INFO] Exclude: **/CHANGES.txt [INFO] Exclude: **/NOTICE-src.txt [INFO] Exclude: .git/** [INFO] Exclude: .gitignore [INFO] Exclude: * / .json [INFO] Exclude: **/src/main/resources/version-banner.txt [INFO] Exclude: docs/** [INFO] Exclude: * / .log* [INFO] Exclude: .idea/** [INFO] Exclude: src/site/resources/images/whirr-logo.ai [INFO] ------------------------------------------------------------------------ [INFO] Building Apache Whirr Hadoop [INFO] task-segment: [package] [INFO] ------------------------------------------------------------------------ [INFO] [enforcer:enforce {execution: enforce-java} ] [INFO] [remote-resources:process {execution: default} ] [INFO] [resources:resources {execution: default-resources} ] [INFO] Using 'UTF-8' encoding to copy filtered resources. [INFO] Copying 4 resources [INFO] Copying 3 resources [INFO] [compiler:compile {execution: default-compile} ] [INFO] Compiling 9 source files to /home/karel/work/outerthought/whirr/services/hadoop/target/classes [INFO] [resources:testResources {execution: default-testResources} ] [INFO] Using 'UTF-8' encoding to copy filtered resources. [INFO] Copying 2 resources [INFO] Copying 3 resources [INFO] [compiler:testCompile {execution: default-testCompile} ] [INFO] Compiling 7 source files to /home/karel/work/outerthought/whirr/services/hadoop/target/test-classes [INFO] [surefire:test {execution: default-test} ] [INFO] Surefire report directory: /home/karel/work/outerthought/whirr/services/hadoop/target/surefire-reports ------------------------------------------------------- T E S T S ------------------------------------------------------- Running org.apache.whirr.service.hadoop.HadoopConfigurationConverterTest Tests run: 2, Failures: 0, Errors: 0, Skipped: 0, Time elapsed: 0.29 sec Running org.apache.whirr.service.hadoop.HadoopConfigurationBuilderTest Tests run: 5, Failures: 0, Errors: 0, Skipped: 0, Time elapsed: 21.575 sec Results : Tests run: 7, Failures: 0, Errors: 0, Skipped: 0 [INFO] [jar:jar {execution: default-jar} ] [INFO] Building jar: /home/karel/work/outerthought/whirr/services/hadoop/target/whirr-hadoop-0.6.0-incubating-SNAPSHOT.jar [INFO] [checkstyle:checkstyle {execution: default} ] [INFO] [WARNING] Unable to locate Source XRef to link to - DISABLED [INFO] [jar:test-jar {execution: default} ] [INFO] Building jar: /home/karel/work/outerthought/whirr/services/hadoop/target/whirr-hadoop-0.6.0-incubating-SNAPSHOT-tests.jar [INFO] Preparing source:jar [WARNING] Removing: jar from forked lifecycle, to prevent recursive invocation. [INFO] [enforcer:enforce {execution: enforce-java} ] [INFO] [source:jar {execution: default} ] [INFO] Building jar: /home/karel/work/outerthought/whirr/services/hadoop/target/whirr-hadoop-0.6.0-incubating-SNAPSHOT-sources.jar [INFO] [apache-rat:check {execution: default} ] [INFO] Exclude: **/BUILD.txt [INFO] Exclude: **/CHANGES.txt [INFO] Exclude: **/NOTICE-src.txt [INFO] Exclude: .git/** [INFO] Exclude: .gitignore [INFO] Exclude: * / .json [INFO] Exclude: **/src/main/resources/version-banner.txt [INFO] Exclude: docs/** [INFO] Exclude: * / .log* [INFO] Exclude: .idea/** [INFO] Exclude: src/site/resources/images/whirr-logo.ai [INFO] ------------------------------------------------------------------------ [INFO] Building Apache Whirr ZooKeeper [INFO] task-segment: [package] [INFO] ------------------------------------------------------------------------ [INFO] [enforcer:enforce {execution: enforce-java} ] [INFO] [remote-resources:process {execution: default} ] [INFO] [resources:resources {execution: default-resources} ] [INFO] Using 'UTF-8' encoding to copy filtered resources. [INFO] Copying 7 resources [INFO] Copying 3 resources [INFO] [compiler:compile {execution: default-compile} ] [INFO] Compiling 2 source files to /home/karel/work/outerthought/whirr/services/zookeeper/target/classes [INFO] [resources:testResources {execution: default-testResources} ] [INFO] Using 'UTF-8' encoding to copy filtered resources. [INFO] Copying 2 resources [INFO] Copying 3 resources [INFO] [compiler:testCompile {execution: default-testCompile} ] [INFO] Compiling 1 source file to /home/karel/work/outerthought/whirr/services/zookeeper/target/test-classes [INFO] [surefire:test {execution: default-test} ] [INFO] Surefire report directory: /home/karel/work/outerthought/whirr/services/zookeeper/target/surefire-reports ------------------------------------------------------- T E S T S ------------------------------------------------------- There are no tests to run. Results : Tests run: 0, Failures: 0, Errors: 0, Skipped: 0 [INFO] [jar:jar {execution: default-jar} ] [INFO] Building jar: /home/karel/work/outerthought/whirr/services/zookeeper/target/whirr-zookeeper-0.6.0-incubating-SNAPSHOT.jar [INFO] [checkstyle:checkstyle {execution: default} ] [INFO] [WARNING] Unable to locate Source XRef to link to - DISABLED [INFO] [jar:test-jar {execution: default} ] [INFO] Building jar: /home/karel/work/outerthought/whirr/services/zookeeper/target/whirr-zookeeper-0.6.0-incubating-SNAPSHOT-tests.jar [INFO] Preparing source:jar [WARNING] Removing: jar from forked lifecycle, to prevent recursive invocation. [INFO] [enforcer:enforce {execution: enforce-java} ] [INFO] [source:jar {execution: default} ] [INFO] Building jar: /home/karel/work/outerthought/whirr/services/zookeeper/target/whirr-zookeeper-0.6.0-incubating-SNAPSHOT-sources.jar [INFO] [apache-rat:check {execution: default} ] [INFO] Exclude: **/BUILD.txt [INFO] Exclude: **/CHANGES.txt [INFO] Exclude: **/NOTICE-src.txt [INFO] Exclude: .git/** [INFO] Exclude: .gitignore [INFO] Exclude: * / .json [INFO] Exclude: **/src/main/resources/version-banner.txt [INFO] Exclude: docs/** [INFO] Exclude: * / .log* [INFO] Exclude: .idea/** [INFO] Exclude: src/site/resources/images/whirr-logo.ai [INFO] ------------------------------------------------------------------------ [INFO] Building Apache Whirr HBase [INFO] task-segment: [package] [INFO] ------------------------------------------------------------------------ [INFO] [enforcer:enforce {execution: enforce-java} ] [INFO] [remote-resources:process {execution: default} ] [INFO] [resources:resources {execution: default-resources} ] [INFO] Using 'UTF-8' encoding to copy filtered resources. [INFO] Copying 4 resources [INFO] Copying 3 resources [INFO] [compiler:compile {execution: default-compile} ] [INFO] Compiling 10 source files to /home/karel/work/outerthought/whirr/services/hbase/target/classes [INFO] [resources:testResources {execution: default-testResources} ] [INFO] Using 'UTF-8' encoding to copy filtered resources. [INFO] Copying 3 resources [INFO] Copying 3 resources [INFO] [compiler:testCompile {execution: default-testCompile} ] [INFO] Compiling 4 source files to /home/karel/work/outerthought/whirr/services/hbase/target/test-classes [INFO] [surefire:test {execution: default-test} ] [INFO] Surefire report directory: /home/karel/work/outerthought/whirr/services/hbase/target/surefire-reports ------------------------------------------------------- T E S T S ------------------------------------------------------- There are no tests to run. Results : Tests run: 0, Failures: 0, Errors: 0, Skipped: 0 [INFO] [jar:jar {execution: default-jar} ] [INFO] Building jar: /home/karel/work/outerthought/whirr/services/hbase/target/whirr-hbase-0.6.0-incubating-SNAPSHOT.jar [INFO] [checkstyle:checkstyle {execution: default} ] [INFO] [WARNING] Unable to locate Source XRef to link to - DISABLED [INFO] [jar:test-jar {execution: default} ] [INFO] Building jar: /home/karel/work/outerthought/whirr/services/hbase/target/whirr-hbase-0.6.0-incubating-SNAPSHOT-tests.jar [INFO] Preparing source:jar [WARNING] Removing: jar from forked lifecycle, to prevent recursive invocation. [INFO] [enforcer:enforce {execution: enforce-java} ] [INFO] [source:jar {execution: default} ] [INFO] Building jar: /home/karel/work/outerthought/whirr/services/hbase/target/whirr-hbase-0.6.0-incubating-SNAPSHOT-sources.jar [INFO] [apache-rat:check {execution: default} ] [INFO] Exclude: **/BUILD.txt [INFO] Exclude: **/CHANGES.txt [INFO] Exclude: **/NOTICE-src.txt [INFO] Exclude: .git/** [INFO] Exclude: .gitignore [INFO] Exclude: * / .json [INFO] Exclude: **/src/main/resources/version-banner.txt [INFO] Exclude: docs/** [INFO] Exclude: * / .log* [INFO] Exclude: .idea/** [INFO] Exclude: src/site/resources/images/whirr-logo.ai [INFO] ------------------------------------------------------------------------ [INFO] Building Apache Whirr CDH [INFO] task-segment: [package] [INFO] ------------------------------------------------------------------------ [INFO] [enforcer:enforce {execution: enforce-java} ] [INFO] [remote-resources:process {execution: default} ] [INFO] [resources:resources {execution: default-resources} ] [INFO] Using 'UTF-8' encoding to copy filtered resources. [INFO] Copying 6 resources [INFO] Copying 3 resources [INFO] [compiler:compile {execution: default-compile} ] [INFO] No sources to compile [INFO] [resources:testResources {execution: default-testResources} ] [INFO] Using 'UTF-8' encoding to copy filtered resources. [INFO] Copying 4 resources [INFO] Copying 3 resources [INFO] [compiler:testCompile {execution: default-testCompile} ] [INFO] Compiling 3 source files to /home/karel/work/outerthought/whirr/services/cdh/target/test-classes [INFO] [surefire:test {execution: default-test} ] [INFO] Surefire report directory: /home/karel/work/outerthought/whirr/services/cdh/target/surefire-reports ------------------------------------------------------- T E S T S ------------------------------------------------------- There are no tests to run. Results : Tests run: 0, Failures: 0, Errors: 0, Skipped: 0 [INFO] [jar:jar {execution: default-jar} ] [INFO] Building jar: /home/karel/work/outerthought/whirr/services/cdh/target/whirr-cdh-0.6.0-incubating-SNAPSHOT.jar [INFO] [checkstyle:checkstyle {execution: default} ] [INFO] [jar:test-jar {execution: default} ] [INFO] Building jar: /home/karel/work/outerthought/whirr/services/cdh/target/whirr-cdh-0.6.0-incubating-SNAPSHOT-tests.jar [INFO] Preparing source:jar [WARNING] Removing: jar from forked lifecycle, to prevent recursive invocation. [INFO] [enforcer:enforce {execution: enforce-java} ] [INFO] [source:jar {execution: default} ] [INFO] Building jar: /home/karel/work/outerthought/whirr/services/cdh/target/whirr-cdh-0.6.0-incubating-SNAPSHOT-sources.jar [INFO] [apache-rat:check {execution: default} ] [INFO] Exclude: **/BUILD.txt [INFO] Exclude: **/CHANGES.txt [INFO] Exclude: **/NOTICE-src.txt [INFO] Exclude: .git/** [INFO] Exclude: .gitignore [INFO] Exclude: * / .json [INFO] Exclude: **/src/main/resources/version-banner.txt [INFO] Exclude: docs/** [INFO] Exclude: * / .log* [INFO] Exclude: .idea/** [INFO] Exclude: src/site/resources/images/whirr-logo.ai [INFO] ------------------------------------------------------------------------ [INFO] Building Apache Whirr ElasticSearch [INFO] task-segment: [package] [INFO] ------------------------------------------------------------------------ [INFO] [enforcer:enforce {execution: enforce-java} ] [INFO] [remote-resources:process {execution: default} ] [INFO] [resources:resources {execution: default-resources} ] [INFO] Using 'UTF-8' encoding to copy filtered resources. [INFO] Copying 7 resources [INFO] Copying 3 resources [INFO] [compiler:compile {execution: default-compile} ] [INFO] Compiling 2 source files to /home/karel/work/outerthought/whirr/services/elasticsearch/target/classes [INFO] [resources:testResources {execution: default-testResources} ] [INFO] Using 'UTF-8' encoding to copy filtered resources. [INFO] Copying 1 resource [INFO] Copying 3 resources [INFO] [compiler:testCompile {execution: default-testCompile} ] [INFO] Compiling 2 source files to /home/karel/work/outerthought/whirr/services/elasticsearch/target/test-classes [INFO] [surefire:test {execution: default-test} ] [INFO] Surefire report directory: /home/karel/work/outerthought/whirr/services/elasticsearch/target/surefire-reports ------------------------------------------------------- T E S T S ------------------------------------------------------- Running org.apache.whirr.service.elasticsearch.ElasticSearchConfigurationBuilderTest Tests run: 4, Failures: 0, Errors: 0, Skipped: 0, Time elapsed: 1.472 sec Results : Tests run: 4, Failures: 0, Errors: 0, Skipped: 0 [INFO] [jar:jar {execution: default-jar} ] [INFO] Building jar: /home/karel/work/outerthought/whirr/services/elasticsearch/target/whirr-elasticsearch-0.6.0-incubating-SNAPSHOT.jar [INFO] [checkstyle:checkstyle {execution: default} ] [INFO] [WARNING] Unable to locate Source XRef to link to - DISABLED [INFO] [jar:test-jar {execution: default} ] [INFO] Building jar: /home/karel/work/outerthought/whirr/services/elasticsearch/target/whirr-elasticsearch-0.6.0-incubating-SNAPSHOT-tests.jar [INFO] Preparing source:jar [WARNING] Removing: jar from forked lifecycle, to prevent recursive invocation. [INFO] [enforcer:enforce {execution: enforce-java} ] [INFO] [source:jar {execution: default} ] [INFO] Building jar: /home/karel/work/outerthought/whirr/services/elasticsearch/target/whirr-elasticsearch-0.6.0-incubating-SNAPSHOT-sources.jar [INFO] [apache-rat:check {execution: default} ] [INFO] Exclude: **/BUILD.txt [INFO] Exclude: **/CHANGES.txt [INFO] Exclude: **/NOTICE-src.txt [INFO] Exclude: .git/** [INFO] Exclude: .gitignore [INFO] Exclude: * / .json [INFO] Exclude: **/src/main/resources/version-banner.txt [INFO] Exclude: docs/** [INFO] Exclude: * / .log* [INFO] Exclude: .idea/** [INFO] Exclude: src/site/resources/images/whirr-logo.ai [INFO] ------------------------------------------------------------------------ [INFO] Building Apache Whirr Hama [INFO] task-segment: [package] [INFO] ------------------------------------------------------------------------ [INFO] [enforcer:enforce {execution: enforce-java} ] [INFO] [remote-resources:process {execution: default} ] [INFO] [resources:resources {execution: default-resources} ] [INFO] Using 'UTF-8' encoding to copy filtered resources. [INFO] Copying 5 resources [INFO] Copying 3 resources [INFO] [compiler:compile {execution: default-compile} ] [INFO] Compiling 5 source files to /home/karel/work/outerthought/whirr/services/hama/target/classes [INFO] [resources:testResources {execution: default-testResources} ] [INFO] Using 'UTF-8' encoding to copy filtered resources. [INFO] Copying 1 resource [INFO] Copying 3 resources [INFO] [compiler:testCompile {execution: default-testCompile} ] [INFO] Compiling 2 source files to /home/karel/work/outerthought/whirr/services/hama/target/test-classes [INFO] [surefire:test {execution: default-test} ] [INFO] Surefire report directory: /home/karel/work/outerthought/whirr/services/hama/target/surefire-reports ------------------------------------------------------- T E S T S ------------------------------------------------------- There are no tests to run. Results : Tests run: 0, Failures: 0, Errors: 0, Skipped: 0 [INFO] [jar:jar {execution: default-jar} ] [INFO] Building jar: /home/karel/work/outerthought/whirr/services/hama/target/whirr-hama-0.6.0-incubating-SNAPSHOT.jar [INFO] [checkstyle:checkstyle {execution: default} ] [INFO] [WARNING] Unable to locate Source XRef to link to - DISABLED [INFO] [jar:test-jar {execution: default} ] [INFO] Building jar: /home/karel/work/outerthought/whirr/services/hama/target/whirr-hama-0.6.0-incubating-SNAPSHOT-tests.jar [INFO] Preparing source:jar [WARNING] Removing: jar from forked lifecycle, to prevent recursive invocation. [INFO] [enforcer:enforce {execution: enforce-java} ] [INFO] [source:jar {execution: default} ] [INFO] Building jar: /home/karel/work/outerthought/whirr/services/hama/target/whirr-hama-0.6.0-incubating-SNAPSHOT-sources.jar [INFO] [apache-rat:check {execution: default} ] [INFO] Exclude: **/BUILD.txt [INFO] Exclude: **/CHANGES.txt [INFO] Exclude: **/NOTICE-src.txt [INFO] Exclude: .git/** [INFO] Exclude: .gitignore [INFO] Exclude: * / .json [INFO] Exclude: **/src/main/resources/version-banner.txt [INFO] Exclude: docs/** [INFO] Exclude: * / .log* [INFO] Exclude: .idea/** [INFO] Exclude: src/site/resources/images/whirr-logo.ai [INFO] ------------------------------------------------------------------------ [INFO] Building Apache Whirr CLI [INFO] task-segment: [package] [INFO] ------------------------------------------------------------------------ [INFO] [enforcer:enforce {execution: enforce-java} ] [INFO] [remote-resources:process {execution: default} ] [INFO] [resources:resources {execution: default-resources} ] [INFO] Using 'UTF-8' encoding to copy filtered resources. [INFO] Copying 4 resources [INFO] Copying 3 resources [INFO] [compiler:compile {execution: default-compile} ] [INFO] Compiling 8 source files to /home/karel/work/outerthought/whirr/cli/target/classes [INFO] [resources:testResources {execution: default-testResources} ] [INFO] Using 'UTF-8' encoding to copy filtered resources. [INFO] skip non existing resourceDirectory /home/karel/work/outerthought/whirr/cli/src/test/resources [INFO] Copying 3 resources [INFO] [compiler:testCompile {execution: default-testCompile} ] [INFO] Compiling 8 source files to /home/karel/work/outerthought/whirr/cli/target/test-classes [INFO] [surefire:test {execution: default-test} ] [INFO] Surefire report directory: /home/karel/work/outerthought/whirr/cli/target/surefire-reports ------------------------------------------------------- T E S T S ------------------------------------------------------- Running org.apache.whirr.cli.command.ListClusterCommandTest Tests run: 2, Failures: 0, Errors: 0, Skipped: 0, Time elapsed: 1.229 sec Running org.apache.whirr.cli.command.RunScriptCommandTest Tests run: 3, Failures: 0, Errors: 0, Skipped: 0, Time elapsed: 0.352 sec Running org.apache.whirr.cli.command.DestroyInstanceCommandTest Tests run: 2, Failures: 0, Errors: 0, Skipped: 0, Time elapsed: 0.176 sec Running org.apache.whirr.cli.command.LaunchClusterCommandTest Role name 'jt' is deprecated, use 'hadoop-jobtracker' Role name 'nn' is deprecated, use 'hadoop-namenode' Role name 'dn' is deprecated, use 'hadoop-datanode' Role name 'tt' is deprecated, use 'hadoop-tasktracker' Please use provider "aws-ec2" instead of "ec2" Role name 'jt' is deprecated, use 'hadoop-jobtracker' Role name 'nn' is deprecated, use 'hadoop-namenode' Role name 'tt' is deprecated, use 'hadoop-tasktracker' Role name 'dn' is deprecated, use 'hadoop-datanode' Please use provider "aws-ec2" instead of "ec2" Tests run: 3, Failures: 0, Errors: 0, Skipped: 0, Time elapsed: 0.336 sec Running org.apache.whirr.cli.command.VersionCommandTest Tests run: 1, Failures: 0, Errors: 0, Skipped: 0, Time elapsed: 0.006 sec Running org.apache.whirr.cli.command.DestroyClusterCommandTest Tests run: 2, Failures: 0, Errors: 0, Skipped: 0, Time elapsed: 0.358 sec Running org.apache.whirr.cli.MainTest Tests run: 3, Failures: 0, Errors: 0, Skipped: 0, Time elapsed: 0.044 sec Results : Tests run: 16, Failures: 0, Errors: 0, Skipped: 0 [INFO] [jar:jar {execution: default-jar} ] [INFO] Building jar: /home/karel/work/outerthought/whirr/cli/target/whirr-cli-0.6.0-incubating-SNAPSHOT.jar [INFO] [checkstyle:checkstyle {execution: default} ] [INFO] [WARNING] Unable to locate Source XRef to link to - DISABLED [INFO] [jar:test-jar {execution: default} ] [INFO] Building jar: /home/karel/work/outerthought/whirr/cli/target/whirr-cli-0.6.0-incubating-SNAPSHOT-tests.jar [INFO] Preparing source:jar [WARNING] Removing: jar from forked lifecycle, to prevent recursive invocation. [INFO] [enforcer:enforce {execution: enforce-java} ] [INFO] [source:jar {execution: default} ] [INFO] Building jar: /home/karel/work/outerthought/whirr/cli/target/whirr-cli-0.6.0-incubating-SNAPSHOT-sources.jar [INFO] [apache-rat:check {execution: default} ] [INFO] Exclude: **/BUILD.txt [INFO] Exclude: **/CHANGES.txt [INFO] Exclude: **/NOTICE-src.txt [INFO] Exclude: .git/** [INFO] Exclude: .gitignore [INFO] Exclude: * / .json [INFO] Exclude: **/src/main/resources/version-banner.txt [INFO] Exclude: docs/** [INFO] Exclude: * / .log* [INFO] Exclude: .idea/** [INFO] Exclude: src/site/resources/images/whirr-logo.ai [INFO] ------------------------------------------------------------------------ [INFO] Building Apache Whirr Examples [INFO] task-segment: [package] [INFO] ------------------------------------------------------------------------ [INFO] [enforcer:enforce {execution: enforce-java} ] [INFO] [remote-resources:process {execution: default} ] [INFO] [resources:resources {execution: default-resources} ] [INFO] Using 'UTF-8' encoding to copy filtered resources. [INFO] Copying 2 resources [INFO] Copying 3 resources [INFO] [compiler:compile {execution: default-compile} ] [INFO] Compiling 3 source files to /home/karel/work/outerthought/whirr/examples/target/classes [INFO] [resources:testResources {execution: default-testResources} ] [INFO] Using 'UTF-8' encoding to copy filtered resources. [INFO] skip non existing resourceDirectory /home/karel/work/outerthought/whirr/examples/src/test/resources [INFO] Copying 3 resources [INFO] [compiler:testCompile {execution: default-testCompile} ] [INFO] No sources to compile [INFO] [surefire:test {execution: default-test} ] [INFO] Surefire report directory: /home/karel/work/outerthought/whirr/examples/target/surefire-reports ------------------------------------------------------- T E S T S ------------------------------------------------------- There are no tests to run. Results : Tests run: 0, Failures: 0, Errors: 0, Skipped: 0 [INFO] [jar:jar {execution: default-jar} ] [INFO] Building jar: /home/karel/work/outerthought/whirr/examples/target/whirr-examples-0.6.0-incubating-SNAPSHOT.jar [INFO] [checkstyle:checkstyle {execution: default} ] [INFO] [WARNING] Unable to locate Source XRef to link to - DISABLED [INFO] [jar:test-jar {execution: default} ] [INFO] Building jar: /home/karel/work/outerthought/whirr/examples/target/whirr-examples-0.6.0-incubating-SNAPSHOT-tests.jar [INFO] Preparing source:jar [WARNING] Removing: jar from forked lifecycle, to prevent recursive invocation. [INFO] [enforcer:enforce {execution: enforce-java} ] [INFO] [source:jar {execution: default} ] [INFO] Building jar: /home/karel/work/outerthought/whirr/examples/target/whirr-examples-0.6.0-incubating-SNAPSHOT-sources.jar [INFO] [apache-rat:check {execution: default} ] [INFO] Exclude: **/BUILD.txt [INFO] Exclude: **/CHANGES.txt [INFO] Exclude: **/NOTICE-src.txt [INFO] Exclude: .git/** [INFO] Exclude: .gitignore [INFO] Exclude: * / .json [INFO] Exclude: **/src/main/resources/version-banner.txt [INFO] Exclude: docs/** [INFO] Exclude: * / .log* [INFO] Exclude: .idea/** [INFO] Exclude: src/site/resources/images/whirr-logo.ai [INFO] ------------------------------------------------------------------------ [INFO] Building Whirr [INFO] task-segment: [assembly:assembly] (aggregator-style) [INFO] ------------------------------------------------------------------------ [INFO] Preparing assembly:assembly [INFO] ------------------------------------------------------------------------ [INFO] Building Whirr [INFO] ------------------------------------------------------------------------ [INFO] [enforcer:enforce {execution: enforce-java} ] [INFO] [remote-resources:process {execution: default} ] [INFO] [site:attach-descriptor {execution: default-attach-descriptor} ] [INFO] [checkstyle:checkstyle {execution: default} ] [INFO] [jar:test-jar {execution: default} ] [WARNING] JAR will be empty - no content was marked for inclusion! [INFO] Preparing source:jar [WARNING] Removing: jar from forked lifecycle, to prevent recursive invocation. [INFO] [enforcer:enforce {execution: enforce-java} ] [INFO] [source:jar {execution: default} ] [INFO] [apache-rat:check {execution: default} ] [INFO] Exclude: **/BUILD.txt [INFO] Exclude: **/CHANGES.txt [INFO] Exclude: **/NOTICE-src.txt [INFO] Exclude: .git/** [INFO] Exclude: .gitignore [INFO] Exclude: * / .json [INFO] Exclude: **/src/main/resources/version-banner.txt [INFO] Exclude: docs/** [INFO] Exclude: * / .log* [INFO] Exclude: .idea/** [INFO] Exclude: src/site/resources/images/whirr-logo.ai [INFO] ------------------------------------------------------------------------ [INFO] Building Apache Whirr Build Tools [INFO] ------------------------------------------------------------------------ [WARNING] Removing: jar from forked lifecycle, to prevent recursive invocation. [INFO] [enforcer:enforce {execution: enforce-java} ] [INFO] [remote-resources:process {execution: default} ] [INFO] [resources:resources {execution: default-resources} ] [INFO] Using 'UTF-8' encoding to copy filtered resources. [INFO] Copying 1 resource [INFO] Copying 3 resources [INFO] Copying 3 resources [INFO] [compiler:compile {execution: default-compile} ] [INFO] No sources to compile [INFO] [resources:testResources {execution: default-testResources} ] [INFO] Using 'UTF-8' encoding to copy filtered resources. [INFO] skip non existing resourceDirectory /home/karel/work/outerthought/whirr/build-tools/src/test/resources [INFO] Copying 3 resources [INFO] Copying 3 resources [INFO] [compiler:testCompile {execution: default-testCompile} ] [INFO] No sources to compile [INFO] [surefire:test {execution: default-test} ] [INFO] Surefire report directory: /home/karel/work/outerthought/whirr/build-tools/target/surefire-reports ------------------------------------------------------- T E S T S ------------------------------------------------------- There are no tests to run. Results : Tests run: 0, Failures: 0, Errors: 0, Skipped: 0 [INFO] [jar:jar {execution: default-jar} ] [INFO] Building jar: /home/karel/work/outerthought/whirr/build-tools/target/whirr-build-tools-0.6.0-incubating-SNAPSHOT.jar [INFO] [checkstyle:checkstyle {execution: default} ] [INFO] [jar:test-jar {execution: default} ] [INFO] Building jar: /home/karel/work/outerthought/whirr/build-tools/target/whirr-build-tools-0.6.0-incubating-SNAPSHOT-tests.jar [INFO] [apache-rat:check {execution: default} ] [INFO] Exclude: **/BUILD.txt [INFO] Exclude: **/CHANGES.txt [INFO] Exclude: **/NOTICE-src.txt [INFO] Exclude: .git/** [INFO] Exclude: .gitignore [INFO] Exclude: * / .json [INFO] Exclude: **/src/main/resources/version-banner.txt [INFO] Exclude: docs/** [INFO] Exclude: * / .log* [INFO] Exclude: .idea/** [INFO] Exclude: src/site/resources/images/whirr-logo.ai [INFO] ------------------------------------------------------------------------ [INFO] Building Apache Whirr Core [INFO] ------------------------------------------------------------------------ [WARNING] Removing: jar from forked lifecycle, to prevent recursive invocation. [INFO] [enforcer:enforce {execution: enforce-java} ] [INFO] [remote-resources:process {execution: default} ] [INFO] [resources:resources {execution: default-resources} ] [INFO] Using 'UTF-8' encoding to copy filtered resources. [INFO] Copying 9 resources [INFO] Copying 3 resources [INFO] Copying 3 resources [INFO] [compiler:compile {execution: default-compile} ] [INFO] Compiling 5 source files to /home/karel/work/outerthought/whirr/core/target/classes [INFO] [resources:testResources {execution: default-testResources} ] [INFO] Using 'UTF-8' encoding to copy filtered resources. [INFO] Copying 4 resources [INFO] Copying 3 resources [INFO] Copying 3 resources [INFO] [compiler:testCompile {execution: default-testCompile} ] [INFO] Nothing to compile - all classes are up to date [INFO] [surefire:test {execution: default-test} ] [INFO] Surefire report directory: /home/karel/work/outerthought/whirr/core/target/surefire-reports ------------------------------------------------------- T E S T S ------------------------------------------------------- Running org.apache.whirr.service.TemplateBuilderStrategyTest Tests run: 3, Failures: 0, Errors: 0, Skipped: 0, Time elapsed: 1.426 sec Running org.apache.whirr.command.AbstractClusterCommandTest Tests run: 1, Failures: 0, Errors: 0, Skipped: 0, Time elapsed: 0.085 sec Running org.apache.whirr.service.jclouds.StatementBuilderTest Tests run: 1, Failures: 0, Errors: 0, Skipped: 0, Time elapsed: 0.069 sec Running org.apache.whirr.ClusterSpecTest 2011-08-10 16:13:17,213 WARN [org.apache.whirr.InstanceTemplate] (main) Role name 'nn' is deprecated, use 'hadoop-namenode' 2011-08-10 16:13:17,213 WARN [org.apache.whirr.InstanceTemplate] (main) Role name 'jt' is deprecated, use 'hadoop-jobtracker' 2011-08-10 16:13:17,214 WARN [org.apache.whirr.InstanceTemplate] (main) Role name 'tt' is deprecated, use 'hadoop-tasktracker' 2011-08-10 16:13:17,214 WARN [org.apache.whirr.InstanceTemplate] (main) Role name 'dn' is deprecated, use 'hadoop-datanode' 2011-08-10 16:13:17,214 WARN [org.apache.whirr.InstanceTemplate] (main) Role name 'zk' is deprecated, use 'zookeeper' 2011-08-10 16:13:17,345 WARN [org.apache.whirr.ClusterSpec] (main) Please use provider "aws-ec2" instead of "ec2" 2011-08-10 16:13:17,575 WARN [org.apache.whirr.ClusterSpec] (main) Please use provider "cloudservers-us" instead of "cloudservers" Tests run: 21, Failures: 0, Errors: 0, Skipped: 0, Time elapsed: 1.401 sec Running org.apache.whirr.ClusterControllerFactoryTest Tests run: 2, Failures: 0, Errors: 0, Skipped: 0, Time elapsed: 0.012 sec Running org.apache.whirr.service.jclouds.TakeLoginCredentialsFromWhirrPropertiesTest Tests run: 4, Failures: 0, Errors: 0, Skipped: 0, Time elapsed: 0.011 sec Running org.apache.whirr.util.KeyPairTest Tests run: 2, Failures: 0, Errors: 0, Skipped: 0, Time elapsed: 0.117 sec Running org.apache.whirr.ClusterTest Tests run: 3, Failures: 0, Errors: 0, Skipped: 0, Time elapsed: 0.013 sec Running org.apache.whirr.actions.BootstrapClusterActionTest 2011-08-10 16:13:17,976 WARN [org.apache.whirr.InstanceTemplate] (main) Role name 'jt' is deprecated, use 'hadoop-jobtracker' 2011-08-10 16:13:17,976 WARN [org.apache.whirr.InstanceTemplate] (main) Role name 'nn' is deprecated, use 'hadoop-namenode' 2011-08-10 16:13:17,976 WARN [org.apache.whirr.InstanceTemplate] (main) Role name 'dn' is deprecated, use 'hadoop-datanode' 2011-08-10 16:13:17,976 WARN [org.apache.whirr.InstanceTemplate] (main) Role name 'tt' is deprecated, use 'hadoop-tasktracker' 2011-08-10 16:13:17,977 WARN [org.apache.whirr.ClusterSpec] (main) Please use provider "aws-ec2" instead of "ec2" 2011-08-10 16:13:18,034 INFO [org.apache.whirr.actions.BootstrapClusterAction] (main) Bootstrapping cluster 2011-08-10 16:13:18,038 INFO [org.apache.whirr.actions.BootstrapClusterAction] (main) Configuring template 2011-08-10 16:13:18,053 INFO [org.apache.whirr.actions.BootstrapClusterAction] (main) Configuring template 2011-08-10 16:13:18,061 INFO [org.apache.whirr.actions.BootstrapClusterActionTest] (pool-1-thread-2) [hadoop-datanode, hadoop-tasktracker] - Node successfully started: nodeId10 2011-08-10 16:13:18,061 INFO [org.apache.whirr.actions.BootstrapClusterActionTest] (pool-1-thread-4) [hadoop-jobtracker, hadoop-namenode] - Node failing to start: nodeId20 2011-08-10 16:13:18,062 INFO [org.apache.whirr.actions.BootstrapClusterActionTest] (pool-1-thread-2) [hadoop-datanode, hadoop-tasktracker] - Node successfully started: nodeId11 2011-08-10 16:13:18,062 INFO [org.apache.whirr.actions.BootstrapClusterActionTest] (pool-1-thread-2) [hadoop-datanode, hadoop-tasktracker] - Node successfully started: nodeId12 2011-08-10 16:13:18,062 INFO [org.apache.whirr.actions.BootstrapClusterActionTest] (pool-1-thread-2) [hadoop-datanode, hadoop-tasktracker] - Node failing to start: nodeId13 2011-08-10 16:13:18,068 INFO [org.apache.whirr.actions.BootstrapClusterAction] (pool-1-thread-2) Deleting failed node node nodeId13 2011-08-10 16:13:18,068 INFO [org.apache.whirr.actions.BootstrapClusterActionTest] (pool-1-thread-5) [hadoop-jobtracker, hadoop-namenode] - Node successfully started: nodeId30 2011-08-10 16:13:18,068 INFO [org.apache.whirr.actions.BootstrapClusterAction] (pool-1-thread-4) Deleting failed node node nodeId20 2011-08-10 16:13:18,069 INFO [org.apache.whirr.actions.BootstrapClusterAction] (pool-1-thread-2) Node deleted: nodeId13 2011-08-10 16:13:18,069 INFO [org.apache.whirr.actions.BootstrapClusterAction] (pool-1-thread-4) Node deleted: nodeId20 2011-08-10 16:13:18,179 WARN [org.apache.whirr.InstanceTemplate] (main) Role name 'jt' is deprecated, use 'hadoop-jobtracker' 2011-08-10 16:13:18,179 WARN [org.apache.whirr.InstanceTemplate] (main) Role name 'nn' is deprecated, use 'hadoop-namenode' 2011-08-10 16:13:18,179 WARN [org.apache.whirr.InstanceTemplate] (main) Role name 'dn' is deprecated, use 'hadoop-datanode' 2011-08-10 16:13:18,179 WARN [org.apache.whirr.InstanceTemplate] (main) Role name 'tt' is deprecated, use 'hadoop-tasktracker' 2011-08-10 16:13:18,179 WARN [org.apache.whirr.ClusterSpec] (main) Please use provider "aws-ec2" instead of "ec2" 2011-08-10 16:13:18,184 INFO [org.apache.whirr.actions.BootstrapClusterAction] (main) Bootstrapping cluster 2011-08-10 16:13:18,184 INFO [org.apache.whirr.actions.BootstrapClusterAction] (main) Configuring template 2011-08-10 16:13:18,187 INFO [org.apache.whirr.actions.BootstrapClusterActionTest] (pool-2-thread-2) [hadoop-datanode, hadoop-tasktracker] - Node successfully started: nodeId10 2011-08-10 16:13:18,187 INFO [org.apache.whirr.actions.BootstrapClusterAction] (main) Configuring template 2011-08-10 16:13:18,188 INFO [org.apache.whirr.actions.BootstrapClusterActionTest] (pool-2-thread-2) [hadoop-datanode, hadoop-tasktracker] - Node failing to start: nodeId11 2011-08-10 16:13:18,188 INFO [org.apache.whirr.actions.BootstrapClusterActionTest] (pool-2-thread-2) [hadoop-datanode, hadoop-tasktracker] - Node failing to start: nodeId12 2011-08-10 16:13:18,188 INFO [org.apache.whirr.actions.BootstrapClusterActionTest] (pool-2-thread-2) [hadoop-datanode, hadoop-tasktracker] - Node failing to start: nodeId13 2011-08-10 16:13:18,189 INFO [org.apache.whirr.actions.BootstrapClusterActionTest] (pool-2-thread-3) [hadoop-datanode, hadoop-tasktracker] - Node successfully started: nodeId20 2011-08-10 16:13:18,190 INFO [org.apache.whirr.actions.BootstrapClusterActionTest] (pool-2-thread-3) [hadoop-datanode, hadoop-tasktracker] - Node failing to start: nodeId21 2011-08-10 16:13:18,190 INFO [org.apache.whirr.actions.BootstrapClusterActionTest] (pool-2-thread-3) [hadoop-datanode, hadoop-tasktracker] - Node failing to start: nodeId22 2011-08-10 16:13:18,190 INFO [org.apache.whirr.actions.BootstrapClusterActionTest] (pool-2-thread-4) [hadoop-jobtracker, hadoop-namenode] - Node successfully started: nodeId30 2011-08-10 16:13:18,191 INFO [org.apache.whirr.actions.BootstrapClusterAction] (pool-2-thread-2) Deleting failed node node nodeId21 2011-08-10 16:13:18,191 INFO [org.apache.whirr.actions.BootstrapClusterAction] (pool-2-thread-4) Deleting failed node node nodeId22 2011-08-10 16:13:18,192 INFO [org.apache.whirr.actions.BootstrapClusterAction] (pool-2-thread-2) Node deleted: nodeId21 2011-08-10 16:13:18,192 INFO [org.apache.whirr.actions.BootstrapClusterAction] (pool-2-thread-4) Node deleted: nodeId22 2011-08-10 16:13:18,192 INFO [org.apache.whirr.actions.BootstrapClusterAction] (pool-2-thread-2) Deleting failed node node nodeId12 2011-08-10 16:13:18,193 INFO [org.apache.whirr.actions.BootstrapClusterAction] (pool-2-thread-2) Node deleted: nodeId12 2011-08-10 16:13:18,192 INFO [org.apache.whirr.actions.BootstrapClusterAction] (pool-2-thread-3) Deleting failed node node nodeId13 2011-08-10 16:13:18,193 INFO [org.apache.whirr.actions.BootstrapClusterAction] (pool-2-thread-5) Deleting failed node node nodeId11 2011-08-10 16:13:18,193 INFO [org.apache.whirr.actions.BootstrapClusterAction] (pool-2-thread-3) Node deleted: nodeId13 2011-08-10 16:13:18,193 INFO [org.apache.whirr.actions.BootstrapClusterAction] (pool-2-thread-5) Node deleted: nodeId11 Tests run: 2, Failures: 0, Errors: 0, Skipped: 0, Time elapsed: 0.272 sec Running org.apache.whirr.service.jclouds.RunUrlStatementTest Tests run: 6, Failures: 0, Errors: 0, Skipped: 0, Time elapsed: 0.49 sec Results : Tests run: 45, Failures: 0, Errors: 0, Skipped: 0 [INFO] [jar:jar {execution: default-jar} ] [INFO] Building jar: /home/karel/work/outerthought/whirr/core/target/whirr-core-0.6.0-incubating-SNAPSHOT.jar [INFO] [checkstyle:checkstyle {execution: default} ] [INFO] ------------------------------------------------------------------------ [ERROR] BUILD ERROR [INFO] ------------------------------------------------------------------------ [INFO] An error has occurred in Checkstyle report generation. Embedded error: Failed during checkstyle execution Could not find resource './build-tools/src/main/resources/checkstyle.xml'. [INFO] ------------------------------------------------------------------------ [INFO] Trace org.apache.maven.lifecycle.LifecycleExecutionException: An error has occurred in Checkstyle report generation. at org.apache.maven.lifecycle.DefaultLifecycleExecutor.executeGoals(DefaultLifecycleExecutor.java:719) at org.apache.maven.lifecycle.DefaultLifecycleExecutor.executeGoalWithLifecycle(DefaultLifecycleExecutor.java:556) at org.apache.maven.lifecycle.DefaultLifecycleExecutor.forkProjectLifecycle(DefaultLifecycleExecutor.java:1205) at org.apache.maven.lifecycle.DefaultLifecycleExecutor.forkLifecycle(DefaultLifecycleExecutor.java:1033) at org.apache.maven.lifecycle.DefaultLifecycleExecutor.executeGoals(DefaultLifecycleExecutor.java:643) at org.apache.maven.lifecycle.DefaultLifecycleExecutor.executeStandaloneGoal(DefaultLifecycleExecutor.java:569) at org.apache.maven.lifecycle.DefaultLifecycleExecutor.executeGoal(DefaultLifecycleExecutor.java:539) at org.apache.maven.lifecycle.DefaultLifecycleExecutor.executeGoalAndHandleFailures(DefaultLifecycleExecutor.java:387) at org.apache.maven.lifecycle.DefaultLifecycleExecutor.executeTaskSegments(DefaultLifecycleExecutor.java:284) at org.apache.maven.lifecycle.DefaultLifecycleExecutor.execute(DefaultLifecycleExecutor.java:180) at org.apache.maven.DefaultMaven.doExecute(DefaultMaven.java:328) at org.apache.maven.DefaultMaven.execute(DefaultMaven.java:138) at org.apache.maven.cli.MavenCli.main(MavenCli.java:362) at org.apache.maven.cli.compat.CompatibleMain.main(CompatibleMain.java:60) at sun.reflect.NativeMethodAccessorImpl.invoke0(Native Method) at sun.reflect.NativeMethodAccessorImpl.invoke(NativeMethodAccessorImpl.java:39) at sun.reflect.DelegatingMethodAccessorImpl.invoke(DelegatingMethodAccessorImpl.java:25) at java.lang.reflect.Method.invoke(Method.java:597) at org.codehaus.classworlds.Launcher.launchEnhanced(Launcher.java:315) at org.codehaus.classworlds.Launcher.launch(Launcher.java:255) at org.codehaus.classworlds.Launcher.mainWithExitCode(Launcher.java:430) at org.codehaus.classworlds.Launcher.main(Launcher.java:375) Caused by: org.apache.maven.plugin.MojoExecutionException: An error has occurred in Checkstyle report generation. at org.apache.maven.reporting.AbstractMavenReport.execute(AbstractMavenReport.java:122) at org.apache.maven.plugin.DefaultPluginManager.executeMojo(DefaultPluginManager.java:490) at org.apache.maven.lifecycle.DefaultLifecycleExecutor.executeGoals(DefaultLifecycleExecutor.java:694) ... 21 more Caused by: org.apache.maven.reporting.MavenReportException: Failed during checkstyle execution at org.apache.maven.plugin.checkstyle.CheckstyleReport.executeReport(CheckstyleReport.java:597) at org.apache.maven.reporting.AbstractMavenReport.generate(AbstractMavenReport.java:190) at org.apache.maven.reporting.AbstractMavenReport.execute(AbstractMavenReport.java:99) ... 23 more Caused by: org.apache.maven.plugin.checkstyle.CheckstyleExecutorException: Unable to find configuration file at location ./build-tools/src/main/resources/checkstyle.xml at org.apache.maven.plugin.checkstyle.DefaultCheckstyleExecutor.getConfigFile(DefaultCheckstyleExecutor.java:481) at org.apache.maven.plugin.checkstyle.DefaultCheckstyleExecutor.getConfiguration(DefaultCheckstyleExecutor.java:236) at org.apache.maven.plugin.checkstyle.DefaultCheckstyleExecutor.executeCheckstyle(DefaultCheckstyleExecutor.java:173) at org.apache.maven.plugin.checkstyle.CheckstyleReport.executeReport(CheckstyleReport.java:578) ... 25 more Caused by: org.codehaus.plexus.resource.loader.ResourceNotFoundException: Could not find resource './build-tools/src/main/resources/checkstyle.xml'. at org.codehaus.plexus.resource.DefaultResourceManager.getResource(DefaultResourceManager.java:173) at org.codehaus.plexus.resource.DefaultResourceManager.getResourceAsFile(DefaultResourceManager.java:91) at org.apache.maven.plugin.checkstyle.DefaultCheckstyleExecutor.getConfigFile(DefaultCheckstyleExecutor.java:471) ... 28 more [INFO] ------------------------------------------------------------------------ [INFO] Total time: 1 minute 24 seconds [INFO] Finished at: Wed Aug 10 16:13:18 CEST 2011 [INFO] Final Memory: 198M/356M [INFO] ------------------------------------------------------------------------
          Hide
          Andrei Savu added a comment -

          Do you still see that error if you apply the attached patch? I will do more extensive testing with an empty local maven repository (trying to simulate a first checkout & build).

          Show
          Andrei Savu added a comment - Do you still see that error if you apply the attached patch? I will do more extensive testing with an empty local maven repository (trying to simulate a first checkout & build).
          Hide
          Andrei Savu added a comment -

          I've been able to replicate this with maven 2 doing a clean build. Do you think we can support both versions?

          Show
          Andrei Savu added a comment - I've been able to replicate this with maven 2 doing a clean build. Do you think we can support both versions?
          Hide
          Karel Vervaeke added a comment -

          Tried again with a clean repository. The attached patch is no good. You run into a bootstrapping problem: you need to have o.a.whirr:build-tools in your repository, but you can't build it (with cd build-tools; mvn install) because you don't have o.a.whirr:build-tools in your repository

          I wouldn't mind if maven 2 was not supported. Just document it on the 'building whirr' wiki page and check it using the maven-enforcer-plugin (if that's still how it's done.)

          Show
          Karel Vervaeke added a comment - Tried again with a clean repository. The attached patch is no good. You run into a bootstrapping problem: you need to have o.a.whirr:build-tools in your repository, but you can't build it (with cd build-tools; mvn install) because you don't have o.a.whirr:build-tools in your repository I wouldn't mind if maven 2 was not supported. Just document it on the 'building whirr' wiki page and check it using the maven-enforcer-plugin (if that's still how it's done.)
          Hide
          Andrei Savu added a comment -

          Karel are you using maven 3 as an workaround now? Is there something we can do to make it always work?

          Show
          Andrei Savu added a comment - Karel are you using maven 3 as an workaround now? Is there something we can do to make it always work?
          Hide
          Karel Vervaeke added a comment -

          I'm using maven 3 right now. 'mvn package assembly:assembly' still fails with the same checkstyle error.
          Can you tell me which maven version and which jdk version you are using? I'll try with the same versions then.

          Show
          Karel Vervaeke added a comment - I'm using maven 3 right now. 'mvn package assembly:assembly' still fails with the same checkstyle error. Can you tell me which maven version and which jdk version you are using? I'll try with the same versions then.
          Hide
          Andrei Savu added a comment -

          I'm using Apache Maven 3.0.3 (r1075438; 2011-02-28 19:31:09+0200) with Java version: 1.6.0_26, vendor: Apple Inc. running on Mac OSX 10.8.0 Darwin Kernel Version 10.8.0. I see no errors. Before I was using the same maven version on Ubuntu - also no errors.

          Show
          Andrei Savu added a comment - I'm using Apache Maven 3.0.3 (r1075438; 2011-02-28 19:31:09+0200) with Java version: 1.6.0_26, vendor: Apple Inc. running on Mac OSX 10.8.0 Darwin Kernel Version 10.8.0. I see no errors. Before I was using the same maven version on Ubuntu - also no errors.
          Hide
          Andrei Savu added a comment -

          Do you have a customised ~/.m2/settings.xml file?

          Show
          Andrei Savu added a comment - Do you have a customised ~/.m2/settings.xml file?
          Hide
          Karel Vervaeke added a comment -

          Ah sorry, I've been very confusing: mvn package assembly:assembly fails when using maven 2.2.1. That is why I am using Maven 3, which does not have the error...

          I have a customised settings.xml file. I'm going to try again without it.

          Show
          Karel Vervaeke added a comment - Ah sorry, I've been very confusing: mvn package assembly:assembly fails when using maven 2.2.1. That is why I am using Maven 3, which does not have the error... I have a customised settings.xml file. I'm going to try again without it.
          Hide
          Karel Vervaeke added a comment -

          Same error without my custom settings.xml. I'm going to try again once more with a fresh local repository.
          Just to be sure: can you run 'mvn package assembly:assembly' succesfully with maven 2.2.1?

          Show
          Karel Vervaeke added a comment - Same error without my custom settings.xml. I'm going to try again once more with a fresh local repository. Just to be sure: can you run 'mvn package assembly:assembly' succesfully with maven 2.2.1?
          Hide
          Andrei Savu added a comment -

          I'm not sure and I can't test now but as I remember I've been able to build a binary release with maven 2.

          Show
          Andrei Savu added a comment - I'm not sure and I can't test now but as I remember I've been able to build a binary release with maven 2.
          Hide
          Karel Vervaeke added a comment -

          Just tried with a fresh local maven repository. Same error.

          Show
          Karel Vervaeke added a comment - Just tried with a fresh local maven repository. Same error.
          Hide
          David Alves added a comment -

          status report:

          mvn3 assembly goal only works for me if I run package first, i.e., "mvn package assembly:assembly" (jar missing error)
          mvn2 assembly goal fails with checkstyle problems

          I'm upgrading checkstyle and correcting configuration which seems to be working

          Show
          David Alves added a comment - status report: mvn3 assembly goal only works for me if I run package first, i.e., "mvn package assembly:assembly" (jar missing error) mvn2 assembly goal fails with checkstyle problems I'm upgrading checkstyle and correcting configuration which seems to be working
          Hide
          David Alves added a comment -

          Patch upgrades checkstyle and sets the configuration correctly so that there are no longer problems finding checkstyle.xml.

          Also some new checkstyle issues are corrected.

          "mvn package assembly:assembly" is tested to work on maven 2 and 3.

          Show
          David Alves added a comment - Patch upgrades checkstyle and sets the configuration correctly so that there are no longer problems finding checkstyle.xml. Also some new checkstyle issues are corrected. "mvn package assembly:assembly" is tested to work on maven 2 and 3.
          Hide
          Andrei Savu added a comment -

          Have you tested this with an empty local maven repo? I'm just trying the patch on a vanilla Ubuntu 10.04 install.

          Show
          Andrei Savu added a comment - Have you tested this with an empty local maven repo? I'm just trying the patch on a vanilla Ubuntu 10.04 install.
          Hide
          David Alves added a comment -

          ..and? it failed?

          Show
          David Alves added a comment - ..and? it failed?
          Hide
          Andrei Savu added a comment -

          With Maven 3 on a vanilla OS I get the following error when running mvn clean install:

          [ERROR] Failed to execute goal org.apache.maven.plugins:maven-checkstyle-plugin:2.8:checkstyle (default) on project whirr: Execution default of goal org.apache.maven.plugins:maven-checkstyle-plugin:2.8:checkstyle failed: Plugin org.apache.maven.plugins:maven-checkstyle-plugin:2.8 or one of its dependencies could not be resolved: Could not find artifact org.apache.whirr:whirr-build-tools:jar:0.7.0-SNAPSHOT in apache-snapshots (https://repository.apache.org/content/repositories/snapshots) -> [Help 1]

          and the same is happening when running mvn package assembly:assembly.

          I get a similar error with maven 2:

          [INFO] Failed to resolve artifact.
          
          Missing:
          ----------
          1) org.apache.whirr:whirr-build-tools:jar:0.7.0-SNAPSHOT
          
            Try downloading the file manually from the project website.
          
            Then, install it using the command: 
                mvn install:install-file -DgroupId=org.apache.whirr -DartifactId=whirr-build-tools -Dversion=0.7.0-SNAPSHOT -Dpackaging=jar -Dfile=/path/to/file
          
            Alternatively, if you host your own repository you can deploy the file there: 
                mvn deploy:deploy-file -DgroupId=org.apache.whirr -DartifactId=whirr-build-tools -Dversion=0.7.0-SNAPSHOT -Dpackaging=jar -Dfile=/path/to/file -Durl=[url] -DrepositoryId=[id]
          
            Path to dependency: 
            	1) org.apache.maven.plugins:maven-checkstyle-plugin:maven-plugin:2.8
            	2) org.apache.whirr:whirr-build-tools:jar:0.7.0-SNAPSHOT
          
          ----------
          1 required artifact is missing.
          
          for artifact: 
            org.apache.maven.plugins:maven-checkstyle-plugin:maven-plugin:2.8
          
          from the specified remote repositories:
            apache.snapshots (http://repository.apache.org/snapshots),
            central (http://repo1.maven.org/maven2),
            apache-snapshots (https://repository.apache.org/content/repositories/snapshots),
            cloudera (https://repository.cloudera.com/content/repositories/releases/)
          
          
          Show
          Andrei Savu added a comment - With Maven 3 on a vanilla OS I get the following error when running mvn clean install : [ERROR] Failed to execute goal org.apache.maven.plugins:maven-checkstyle-plugin:2.8:checkstyle (default) on project whirr: Execution default of goal org.apache.maven.plugins:maven-checkstyle-plugin:2.8:checkstyle failed: Plugin org.apache.maven.plugins:maven-checkstyle-plugin:2.8 or one of its dependencies could not be resolved: Could not find artifact org.apache.whirr:whirr-build-tools:jar:0.7.0-SNAPSHOT in apache-snapshots ( https://repository.apache.org/content/repositories/snapshots ) -> [Help 1] and the same is happening when running mvn package assembly:assembly . I get a similar error with maven 2: [INFO] Failed to resolve artifact. Missing: ---------- 1) org.apache.whirr:whirr-build-tools:jar:0.7.0-SNAPSHOT Try downloading the file manually from the project website. Then, install it using the command: mvn install:install-file -DgroupId=org.apache.whirr -DartifactId=whirr-build-tools -Dversion=0.7.0-SNAPSHOT -Dpackaging=jar -Dfile=/path/to/file Alternatively, if you host your own repository you can deploy the file there: mvn deploy:deploy-file -DgroupId=org.apache.whirr -DartifactId=whirr-build-tools -Dversion=0.7.0-SNAPSHOT -Dpackaging=jar -Dfile=/path/to/file -Durl=[url] -DrepositoryId=[id] Path to dependency: 1) org.apache.maven.plugins:maven-checkstyle-plugin:maven-plugin:2.8 2) org.apache.whirr:whirr-build-tools:jar:0.7.0-SNAPSHOT ---------- 1 required artifact is missing. for artifact: org.apache.maven.plugins:maven-checkstyle-plugin:maven-plugin:2.8 from the specified remote repositories: apache.snapshots (http://repository.apache.org/snapshots), central (http://repo1.maven.org/maven2), apache-snapshots (https://repository.apache.org/content/repositories/snapshots), cloudera (https://repository.cloudera.com/content/repositories/releases/)
          Hide
          David Alves added a comment -

          I think I got it. I removed the dependency on parent proj from build-tools so that now it builds first.

          Please Review!

          Show
          David Alves added a comment - I think I got it. I removed the dependency on parent proj from build-tools so that now it builds first. Please Review!
          Hide
          Andrei Savu added a comment -

          It's working fine with Maven 3.0.3 on Ubuntu 10.04 (vanilla OS install + jdk - no local maven cache). I have been able tu run mvn clean install && mvn package assembly:assembly. Now testing with Maven 2.2.1 - it takes a while to "download the internet".

          Show
          Andrei Savu added a comment - It's working fine with Maven 3.0.3 on Ubuntu 10.04 (vanilla OS install + jdk - no local maven cache). I have been able tu run mvn clean install && mvn package assembly:assembly. Now testing with Maven 2.2.1 - it takes a while to "download the internet".
          Hide
          Andrei Savu added a comment -

          +1 also working fine with maven 2.2.1 (same setup). Nice to see this finally fixed - it was hunting us for a while.

          Show
          Andrei Savu added a comment - +1 also working fine with maven 2.2.1 (same setup). Nice to see this finally fixed - it was hunting us for a while.
          Hide
          Andrei Savu added a comment -

          Committed. Great work David - serious maven skills! Karel can you confirm this is also fixing the problem for you?

          Show
          Andrei Savu added a comment - Committed. Great work David - serious maven skills! Karel can you confirm this is also fixing the problem for you?
          Hide
          Karel Vervaeke added a comment -

          Yup, works here as well. Thumbs up @ David!

          Show
          Karel Vervaeke added a comment - Yup, works here as well. Thumbs up @ David!

            People

            • Assignee:
              David Alves
              Reporter:
              Karel Vervaeke
            • Votes:
              0 Vote for this issue
              Watchers:
              0 Start watching this issue

              Dates

              • Created:
                Updated:
                Resolved:

                Development