Uploaded image for project: 'TomEE'
  1. TomEE
  2. TOMEE-3140 Jakarta EE 9.1 TCK Failures
  3. TOMEE-3197

jpa.ee.packaging.jar JarFileElementsTest

    XMLWordPrintableJSON

    Details

    • Type: Sub-task
    • Status: Resolved
    • Priority: Major
    • Resolution: Fixed
    • Affects Version/s: None
    • Fix Version/s: 9.0.0-M7
    • Component/s: None
    • Labels:
      None

      Description

      Follow setup instructions in TOMEE-3140. Then run:

      ./runtests --ee91 -c -j --web tomee-plume com.sun.ts.tests.jpa.ee.packaging.jar.Client#JarFileElementsTest_from_pmservlet
      

      At the time this issue was filed, the test failed with the following in target/logs/javatest.log

      	at org.apache.catalina.core.StandardEngineValve.invoke(StandardEngineValve.java:78)
      	at org.apache.catalina.connector.CoyoteAdapter.service(CoyoteAdapter.java:353)
      	at org.apache.coyote.http11.Http11Processor.service(Http11Processor.java:374)
      	at org.apache.coyote.AbstractProcessorLight.process(AbstractProcessorLight.java:65)
      	at org.apache.coyote.AbstractProtocol$ConnectionHandler.process(AbstractProtocol.java:870)
      	at org.apache.tomcat.util.net.NioEndpoint$SocketProcessor.doRun(NioEndpoint.java:1696)
      	at org.apache.tomcat.util.net.SocketProcessorBase.run(SocketProcessorBase.java:49)
      	at java.util.concurrent.ThreadPoolExecutor.runWorker(ThreadPoolExecutor.java:1149)
      	at java.util.concurrent.ThreadPoolExecutor$Worker.run(ThreadPoolExecutor.java:624)
      	at org.apache.tomcat.util.threads.TaskThread$WrappingRunnable.run(TaskThread.java:61)
      	at java.lang.Thread.run(Thread.java:748)
      Caused by: org.apache.openejb.OpenEJBException: org.apache.openejb.OpenEJBRuntimeException: jakarta.persistence.PersistenceException: Exception [EclipseLink-28018] (Eclipse Persistence Services - 3.0.0.v202012081010): org.eclipse.persistence.exceptions.EntityManagerSetupException
      Exception Description: Predeployment of PersistenceUnit [CTS-EM] failed.
      Internal Exception: java.lang.RuntimeException: java.io.FileNotFoundException: /Users/dblevins/work/tcks/jakartaeetck-9.1.0-2021-03-24.1451/dist/com/sun/ts/tests/jpa/ee/packaging/jar/jpa_ee_packaging_jar_vehicles/lib/jpa_ee_packaging_jar_jarfile1.jar (No such file or directory): jakarta.persistence.PersistenceException: Exception [EclipseLink-28018] (Eclipse Persistence Services - 3.0.0.v202012081010): org.eclipse.persistence.exceptions.EntityManagerSetupException
      Exception Description: Predeployment of PersistenceUnit [CTS-EM] failed.
      Internal Exception: java.lang.RuntimeException: java.io.FileNotFoundException: /Users/dblevins/work/tcks/jakartaeetck-9.1.0-2021-03-24.1451/dist/com/sun/ts/tests/jpa/ee/packaging/jar/jpa_ee_packaging_jar_vehicles/lib/jpa_ee_packaging_jar_jarfile1.jar (No such file or directory)
      	at org.apache.openejb.assembler.classic.Assembler.createApplication(Assembler.java:930)
      	... 54 more
      Caused by: org.apache.openejb.OpenEJBRuntimeException: jakarta.persistence.PersistenceException: Exception [EclipseLink-28018] (Eclipse Persistence Services - 3.0.0.v202012081010): org.eclipse.persistence.exceptions.EntityManagerSetupException
      Exception Description: Predeployment of PersistenceUnit [CTS-EM] failed.
      Internal Exception: java.lang.RuntimeException: java.io.FileNotFoundException: /Users/dblevins/work/tcks/jakartaeetck-9.1.0-2021-03-24.1451/dist/com/sun/ts/tests/jpa/ee/packaging/jar/jpa_ee_packaging_jar_vehicles/lib/jpa_ee_packaging_jar_jarfile1.jar (No such file or directory)
      	at org.apache.openejb.assembler.classic.ReloadableEntityManagerFactory.createDelegate(ReloadableEntityManagerFactory.java:136)
      	at org.apache.openejb.assembler.classic.ReloadableEntityManagerFactory.<init>(ReloadableEntityManagerFactory.java:105)
      	at org.apache.openejb.assembler.classic.PersistenceBuilder.createEntityManagerFactory(PersistenceBuilder.java:157)
      	at org.apache.openejb.assembler.classic.Assembler.createApplication(Assembler.java:924)
      	... 54 more
      Caused by: jakarta.persistence.PersistenceException: Exception [EclipseLink-28018] (Eclipse Persistence Services - 3.0.0.v202012081010): org.eclipse.persistence.exceptions.EntityManagerSetupException
      Exception Description: Predeployment of PersistenceUnit [CTS-EM] failed.
      Internal Exception: java.lang.RuntimeException: java.io.FileNotFoundException: /Users/dblevins/work/tcks/jakartaeetck-9.1.0-2021-03-24.1451/dist/com/sun/ts/tests/jpa/ee/packaging/jar/jpa_ee_packaging_jar_vehicles/lib/jpa_ee_packaging_jar_jarfile1.jar (No such file or directory)
      	at org.eclipse.persistence.internal.jpa.EntityManagerSetupImpl.createPredeployFailedPersistenceException(EntityManagerSetupImpl.java:2147)
      	at org.eclipse.persistence.internal.jpa.EntityManagerSetupImpl.predeploy(EntityManagerSetupImpl.java:2123)
      	at org.eclipse.persistence.jpa.PersistenceProvider.createContainerEntityManagerFactoryImpl(PersistenceProvider.java:350)
      	at org.eclipse.persistence.jpa.PersistenceProvider.createContainerEntityManagerFactory(PersistenceProvider.java:316)
      	at org.apache.openejb.assembler.classic.EntityManagerFactoryCallable.call(EntityManagerFactoryCallable.java:112)
      	at org.apache.openejb.assembler.classic.ReloadableEntityManagerFactory.createDelegate(ReloadableEntityManagerFactory.java:134)
      	... 57 more
      Caused by: Exception [EclipseLink-28018] (Eclipse Persistence Services - 3.0.0.v202012081010): org.eclipse.persistence.exceptions.EntityManagerSetupException
      Exception Description: Predeployment of PersistenceUnit [CTS-EM] failed.
      Internal Exception: java.lang.RuntimeException: java.io.FileNotFoundException: /Users/dblevins/work/tcks/jakartaeetck-9.1.0-2021-03-24.1451/dist/com/sun/ts/tests/jpa/ee/packaging/jar/jpa_ee_packaging_jar_vehicles/lib/jpa_ee_packaging_jar_jarfile1.jar (No such file or directory)
      	at org.eclipse.persistence.exceptions.EntityManagerSetupException.predeployFailed(EntityManagerSetupException.java:233)
      	... 63 more
      Caused by: java.lang.RuntimeException: java.io.FileNotFoundException: /Users/dblevins/work/tcks/jakartaeetck-9.1.0-2021-03-24.1451/dist/com/sun/ts/tests/jpa/ee/packaging/jar/jpa_ee_packaging_jar_vehicles/lib/jpa_ee_packaging_jar_jarfile1.jar (No such file or directory)
      	at org.eclipse.persistence.internal.jpa.metadata.MetadataProcessor.loadStandardMappingFiles(MetadataProcessor.java:487)
      	at org.eclipse.persistence.internal.jpa.metadata.MetadataProcessor.loadMappingFiles(MetadataProcessor.java:396)
      	at org.eclipse.persistence.internal.jpa.deployment.PersistenceUnitProcessor.processORMetadata(PersistenceUnitProcessor.java:629)
      	at org.eclipse.persistence.internal.jpa.EntityManagerSetupImpl.predeploy(EntityManagerSetupImpl.java:2044)
      	... 61 more
      Caused by: java.io.FileNotFoundException: /Users/dblevins/work/tcks/jakartaeetck-9.1.0-2021-03-24.1451/dist/com/sun/ts/tests/jpa/ee/packaging/jar/jpa_ee_packaging_jar_vehicles/lib/jpa_ee_packaging_jar_jarfile1.jar (No such file or directory)
      	at java.util.zip.ZipFile.open(Native Method)
      	at java.util.zip.ZipFile.<init>(ZipFile.java:225)
      	at java.util.zip.ZipFile.<init>(ZipFile.java:155)
      	at java.util.jar.JarFile.<init>(JarFile.java:166)
      	at java.util.jar.JarFile.<init>(JarFile.java:130)
      	at org.eclipse.persistence.internal.jpa.deployment.ArchiveFactoryImpl.createArchive(ArchiveFactoryImpl.java:97)
      	at org.eclipse.persistence.internal.jpa.deployment.ArchiveFactoryImpl.createArchive(ArchiveFactoryImpl.java:61)
      	at org.eclipse.persistence.internal.jpa.metadata.MetadataProcessor.loadStandardMappingFiles(MetadataProcessor.java:472)
      	... 64 more
      ]
      
      	at org.apache.openejb.cts.deploy.StandardDeployment14.deploy(StandardDeployment14.java:238)
      	at com.sun.ts.lib.harness.SuiteSynchronizer.continueToDeployApps(SuiteSynchronizer.java:1104)
      	at com.sun.ts.lib.harness.SuiteSynchronizer.deployApps(SuiteSynchronizer.java:716)
      	at com.sun.ts.lib.harness.SuiteSynchronizer.doDeployment(SuiteSynchronizer.java:387)
      	at com.sun.ts.lib.harness.TSHarnessObserver.startingTest(TSHarnessObserver.java:367)
      	at com.sun.javatest.Harness$Notifier.startingTest(Harness.java:995)
      	at com.sun.javatest.TestRunner.notifyStartingTest(TestRunner.java:212)
      	at com.sun.javatest.DefaultTestRunner.runTest(DefaultTestRunner.java:167)
      	at com.sun.javatest.DefaultTestRunner.access$100(DefaultTestRunner.java:43)
      	at com.sun.javatest.DefaultTestRunner$1.run(DefaultTestRunner.java:66)
      04-11-2021 20:46:29:  Harness - harness.executeMode is set to "0"
      04-11-2021 20:46:29:  Harness - keywords (to be passed to tests) set to:  all
      04-11-2021 20:46:29:  Harness - sClassPathFromExecProps = ::
      command: com.sun.ts.lib.harness.ExecTSTestCmd CLASSPATH=:::/Users/dblevins/work/tcks/jakartaeetck-9.1.0-2021-03-24.1451/lib/jaxb-api.jar:/Users/dblevins/work/tcks/jakartaeetck-9.1.0-2021-03-24.1451/lib/jaxb-core.jar:/Users/dblevins/work/tcks/jakartaeetck-9.1.0-2021-03-24.1451/lib/jaxb-impl.jar:/Users/dblevins/work/tcks/jakartaeetck-9.1.0-2021-03-24.1451/lib/jaxb-xjc.jar:/Users/dblevins/work/tcks/jakartaeetck-9.1.0-2021-03-24.1451/lib/tsharness.jar:/Users/dblevins/work/tcks/jakartaeetck-9.1.0-2021-03-24.1451/lib/cts.jar:/Users/dblevins/work/tcks/jakartaeetck-9.1.0-2021-03-24.1451/lib/sigtest.jar:/Users/dblevins/work/apache/tomee-tck-ee91/target/apache-tomee-plume-9.0.0-M7-SNAPSHOT/lib/javaee-api-8.0-5.jar:/Users/dblevins/work/apache/tomee-tck-ee91/target/tomee-tck-8.0.7-SNAPSHOT.jar:/Users/dblevins/work/apache/tomee-tck-ee91/target/apache-tomee-plume-9.0.0-M7-SNAPSHOT/lib/openejb-core-8.0.7-SNAPSHOT.jar:/Users/dblevins/work/apache/tomee-tck-ee91/target/apache-tomee-plume-9.0.0-M7-SNAPSHOT/lib/openejb-core-eclipselink-8.0.7-SNAPSHOT.jar:/Users/dblevins/work/apache/tomee-tck-ee91/target/lib/activemq-client-5.16.0.jar:/Users/dblevins/work/apache/tomee-tck-ee91/target/lib/activemq-jdbc-store-5.16.1.jar:/Users/dblevins/work/apache/tomee-tck-ee91/target/lib/bval-jsr-2.0.5.jar:/Users/dblevins/work/apache/tomee-tck-ee91/target/lib/catalina.jar:/Users/dblevins/work/apache/tomee-tck-ee91/target/lib/commons-cli-1.4.jar:/Users/dblevins/work/apache/tomee-tck-ee91/target/lib/commons-collections-3.2.2.jar:/Users/dblevins/work/apache/tomee-tck-ee91/target/lib/commons-collections4-4.4.jar:/Users/dblevins/work/apache/tomee-tck-ee91/target/lib/commons-dbcp2-2.1.jar:/Users/dblevins/work/apache/tomee-tck-ee91/target/lib/commons-lang3-3.11.jar:/Users/dblevins/work/apache/tomee-tck-ee91/target/lib/commons-logging-1.2.jar:/Users/dblevins/work/apache/tomee-tck-ee91/target/lib/commons-pool2-2.3.jar:/Users/dblevins/work/apache/tomee-tck-ee91/target/lib/cts-9.1.jar:/Users/dblevins/work/apache/tomee-tck-ee91/target/lib/dbprocedures-9.1.jar:/Users/dblevins/work/apache/tomee-tck-ee91/target/lib/derby-10.14.2.0.jar:/Users/dblevins/work/apache/tomee-tck-ee91/target/lib/derbyclient-10.14.2.0.jar:/Users/dblevins/work/apache/tomee-tck-ee91/target/lib/derbynet-10.14.2.0.jar:/Users/dblevins/work/apache/tomee-tck-ee91/target/lib/eclipselink-3.0.0.jar:/Users/dblevins/work/apache/tomee-tck-ee91/target/lib/el-api.jar:/Users/dblevins/work/apache/tomee-tck-ee91/target/lib/geronimo-connector-3.1.4.jar:/Users/dblevins/work/apache/tomee-tck-ee91/target/lib/geronimo-javamail_1.6_mail-1.0.0.jar:/Users/dblevins/work/apache/tomee-tck-ee91/target/lib/geronimo-jms_1.1_spec-1.1.1.jar:/Users/dblevins/work/apache/tomee-tck-ee91/target/lib/geronimo-mail-2.0.2.jar:/Users/dblevins/work/apache/tomee-tck-ee91/target/lib/geronimo-transaction-3.1.4.jar:/Users/dblevins/work/apache/tomee-tck-ee91/target/lib/hawtbuf-1.11.jar:/Users/dblevins/work/apache/tomee-tck-ee91/target/lib/howl-1.0.1-1.jar:/Users/dblevins/work/apache/tomee-tck-ee91/target/lib/hsqldb-2.3.2.jar:/Users/dblevins/work/apache/tomee-tck-ee91/target/lib/istack-commons-runtime-3.0.11.jar:/Users/dblevins/work/apache/tomee-tck-ee91/target/lib/jackson-annotations-2.12.1.jar:/Users/dblevins/work/apache/tomee-tck-ee91/target/lib/jackson-core-2.12.1.jar:/Users/dblevins/work/apache/tomee-tck-ee91/target/lib/jackson-databind-2.12.1.jar:/Users/dblevins/work/apache/tomee-tck-ee91/target/lib/jakarta.activation-1.2.1.jar:/Users/dblevins/work/apache/tomee-tck-ee91/target/lib/jakarta.xml.bind-api-2.3.3.jar:/Users/dblevins/work/apache/tomee-tck-ee91/target/lib/jaspic-api.jar:/Users/dblevins/work/apache/tomee-tck-ee91/target/lib/javaee-api-8.0-5.jar:/Users/dblevins/work/apache/tomee-tck-ee91/target/lib/jaxb-runtime-2.3.3.jar:/Users/dblevins/work/apache/tomee-tck-ee91/target/lib/jsp-api.jar:/Users/dblevins/work/apache/tomee-tck-ee91/target/lib/mbean-annotation-api-8.0.7-SNAPSHOT.jar:/Users/dblevins/work/apache/tomee-tck-ee91/target/lib/openejb-api-8.0.7-SNAPSHOT.jar:/Users/dblevins/work/apache/tomee-tck-ee91/target/lib/openejb-core-8.0.7-SNAPSHOT.jar:/Users/dblevins/work/apache/tomee-tck-ee91/target/lib/openejb-core-eclipselink-8.0.7-SNAPSHOT.jar:/Users/dblevins/work/apache/tomee-tck-ee91/target/lib/openejb-javaagent-8.0.7-SNAPSHOT.jar:/Users/dblevins/work/apache/tomee-tck-ee91/target/lib/openejb-javaagent.jar:/Users/dblevins/work/apache/tomee-tck-ee91/target/lib/openejb-jee-8.0.7-SNAPSHOT.jar:/Users/dblevins/work/apache/tomee-tck-ee91/target/lib/openejb-jee-accessors-8.0.7-SNAPSHOT.jar:/Users/dblevins/work/apache/tomee-tck-ee91/target/lib/openejb-jpa-integration-8.0.7-SNAPSHOT.jar:/Users/dblevins/work/apache/tomee-tck-ee91/target/lib/openejb-loader-8.0.7-SNAPSHOT.jar:/Users/dblevins/work/apache/tomee-tck-ee91/target/lib/openjpa-3.1.2.jar:/Users/dblevins/work/apache/tomee-tck-ee91/target/lib/openwebbeans-ee-2.0.22.jar:/Users/dblevins/work/apache/tomee-tck-ee91/target/lib/openwebbeans-ee-common-2.0.22.jar:/Users/dblevins/work/apache/tomee-tck-ee91/target/lib/openwebbeans-ejb-2.0.22.jar:/Users/dblevins/work/apache/tomee-tck-ee91/target/lib/openwebbeans-el22-2.0.22.jar:/Users/dblevins/work/apache/tomee-tck-ee91/target/lib/openwebbeans-impl-2.0.22.jar:/Users/dblevins/work/apache/tomee-tck-ee91/target/lib/openwebbeans-spi-2.0.22.jar:/Users/dblevins/work/apache/tomee-tck-ee91/target/lib/openwebbeans-web-2.0.22.jar:/Users/dblevins/work/apache/tomee-tck-ee91/target/lib/quartz-openejb-shade-2.2.4.jar:/Users/dblevins/work/apache/tomee-tck-ee91/target/lib/serp-1.15.1.jar:/Users/dblevins/work/apache/tomee-tck-ee91/target/lib/servlet-api.jar:/Users/dblevins/work/apache/tomee-tck-ee91/target/lib/slf4j-api-1.7.21.jar:/Users/dblevins/work/apache/tomee-tck-ee91/target/lib/stax-ex-1.8.1.jar:/Users/dblevins/work/apache/tomee-tck-ee91/target/lib/swizzle-stream-1.6.2.jar:/Users/dblevins/work/apache/tomee-tck-ee91/target/lib/sxc-jaxb-core-0.8.jar:/Users/dblevins/work/apache/tomee-tck-ee91/target/lib/sxc-runtime-0.8.jar:/Users/dblevins/work/apache/tomee-tck-ee91/target/lib/tomcat-api.jar:/Users/dblevins/work/apache/tomee-tck-ee91/target/lib/tomcat-juli.jar:/Users/dblevins/work/apache/tomee-tck-ee91/target/lib/tomcat-util-scan.jar:/Users/dblevins/work/apache/tomee-tck-ee91/target/lib/tomcat-util.jar:/Users/dblevins/work/apache/tomee-tck-ee91/target/lib/tomcat-websocket.jar:/Users/dblevins/work/apache/tomee-tck-ee91/target/lib/tomee-catalina-8.0.7-SNAPSHOT.jar:/Users/dblevins/work/apache/tomee-tck-ee91/target/lib/tomee-security-8.0.7-SNAPSHOT.jar:/Users/dblevins/work/apache/tomee-tck-ee91/target/lib/tsharness-9.1.jar:/Users/dblevins/work/apache/tomee-tck-ee91/target/lib/tssv-9.1.jar:/Users/dblevins/work/apache/tomee-tck-ee91/target/lib/txw2-2.3.3.jar:/Users/dblevins/work/apache/tomee-tck-ee91/target/lib/websocket-api.jar:/Users/dblevins/work/apache/tomee-tck-ee91/target/lib/whitebox-9.1.jar:/Users/dblevins/work/apache/tomee-tck-ee91/target/lib/xbean-asm-util-4.18.jar:/Users/dblevins/work/apache/tomee-tck-ee91/target/lib/xbean-asm7-shaded-4.14.jar:/Users/dblevins/work/apache/tomee-tck-ee91/target/lib/xbean-asm8-shaded-4.17.jar:/Users/dblevins/work/apache/tomee-tck-ee91/target/lib/xbean-asm9-shaded-4.18.jar:/Users/dblevins/work/apache/tomee-tck-ee91/target/lib/xbean-bundleutils-4.14.jar:/Users/dblevins/work/apache/tomee-tck-ee91/target/lib/xbean-bundleutils-4.18.jar:/Users/dblevins/work/apache/tomee-tck-ee91/target/lib/xbean-finder-shaded-4.14.jar:/Users/dblevins/work/apache/tomee-tck-ee91/target/lib/xbean-finder-shaded-4.18.jar:/Users/dblevins/work/apache/tomee-tck-ee91/target/lib/xbean-naming-4.14.jar:/Users/dblevins/work/apache/tomee-tck-ee91/target/lib/xbean-naming-4.18.jar:/Users/dblevins/work/apache/tomee-tck-ee91/target/lib/xbean-reflect-4.14.jar:/Users/dblevins/work/apache/tomee-tck-ee91/target/lib/xbean-reflect-4.18.jar:/Users/dblevins/work/apache/tomee-tck-ee91/target/apache-tomee-plume-9.0.0-M7-SNAPSHOT/lib/commons-logging-1.2.jar:/Users/dblevins/work/apache/tomee-tck-ee91/target/apache-tomee-plume-9.0.0-M7-SNAPSHOT/lib/eclipselink-3.0.0.jar:/Users/dblevins/work/apache/tomee-tck-ee91/target/apache-tomee-plume-9.0.0-M7-SNAPSHOT/lib/derby-10.14.2.0.jar:/Users/dblevins/work/apache/tomee-tck-ee91/target/apache-tomee-plume-9.0.0-M7-SNAPSHOT/lib/derbyclient-10.14.2.0.jar:/Users/dblevins/work/apache/tomee-tck-ee91/target/apache-tomee-plume-9.0.0-M7-SNAPSHOT/lib/openejb-client-8.0.7-SNAPSHOT.jar:/Users/dblevins/work/tcks/jakartaeetck-9.1.0-2021-03-24.1451/lib/javatest.jar:/Users/dblevins/work/tcks/jakartaeetck-9.1.0-2021-03-24.1451/lib/tsharness.jar:/Users/dblevins/work/tcks/jakartaeetck-9.1.0-2021-03-24.1451/lib/cts.jar:/Users/dblevins/work/tcks/jakartaeetck-9.1.0-2021-03-24.1451/lib/dbprocedures.jar:/Users/dblevins/work/tcks/jakartaeetck-9.1.0-2021-03-24.1451/lib/commons-httpclient-3.1.jar:/Users/dblevins/work/tcks/jakartaeetck-9.1.0-2021-03-24.1451/lib/jdom-1.1.3.jar:/Users/dblevins/work/tcks/jakartaeetck-9.1.0-2021-03-24.1451/lib/jaxb-api.jar:/Users/dblevins/work/tcks/jakartaeetck-9.1.0-2021-03-24.1451/lib/jaxb-impl.jar:/Users/dblevins/work/tcks/jakartaeetck-9.1.0-2021-03-24.1451/lib/jaxb-xjc.jar:/Users/dblevins/work/apache/tomee-tck-ee91/target/apache-tomee-plume-9.0.0-M7-SNAPSHOT/lib/jasper-el.jar:/Users/dblevins/work/apache/tomee-tck-ee91/target/apache-tomee-plume-9.0.0-M7-SNAPSHOT/lib/cxf-rt-rs-client-3.4.3.jar:/Users/dblevins/work/apache/tomee-tck-ee91/target/apache-tomee-plume-9.0.0-M7-SNAPSHOT/lib/cxf-rt-transports-http-3.4.3.jar:/Users/dblevins/work/apache/tomee-tck-ee91/target/apache-tomee-plume-9.0.0-M7-SNAPSHOT/lib/cxf-core-3.4.3.jar:/Users/dblevins/work/apache/tomee-tck-ee91/target/apache-tomee-plume-9.0.0-M7-SNAPSHOT/lib/woodstox-core-6.2.4.jar:/Users/dblevins/work/apache/tomee-tck-ee91/target/apache-tomee-plume-9.0.0-M7-SNAPSHOT/lib/stax2-api-4.2.1.jar:/Users/dblevins/work/apache/tomee-tck-ee91/target/apache-tomee-plume-9.0.0-M7-SNAPSHOT/lib/xmlschema-core-2.2.5.jar:/Users/dblevins/work/apache/tomee-tck-ee91/target/apache-tomee-plume-9.0.0-M7-SNAPSHOT/lib/cxf-rt-frontend-jaxrs-3.4.3.jar:/Users/dblevins/work/apache/tomee-tck-ee91/target/apache-tomee-plume-9.0.0-M7-SNAPSHOT/lib/cxf-rt-rs-sse-3.4.3.jar:/Users/dblevins/work/apache/tomee-tck-ee91/target/apache-tomee-plume-9.0.0-M7-SNAPSHOT/lib/johnzon-core-1.2.10.jar:/Users/dblevins/work/apache/tomee-tck-ee91/target/apache-tomee-plume-9.0.0-M7-SNAPSHOT/lib/johnzon-jaxrs-1.2.10.jar:/Users/dblevins/work/apache/tomee-tck-ee91/target/apache-tomee-plume-9.0.0-M7-SNAPSHOT/lib/johnzon-jsonb-1.2.10.jar:/Users/dblevins/work/apache/tomee-tck-ee91/target/apache-tomee-plume-9.0.0-M7-SNAPSHOT/lib/johnzon-jsonp-strict-1.2.10.jar:/Users/dblevins/work/apache/tomee-tck-ee91/target/apache-tomee-plume-9.0.0-M7-SNAPSHOT/lib/johnzon-mapper-1.2.10.jar:/Users/dblevins/work/apache/tomee-tck-ee91/target/apache-tomee-plume-9.0.0-M7-SNAPSHOT/lib/tomcat-api.jar:/Users/dblevins/work/apache/tomee-tck-ee91/target/apache-tomee-plume-9.0.0-M7-SNAPSHOT/lib/tomcat-coyote.jar:/Users/dblevins/work/apache/tomee-tck-ee91/target/apache-tomee-plume-9.0.0-M7-SNAPSHOT/lib/tomcat-dbcp.jar:/Users/dblevins/work/apache/tomee-tck-ee91/target/apache-tomee-plume-9.0.0-M7-SNAPSHOT/lib/tomcat-i18n-cs.jar:/Users/dblevins/work/apache/tomee-tck-ee91/target/apache-tomee-plume-9.0.0-M7-SNAPSHOT/lib/tomcat-i18n-de.jar:/Users/dblevins/work/apache/tomee-tck-ee91/target/apache-tomee-plume-9.0.0-M7-SNAPSHOT/lib/tomcat-i18n-es.jar:/Users/dblevins/work/apache/tomee-tck-ee91/target/apache-tomee-plume-9.0.0-M7-SNAPSHOT/lib/tomcat-i18n-fr.jar:/Users/dblevins/work/apache/tomee-tck-ee91/target/apache-tomee-plume-9.0.0-M7-SNAPSHOT/lib/tomcat-i18n-ja.jar:/Users/dblevins/work/apache/tomee-tck-ee91/target/apache-tomee-plume-9.0.0-M7-SNAPSHOT/lib/tomcat-i18n-ko.jar:/Users/dblevins/work/apache/tomee-tck-ee91/target/apache-tomee-plume-9.0.0-M7-SNAPSHOT/lib/tomcat-i18n-pt-BR.jar:/Users/dblevins/work/apache/tomee-tck-ee91/target/apache-tomee-plume-9.0.0-M7-SNAPSHOT/lib/tomcat-i18n-ru.jar:/Users/dblevins/work/apache/tomee-tck-ee91/target/apache-tomee-plume-9.0.0-M7-SNAPSHOT/lib/tomcat-i18n-zh-CN.jar:/Users/dblevins/work/apache/tomee-tck-ee91/target/apache-tomee-plume-9.0.0-M7-SNAPSHOT/lib/tomcat-jdbc.jar:/Users/dblevins/work/apache/tomee-tck-ee91/target/apache-tomee-plume-9.0.0-M7-SNAPSHOT/lib/tomcat-jni.jar:/Users/dblevins/work/apache/tomee-tck-ee91/target/apache-tomee-plume-9.0.0-M7-SNAPSHOT/lib/tomcat-util-scan.jar:/Users/dblevins/work/apache/tomee-tck-ee91/target/apache-tomee-plume-9.0.0-M7-SNAPSHOT/lib/tomcat-util.jar:/Users/dblevins/work/apache/tomee-tck-ee91/target/apache-tomee-plume-9.0.0-M7-SNAPSHOT/lib/tomcat-websocket.jar:/Users/dblevins/work/tcks/jakartaeetck-9.1.0-2021-03-24.1451/lib/javatest.jar:/Users/dblevins/work/tcks/jakartaeetck-9.1.0-2021-03-24.1451/lib/jdom-1.1.3.jar:/lib/ant.jar:/Users/dblevins/work/tckfun/glassfish6/glassfish/modules/admin-cli.jar:/Users/dblevins/work/tcks/jakartaeetck-9.1.0-2021-03-24.1451/lib/http.jar:/Users/dblevins/work/tcks/jakartaeetck-9.1.0-2021-03-24.1451/lib/glassfishporting.jar:/Users/dblevins/work/tckfun/glassfish6/glassfish/modules/jakarta.activation-api.jar:/Users/dblevins/work/tcks/jakartaeetck-9.1.0-2021-03-24.1451/classes:/Library/Java/JavaVirtualMachines/jdk1.8.0_151.jdk/Contents/Home/jre/../lib/tools.jar:/Users/dblevins/work/tcks/jakartaeetck-9.1.0-2021-03-24.1451/lib/commons-httpclient-3.1.jar:/Users/dblevins/work/tcks/jakartaeetck-9.1.0-2021-03-24.1451/lib/commons-logging-1.1.3.jar:/Users/dblevins/work/tcks/jakartaeetck-9.1.0-2021-03-24.1451/lib/commons-codec-1.9.jar:/Users/dblevins/work/tcks/jakartaeetck-9.1.0-2021-03-24.1451/lib/cssparser-0.9.25.jar:/Users/dblevins/work/tcks/jakartaeetck-9.1.0-2021-03-24.1451/lib/htmlunit-2.15.jar:/Users/dblevins/work/tcks/jakartaeetck-9.1.0-2021-03-24.1451/lib/htmlunit-core-js-2.15.jar:/Users/dblevins/work/tcks/jakartaeetck-9.1.0-2021-03-24.1451/lib/httpclient-4.5.5.jar:/Users/dblevins/work/tcks/jakartaeetck-9.1.0-2021-03-24.1451/lib/httpmime-4.5.5.jar:/Users/dblevins/work/tcks/jakartaeetck-9.1.0-2021-03-24.1451/lib/httpcore-4.4.9.jar:/Users/dblevins/work/tcks/jakartaeetck-9.1.0-2021-03-24.1451/lib/commons-collections-3.2.1.jar:/Users/dblevins/work/tcks/jakartaeetck-9.1.0-2021-03-24.1451/lib/commons-io-2.4.jar:/Users/dblevins/work/tcks/jakartaeetck-9.1.0-2021-03-24.1451/lib/commons-lang3-3.3.2.jar:/Users/dblevins/work/tcks/jakartaeetck-9.1.0-2021-03-24.1451/lib/jaxen-1.1.6.jar:/Users/dblevins/work/tcks/jakartaeetck-9.1.0-2021-03-24.1451/lib/jaxen-core-1.0.jar:/Users/dblevins/work/tcks/jakartaeetck-9.1.0-2021-03-24.1451/lib/js-1.6R1.jar:/Users/dblevins/work/tcks/jakartaeetck-9.1.0-2021-03-24.1451/lib/nekohtml-1.9.21.jar:/Users/dblevins/work/tcks/jakartaeetck-9.1.0-2021-03-24.1451/lib/sac-1.3.jar:/Users/dblevins/work/tcks/jakartaeetck-9.1.0-2021-03-24.1451/lib/saxpath.jar:/Users/dblevins/work/tcks/jakartaeetck-9.1.0-2021-03-24.1451/lib/xercesImpl-2.11.0.jar:/Users/dblevins/work/tcks/jakartaeetck-9.1.0-2021-03-24.1451/lib/xalan-2.7.2.jar:/Users/dblevins/work/tcks/jakartaeetck-9.1.0-2021-03-24.1451/lib/tssv.jar:/Users/dblevins/work/tcks/jakartaeetck-9.1.0-2021-03-24.1451/lib/xml-apis-1.4.01.jar DISPLAY=:0.0 HOME=/Users/dblevins windir= SYSTEMROOT= PATH=/Users/dblevins/work/tckfun/glassfish6/glassfish/nativelib /Library/Java/JavaVirtualMachines/jdk1.8.0_151.jdk/Contents/Home/jre/bin/java -Dcts.tmp=/Users/dblevins/work/apache/tomee-tck-ee91/./target/harnesstmp/ -Djava.protocol.handler.pkgs=javax.net.ssl -Djavax.net.ssl.keyStore=/Users/dblevins/work/apache/tomee-tck-ee91/./src/test/keystores/clientcert.jks -Djavax.net.ssl.keyStorePassword=changeit -Djavax.net.ssl.trustStore=/Users/dblevins/work/apache/tomee-tck-ee91/./src/test/keystores/ssl-truststore -Djavax.net.ssl.trustStorePassword=changeit -Djava.endorsed.dirs=/Users/dblevins/work/tckfun/glassfish6/glassfish/modules/endorsed:/Users/dblevins/work/tcks/jakartaeetck-9.1.0-2021-03-24.1451/endorsedlib -Dcom.sun.aas.installRoot=/Users/dblevins/work/tckfun/glassfish6/glassfish -Dcatalina.base=target/apache-tomee-plume-9.0.0-M7-SNAPSHOT -Dlog.file.location=/Users/dblevins/work/apache/tomee-tck-ee91/./target/apache-tomee-plume-9.0.0-M7-SNAPSHOT/logs -Dservlet.is.jsr115.compatible=false -Dprovider.configuration.file=/Users/dblevins/work/apache/tomee-tck-ee91/./target/apache-tomee-plume-9.0.0-M7-SNAPSHOT/conf/ProviderConfiguration.xml -Dlogical.hostname.servlet=Catalina/localhost -Dcom.sun.aas.configRoot=/Users/dblevins/work/tckfun/glassfish6/glassfish/config -Ddeliverable.class=com.sun.ts.lib.deliverable.cts.CTSDeliverable -Dopenejb.validation.output.level=3 com.sun.ts.tests.common.vehicle.VehicleClient -p /Users/dblevins/work/apache/tomee-tck-ee91/./target/harnesstmp//tmp/tstest.jte -t JarFileElementsTest -vehicle pmservlet
      ************************************************************
      * props file set to "/var/folders/bd/f9ntqy1m8xj_fs006s6crtjh0000gn/T/dblevins-cts-props.txt"
      ************************************************************
      04-11-2021 20:46:29:  TRACE: #######  Value of harness.socket.retry.count is "10"
      04-11-2021 20:46:29:  TRACE: #######  Value of harness.log.port is "53513"
      04-11-2021 20:46:29:  TRACE: #######  Actual bind value of harness.log.port is "53513"
      04-11-2021 20:46:29:  TRACE: in ServiceEETest.run() method
      04-11-2021 20:46:29:  TRACE: Vehicle to be used for this test is:  pmservlet
      04-11-2021 20:46:29:  Opened connection to http://localhost:53507/jpa_ee_packaging_jar_pmservlet_vehicle_web/pmservlet_vehicle
      04-11-2021 20:46:29:  TRACE: got outputstream
      04-11-2021 20:46:29:  TRACE: wrote objects to the pmservlet vehicle
      java.io.FileNotFoundException: http://localhost:53507/jpa_ee_packaging_jar_pmservlet_vehicle_web/pmservlet_vehicle
      	at sun.net.www.protocol.http.HttpURLConnection.getInputStream0(HttpURLConnection.java:1890)
      	at sun.net.www.protocol.http.HttpURLConnection.getInputStream(HttpURLConnection.java:1492)
      	at com.sun.ts.tests.common.vehicle.web.WebVehicleRunner.runWebVehicleTest(WebVehicleRunner.java:150)
      	at com.sun.ts.tests.common.vehicle.pmservlet.PMServletVehicleRunner.run(PMServletVehicleRunner.java:30)
      	at com.sun.ts.tests.common.vehicle.web.WebVehicleRunner.run(WebVehicleRunner.java:81)
      	at com.sun.ts.lib.harness.ServiceEETest.run(ServiceEETest.java:105)
      	at com.sun.ts.lib.harness.EETest.getPropsReady(EETest.java:486)
      	at com.sun.ts.lib.harness.ServiceEETest.run(ServiceEETest.java:209)
      	at com.sun.ts.lib.harness.EETest.run(EETest.java:285)
      	at com.sun.ts.tests.common.vehicle.VehicleClient.main(VehicleClient.java:37)
      04-11-2021 20:46:29:  Test: returning from running in a pmservlet vehicle
      04-11-2021 20:46:30:  TRACE: SLEPT FOR:  1000
      STATUS:Failed.Fatal: Problem with connection: java.io.FileNotFoundException: http://localhost:53507/jpa_ee_packaging_jar_pmservlet_vehicle_web/pmservlet_vehicle
      Failed. Fatal: Problem with connection: java.io.FileNotFoundException: http://localhost:53507/jpa_ee_packaging_jar_pmservlet_vehicle_web/pmservlet_vehicle
      ********************************************************************************
      Finished Test:  FAILED........com/sun/ts/tests/jpa/ee/packaging/jar/Client.java#JarFileElementsTest_from_pmservlet
      

      For tips on debugging/fixing tests, see https://github.com/apache/tomee-tck/blob/master/DEBUGGING.adoc

      If you have any thoughts about what the test is expecting/testing, please add them to the comments.

        Attachments

          Activity

            People

            • Assignee:
              jlmonteiro Jean-Louis Monteiro
              Reporter:
              dblevins David Blevins
            • Votes:
              0 Vote for this issue
              Watchers:
              2 Start watching this issue

              Dates

              • Created:
                Updated:
                Resolved: