Uploaded image for project: 'TomEE'
  1. TomEE
  2. TOMEE-3140 Jakarta EE 9.1 TCK Failures
  3. TOMEE-3189

jaxrs.spec.provider.standardnotnull serverFileProviderTest

    XMLWordPrintableJSON

    Details

    • Type: Sub-task
    • Status: Resolved
    • Priority: Major
    • Resolution: Fixed
    • Affects Version/s: None
    • Fix Version/s: 9.0.0-M7
    • Component/s: None
    • Labels:
      None

      Description

      Follow setup instructions in TOMEE-3140. Then run:

      ./runtests --ee91 -c -j --web tomee-plume com.sun.ts.tests.jaxrs.spec.provider.standardnotnull.JAXRSClient#serverFileProviderTest_from_standalone
      

      At the time this issue was filed, the test failed with the following in target/logs/javatest.log

      04-11-2021 20:41:15:  TRACE: GOT SETUP METHOD!
      04-11-2021 20:41:15:  TRACE: No cleanupMethod annotation present
      04-11-2021 20:41:15:  TRACE: getCleanupMethod - checking for testcase specific cleanup method:  serverFileProviderTest_cleanup
      04-11-2021 20:41:15:  TRACE: getCleanupMethod - checking for default class specific cleanup method
      04-11-2021 20:41:15:  TRACE: GOT CLEANUP METHOD!
      04-11-2021 20:41:15:  TRACE: ABOUT TO INVOKE SETUP METHOD!
      04-11-2021 20:41:15:  TRACE: setup method JAXRSCommonClient
      04-11-2021 20:41:15:  [JAXRSCommonClient] Test setup OK
      04-11-2021 20:41:15:  TRACE: INVOKED SETUP METHOD!
      04-11-2021 20:41:15:  TRACE: ABOUT TO INVOKE EETEST RUN METHOD!
      04-11-2021 20:41:15:  TRACE: [JAXRSCommonClient] invoke
      04-11-2021 20:41:15:  TRACE: [JAXRSCommonClient] setTestProperties
      04-11-2021 20:41:15:  TRACE: [JAXRSCommonClient] EXECUTING
      04-11-2021 20:41:15:  [Request] Dispatching request: 'POST http://localhost:52891/jaxrs_spec_provider_standardnotnull_web/resource/file' to target server at 'localhost:52891'
      04-11-2021 20:41:15:  ###############################
      04-11-2021 20:41:15:  TRACE: [WIRE] - >> POST http://localhost:52891/jaxrs_spec_provider_standardnotnull_web/resource/file
      04-11-2021 20:41:15:  TRACE: [WIRE] - >> Accept:*/*
      11-Apr-2021 20:41:15.724 WARNING [http-nio-52891-exec-5] org.apache.cxf.jaxrs.impl.WebApplicationExceptionMapper.toResponse jakarta.ws.rs.BadRequestException: HTTP 400 Bad Request
      	at org.apache.cxf.jaxrs.utils.SpecExceptions.toBadRequestException(SpecExceptions.java:84)
      	at org.apache.cxf.jaxrs.utils.ExceptionUtils.toBadRequestException(ExceptionUtils.java:120)
      	at org.apache.cxf.jaxrs.utils.JAXRSUtils.readFromMessageBody(JAXRSUtils.java:1396)
      	at org.apache.cxf.jaxrs.utils.JAXRSUtils.processRequestBodyParameter(JAXRSUtils.java:901)
      	at org.apache.cxf.jaxrs.utils.JAXRSUtils.processParameters(JAXRSUtils.java:832)
      	at org.apache.cxf.jaxrs.interceptor.JAXRSInInterceptor.processRequest(JAXRSInInterceptor.java:215)
      	at org.apache.cxf.jaxrs.interceptor.JAXRSInInterceptor.handleMessage(JAXRSInInterceptor.java:79)
      	at org.apache.cxf.phase.PhaseInterceptorChain.doIntercept(PhaseInterceptorChain.java:308)
      	at org.apache.cxf.transport.ChainInitiationObserver.onMessage(ChainInitiationObserver.java:121)
      	at org.apache.cxf.transport.http.AbstractHTTPDestination.invoke(AbstractHTTPDestination.java:265)
      	at org.apache.openejb.server.cxf.rs.CxfRsHttpListener.doInvoke(CxfRsHttpListener.java:271)
      	at org.apache.tomee.webservices.CXFJAXRSFilter.doFilter(CXFJAXRSFilter.java:99)
      	at org.apache.catalina.core.ApplicationFilterChain.internalDoFilter(ApplicationFilterChain.java:185)
      	at org.apache.catalina.core.ApplicationFilterChain.doFilter(ApplicationFilterChain.java:158)
      	at org.apache.tomcat.websocket.server.WsFilter.doFilter(WsFilter.java:53)
      	at org.apache.catalina.core.ApplicationFilterChain.internalDoFilter(ApplicationFilterChain.java:185)
      	at org.apache.catalina.core.ApplicationFilterChain.doFilter(ApplicationFilterChain.java:158)
      	at org.apache.catalina.core.StandardWrapperValve.invoke(StandardWrapperValve.java:202)
      	at org.apache.catalina.core.StandardContextValve.invoke(StandardContextValve.java:97)
      	at org.apache.tomee.catalina.OpenEJBValve.invoke(OpenEJBValve.java:45)
      	at org.apache.catalina.authenticator.AuthenticatorBase.invoke(AuthenticatorBase.java:543)
      	at org.apache.openejb.cts.TransactionalWorkaroundLeakGuardValve.invoke(TransactionalWorkaroundLeakGuardValve.java:39)
      	at org.apache.catalina.core.StandardHostValve.invoke(StandardHostValve.java:127)
      	at org.apache.catalina.valves.ErrorReportValve.invoke(ErrorReportValve.java:92)
      	at org.apache.tomee.catalina.OpenEJBSecurityListener$RequestCapturer.invoke(OpenEJBSecurityListener.java:97)
      	at org.apache.catalina.valves.AbstractAccessLogValve.invoke(AbstractAccessLogValve.java:690)
      	at org.apache.catalina.core.StandardEngineValve.invoke(StandardEngineValve.java:78)
      	at org.apache.catalina.connector.CoyoteAdapter.service(CoyoteAdapter.java:353)
      	at org.apache.coyote.http11.Http11Processor.service(Http11Processor.java:374)
      	at org.apache.coyote.AbstractProcessorLight.process(AbstractProcessorLight.java:65)
      	at org.apache.coyote.AbstractProtocol$ConnectionHandler.process(AbstractProtocol.java:870)
      	at org.apache.tomcat.util.net.NioEndpoint$SocketProcessor.doRun(NioEndpoint.java:1696)
      	at org.apache.tomcat.util.net.SocketProcessorBase.run(SocketProcessorBase.java:49)
      	at java.util.concurrent.ThreadPoolExecutor.runWorker(ThreadPoolExecutor.java:1149)
      	at java.util.concurrent.ThreadPoolExecutor$Worker.run(ThreadPoolExecutor.java:624)
      	at org.apache.tomcat.util.threads.TaskThread$WrappingRunnable.run(TaskThread.java:61)
      	at java.lang.Thread.run(Thread.java:748)
      Caused by: jakarta.ws.rs.core.NoContentException: org.apache.johnzon.core.JsonReaderImpl$NothingToRead: Nothing to read
      	at org.apache.johnzon.jaxrs.jsonb.jaxrs.JsonbJaxrsProvider.doReadWithNoContentException(JsonbJaxrsProvider.java:335)
      	at org.apache.johnzon.jaxrs.jsonb.jaxrs.JsonbJaxrsProvider.readFrom(JsonbJaxrsProvider.java:271)
      	at org.apache.cxf.jaxrs.utils.JAXRSUtils.readFromMessageBodyReader(JAXRSUtils.java:1435)
      	at org.apache.cxf.jaxrs.utils.JAXRSUtils.readFromMessageBody(JAXRSUtils.java:1387)
      	... 34 more
      Caused by: org.apache.johnzon.core.JsonReaderImpl$NothingToRead: Nothing to read
      	at org.apache.johnzon.core.JsonReaderImpl.readValue(JsonReaderImpl.java:75)
      	at org.apache.johnzon.mapper.MappingParserImpl.readObject(MappingParserImpl.java:132)
      	at org.apache.johnzon.mapper.Mapper.mapObject(Mapper.java:398)
      	at org.apache.johnzon.mapper.Mapper.readObject(Mapper.java:313)
      	at org.apache.johnzon.jsonb.JohnzonJsonb.fromJson(JohnzonJsonb.java:244)
      	at org.apache.johnzon.jaxrs.jsonb.jaxrs.JsonbJaxrsProvider.doRead(JsonbJaxrsProvider.java:325)
      	at org.apache.johnzon.jaxrs.jsonb.jaxrs.JsonbJaxrsProvider.doReadWithNoContentException(JsonbJaxrsProvider.java:330)
      	... 37 more
      
      04-11-2021 20:41:15:  TRACE: [WIRE] - << 400 BAD_REQUEST
      04-11-2021 20:41:15:  TRACE: [WIRE] - << connection: close
      04-11-2021 20:41:15:  TRACE: [WIRE] - << Content-Length: 0
      04-11-2021 20:41:15:  TRACE: [WIRE] - << Date: Mon, 12 Apr 2021 03:41:15 GMT
      04-11-2021 20:41:15:  ERROR: [WebValidatorBase] Unexpected Status Code recieved from server.  Expected '200' received '400'
      04-11-2021 20:41:15:  ERROR: Test case throws exception: [JAXRSCommonClient] null failed! Check output for cause of failure.
      04-11-2021 20:41:15:  ERROR: Exception at:  
      04-11-2021 20:41:15:  ERROR: com.sun.ts.tests.common.webclient.TestFailureException: Test FAILED!
      	at com.sun.ts.tests.jaxrs.common.client.JaxrsWebTestCase.execute(JaxrsWebTestCase.java:219)
      	at com.sun.ts.tests.jaxrs.common.client.JaxrsCommonClient.invoke(JaxrsCommonClient.java:210)
      	at com.sun.ts.tests.jaxrs.spec.provider.standardnotnull.JAXRSClient.serverFileProviderTest(JAXRSClient.java:237)
      	at sun.reflect.NativeMethodAccessorImpl.invoke0(Native Method)
      	at sun.reflect.NativeMethodAccessorImpl.invoke(NativeMethodAccessorImpl.java:62)
      	at sun.reflect.DelegatingMethodAccessorImpl.invoke(DelegatingMethodAccessorImpl.java:43)
      	at java.lang.reflect.Method.invoke(Method.java:498)
      	at com.sun.ts.lib.harness.EETest.run(EETest.java:596)
      	at com.sun.ts.lib.harness.ServiceEETest.run(ServiceEETest.java:115)
      	at com.sun.ts.tests.common.vehicle.EmptyVehicleRunner.run(EmptyVehicleRunner.java:41)
      	at com.sun.ts.lib.harness.ServiceEETest.run(ServiceEETest.java:105)
      	at com.sun.ts.lib.harness.EETest.getPropsReady(EETest.java:486)
      	at com.sun.ts.lib.harness.ServiceEETest.run(ServiceEETest.java:209)
      	at com.sun.ts.lib.harness.EETest.run(EETest.java:285)
      	at com.sun.ts.tests.common.vehicle.VehicleClient.main(VehicleClient.java:37)
      
      04-11-2021 20:41:15:  [JAXRSCommonClient] Test cleanup OK
      04-11-2021 20:41:16:  TRACE: SLEPT FOR:  1000
      STATUS:Failed.Test case throws exception: [JAXRSCommonClient] null failed! Check output for cause of failure.
      Failed. Test case throws exception: [JAXRSCommonClient] null failed! Check output for cause of failure.
      ********************************************************************************
      Finished Test:  FAILED........com/sun/ts/tests/jaxrs/spec/provider/standardnotnull/JAXRSClient.java#serverFileProviderTest_from_standalone
      

      For tips on debugging/fixing tests, see https://github.com/apache/tomee-tck/blob/master/DEBUGGING.adoc

      If you have any thoughts about what the test is expecting/testing, please add them to the comments.

        Attachments

          Activity

            People

            • Assignee:
              dblevins David Blevins
              Reporter:
              dblevins David Blevins
            • Votes:
              0 Vote for this issue
              Watchers:
              1 Start watching this issue

              Dates

              • Created:
                Updated:
                Resolved: