Uploaded image for project: 'Thrift'
  1. Thrift
  2. THRIFT-2137

Ruby test lib fails jenkins build #864

    XMLWordPrintableJSON

    Details

    • Type: Bug
    • Status: Closed
    • Priority: Major
    • Resolution: Fixed
    • Affects Version/s: 0.9.1
    • Fix Version/s: 0.9.1
    • Component/s: Ruby - Library
    • Labels:
      None

      Description

      /usr/bin/ruby -I. test_suite.rb
      ./core/../../../lib/rb/lib/thrift/server/thin_http_server.rb:20:in `require': no such file to load – rack (LoadError)
      from ./core/../../../lib/rb/lib/thrift/server/thin_http_server.rb:20
      from ./core/../../../lib/rb/lib/thrift.rb:65:in `require'
      from ./core/../../../lib/rb/lib/thrift.rb:65
      from ./core/test_backwards_compatability.rb:22:in `require'
      from ./core/test_backwards_compatability.rb:22
      from test_suite.rb:20:in `require'
      from test_suite.rb:20
      from test_suite.rb:20:in `each'
      from test_suite.rb:20
      make[2]: *** [check] Error 1
      make[2]: Leaving directory `/home/hudson/jenkins-slave/workspace/Thrift/test/rb'
      make[1]: *** [check-recursive] Error 1
      make[1]: Leaving directory `/home/hudson/jenkins-slave/workspace/Thrift/test'
      make: *** [check-recursive] Error 1
      Build step 'Execute shell' marked build as failure

        Attachments

          Activity

            People

            • Assignee:
              jfarrell Jake Farrell
              Reporter:
              jfarrell Jake Farrell
            • Votes:
              0 Vote for this issue
              Watchers:
              2 Start watching this issue

              Dates

              • Created:
                Updated:
                Resolved: