Uploaded image for project: 'Tapestry 5'
  1. Tapestry 5
  2. TAP5-1682

5.3-beta-x Maven Archetype does not work

    Details

    • Type: Bug
    • Status: Closed
    • Priority: Major
    • Resolution: Fixed
    • Affects Version/s: 5.3
    • Fix Version/s: 5.3
    • Component/s: quickstart
    • Labels:
      None

      Description

      $ mvn -DarchetypeCatalog=http://tapestry.apache.org -DarchetypeRepository=https://repository.apache.org/content/groups/staging/ archetype:generate
      [INFO] Scanning for projects...
      [INFO]
      [INFO] ------------------------------------------------------------------------
      [INFO] Building Maven Stub Project (No POM) 1
      [INFO] ------------------------------------------------------------------------
      [INFO]
      [INFO] >>> maven-archetype-plugin:2.1:generate (default-cli) @ standalone-pom >>>
      [INFO]
      [INFO] <<< maven-archetype-plugin:2.1:generate (default-cli) @ standalone-pom <<<
      [INFO]
      [INFO] — maven-archetype-plugin:2.1:generate (default-cli) @ standalone-pom —
      [INFO] Generating project in Interactive mode
      [INFO] No archetype defined. Using maven-archetype-quickstart (org.apache.maven.archetypes:maven-archetype-quickstart:1.0)
      Choose archetype:
      1: http://tapestry.apache.org -> org.apache.tapestry:quickstart (Tapestry Quickstart Project)
      2: http://tapestry.apache.org -> org.apache.tapestry:tapestry-archetype (Tapestry 4.1.6 Archetype)
      Choose a number or apply filter (format: [groupId:]artifactId, case sensitive contains): : 1
      Choose version:
      1: 5.0.19
      2: 5.1.0.5
      3: 5.2.6
      4: 5.3-beta-9
      Choose a number: 4: 4
      [INFO] ------------------------------------------------------------------------
      [INFO] BUILD FAILURE
      [INFO] ------------------------------------------------------------------------
      [INFO] Total time: 8.504s
      [INFO] Finished at: Wed Oct 05 13:19:19 PDT 2011
      [INFO] Final Memory: 7M/81M
      [INFO] ------------------------------------------------------------------------
      [ERROR] Failed to execute goal org.apache.maven.plugins:maven-archetype-plugin:2.1:generate (default-cli) on project standalone-pom: The defined artifact is not an archetype -> [Help 1]
      [ERROR]
      [ERROR] To see the full stack trace of the errors, re-run Maven with the -e switch.
      [ERROR] Re-run Maven using the -X switch to enable full debug logging.
      [ERROR]
      [ERROR] For more information about the errors and possible solutions, please read the following articles:
      [ERROR] [Help 1] http://cwiki.apache.org/confluence/display/MAVEN/MojoFailureException
      ~/workspaces/heroku
      $

        Attachments

          Activity

            People

            • Assignee:
              hlship Howard M. Lewis Ship
              Reporter:
              hlship Howard M. Lewis Ship
            • Votes:
              0 Vote for this issue
              Watchers:
              1 Start watching this issue

              Dates

              • Created:
                Updated:
                Resolved: