Uploaded image for project: 'Tajo'
  1. Tajo
  2. TAJO-1317

Parallel Test Executions on Tajo Core Project

    Details

    • Type: Improvement
    • Status: Resolved
    • Priority: Minor
    • Resolution: Fixed
    • Affects Version/s: 0.10.0
    • Fix Version/s: 0.10.0
    • Component/s: None
    • Labels:
      None

      Description

      Number of test-cases on Tajo core project has been increased, and its test time has always been increased as test-cases increased. Parallel test execution will be a good try to reduce test time, and test process uses less than 20 percentages of cpu time and we can use more.

        Issue Links

          Activity

          Hide
          hudson Hudson added a comment -

          FAILURE: Integrated in Tajo-master-CODEGEN-build #213 (See https://builds.apache.org/job/Tajo-master-CODEGEN-build/213/)
          TAJO-1317: Parallel Test Executions on Tajo Core Project (jihun: rev e9cd25a6cdf9d5359d84703a63600c312688d755)

          • tajo-core/src/test/java/org/apache/tajo/engine/planner/physical/TestRightOuterHashJoinExec.java
          • tajo-core/src/test/java/org/apache/tajo/engine/planner/physical/TestHashSemiJoinExec.java
          • tajo-core/src/test/java/org/apache/tajo/engine/planner/physical/TestPhysicalPlanner.java
          • tajo-core/src/test/java/org/apache/tajo/engine/planner/physical/TestBSTIndexExec.java
          • tajo-core/pom.xml
          • tajo-core/src/test/java/org/apache/tajo/engine/planner/physical/TestFullOuterHashJoinExec.java
          • .travis.yml
          • tajo-core/src/test/java/org/apache/tajo/engine/planner/physical/TestSortExec.java
          • tajo-core/src/test/java/org/apache/tajo/client/TestTajoClient.java
          • tajo-core/src/test/java/org/apache/tajo/engine/planner/global/TestBroadcastJoinPlan.java
          • tajo-core/src/test/java/org/apache/tajo/engine/planner/physical/TestFullOuterMergeJoinExec.java
          • tajo-core/src/test/java/org/apache/tajo/TajoTestingCluster.java
          • tajo-core/src/test/java/org/apache/tajo/engine/planner/physical/TestMergeJoinExec.java
          • tajo-core/src/test/java/org/apache/tajo/worker/TestFetcher.java
          • tajo-core/src/test/java/org/apache/tajo/engine/planner/physical/TestLeftOuterNLJoinExec.java
          • tajo-core/src/test/java/org/apache/tajo/engine/planner/physical/TestExternalSortExec.java
          • tajo-core/src/test/java/org/apache/tajo/engine/planner/physical/TestNLJoinExec.java
          • CHANGES
          • tajo-core/src/test/java/org/apache/tajo/engine/planner/physical/TestBNLJoinExec.java
          • tajo-core/src/test/java/org/apache/tajo/engine/planner/physical/TestRightOuterMergeJoinExec.java
          • tajo-project/pom.xml
          • tajo-core/src/test/java/org/apache/tajo/engine/planner/physical/TestHashJoinExec.java
          • tajo-core/src/test/java/org/apache/tajo/engine/planner/physical/TestLeftOuterHashJoinExec.java
          • tajo-core/src/test/java/org/apache/tajo/engine/planner/physical/TestProgressExternalSortExec.java
          • tajo-core/src/test/java/org/apache/tajo/engine/planner/physical/TestHashAntiJoinExec.java
          Show
          hudson Hudson added a comment - FAILURE: Integrated in Tajo-master-CODEGEN-build #213 (See https://builds.apache.org/job/Tajo-master-CODEGEN-build/213/ ) TAJO-1317 : Parallel Test Executions on Tajo Core Project (jihun: rev e9cd25a6cdf9d5359d84703a63600c312688d755) tajo-core/src/test/java/org/apache/tajo/engine/planner/physical/TestRightOuterHashJoinExec.java tajo-core/src/test/java/org/apache/tajo/engine/planner/physical/TestHashSemiJoinExec.java tajo-core/src/test/java/org/apache/tajo/engine/planner/physical/TestPhysicalPlanner.java tajo-core/src/test/java/org/apache/tajo/engine/planner/physical/TestBSTIndexExec.java tajo-core/pom.xml tajo-core/src/test/java/org/apache/tajo/engine/planner/physical/TestFullOuterHashJoinExec.java .travis.yml tajo-core/src/test/java/org/apache/tajo/engine/planner/physical/TestSortExec.java tajo-core/src/test/java/org/apache/tajo/client/TestTajoClient.java tajo-core/src/test/java/org/apache/tajo/engine/planner/global/TestBroadcastJoinPlan.java tajo-core/src/test/java/org/apache/tajo/engine/planner/physical/TestFullOuterMergeJoinExec.java tajo-core/src/test/java/org/apache/tajo/TajoTestingCluster.java tajo-core/src/test/java/org/apache/tajo/engine/planner/physical/TestMergeJoinExec.java tajo-core/src/test/java/org/apache/tajo/worker/TestFetcher.java tajo-core/src/test/java/org/apache/tajo/engine/planner/physical/TestLeftOuterNLJoinExec.java tajo-core/src/test/java/org/apache/tajo/engine/planner/physical/TestExternalSortExec.java tajo-core/src/test/java/org/apache/tajo/engine/planner/physical/TestNLJoinExec.java CHANGES tajo-core/src/test/java/org/apache/tajo/engine/planner/physical/TestBNLJoinExec.java tajo-core/src/test/java/org/apache/tajo/engine/planner/physical/TestRightOuterMergeJoinExec.java tajo-project/pom.xml tajo-core/src/test/java/org/apache/tajo/engine/planner/physical/TestHashJoinExec.java tajo-core/src/test/java/org/apache/tajo/engine/planner/physical/TestLeftOuterHashJoinExec.java tajo-core/src/test/java/org/apache/tajo/engine/planner/physical/TestProgressExternalSortExec.java tajo-core/src/test/java/org/apache/tajo/engine/planner/physical/TestHashAntiJoinExec.java
          Hide
          hudson Hudson added a comment -

          FAILURE: Integrated in Tajo-master-build #574 (See https://builds.apache.org/job/Tajo-master-build/574/)
          TAJO-1317: Parallel Test Executions on Tajo Core Project (jihun: rev e9cd25a6cdf9d5359d84703a63600c312688d755)

          • tajo-core/src/test/java/org/apache/tajo/engine/planner/physical/TestRightOuterHashJoinExec.java
          • tajo-core/src/test/java/org/apache/tajo/engine/planner/global/TestBroadcastJoinPlan.java
          • tajo-core/src/test/java/org/apache/tajo/client/TestTajoClient.java
          • tajo-core/src/test/java/org/apache/tajo/engine/planner/physical/TestFullOuterMergeJoinExec.java
          • tajo-project/pom.xml
          • tajo-core/pom.xml
          • tajo-core/src/test/java/org/apache/tajo/TajoTestingCluster.java
          • tajo-core/src/test/java/org/apache/tajo/engine/planner/physical/TestExternalSortExec.java
          • tajo-core/src/test/java/org/apache/tajo/engine/planner/physical/TestProgressExternalSortExec.java
          • tajo-core/src/test/java/org/apache/tajo/engine/planner/physical/TestBSTIndexExec.java
          • tajo-core/src/test/java/org/apache/tajo/engine/planner/physical/TestPhysicalPlanner.java
          • tajo-core/src/test/java/org/apache/tajo/engine/planner/physical/TestNLJoinExec.java
          • tajo-core/src/test/java/org/apache/tajo/engine/planner/physical/TestFullOuterHashJoinExec.java
          • tajo-core/src/test/java/org/apache/tajo/worker/TestFetcher.java
          • tajo-core/src/test/java/org/apache/tajo/engine/planner/physical/TestMergeJoinExec.java
          • tajo-core/src/test/java/org/apache/tajo/engine/planner/physical/TestHashSemiJoinExec.java
          • .travis.yml
          • CHANGES
          • tajo-core/src/test/java/org/apache/tajo/engine/planner/physical/TestSortExec.java
          • tajo-core/src/test/java/org/apache/tajo/engine/planner/physical/TestRightOuterMergeJoinExec.java
          • tajo-core/src/test/java/org/apache/tajo/engine/planner/physical/TestLeftOuterNLJoinExec.java
          • tajo-core/src/test/java/org/apache/tajo/engine/planner/physical/TestBNLJoinExec.java
          • tajo-core/src/test/java/org/apache/tajo/engine/planner/physical/TestHashAntiJoinExec.java
          • tajo-core/src/test/java/org/apache/tajo/engine/planner/physical/TestHashJoinExec.java
          • tajo-core/src/test/java/org/apache/tajo/engine/planner/physical/TestLeftOuterHashJoinExec.java
          Show
          hudson Hudson added a comment - FAILURE: Integrated in Tajo-master-build #574 (See https://builds.apache.org/job/Tajo-master-build/574/ ) TAJO-1317 : Parallel Test Executions on Tajo Core Project (jihun: rev e9cd25a6cdf9d5359d84703a63600c312688d755) tajo-core/src/test/java/org/apache/tajo/engine/planner/physical/TestRightOuterHashJoinExec.java tajo-core/src/test/java/org/apache/tajo/engine/planner/global/TestBroadcastJoinPlan.java tajo-core/src/test/java/org/apache/tajo/client/TestTajoClient.java tajo-core/src/test/java/org/apache/tajo/engine/planner/physical/TestFullOuterMergeJoinExec.java tajo-project/pom.xml tajo-core/pom.xml tajo-core/src/test/java/org/apache/tajo/TajoTestingCluster.java tajo-core/src/test/java/org/apache/tajo/engine/planner/physical/TestExternalSortExec.java tajo-core/src/test/java/org/apache/tajo/engine/planner/physical/TestProgressExternalSortExec.java tajo-core/src/test/java/org/apache/tajo/engine/planner/physical/TestBSTIndexExec.java tajo-core/src/test/java/org/apache/tajo/engine/planner/physical/TestPhysicalPlanner.java tajo-core/src/test/java/org/apache/tajo/engine/planner/physical/TestNLJoinExec.java tajo-core/src/test/java/org/apache/tajo/engine/planner/physical/TestFullOuterHashJoinExec.java tajo-core/src/test/java/org/apache/tajo/worker/TestFetcher.java tajo-core/src/test/java/org/apache/tajo/engine/planner/physical/TestMergeJoinExec.java tajo-core/src/test/java/org/apache/tajo/engine/planner/physical/TestHashSemiJoinExec.java .travis.yml CHANGES tajo-core/src/test/java/org/apache/tajo/engine/planner/physical/TestSortExec.java tajo-core/src/test/java/org/apache/tajo/engine/planner/physical/TestRightOuterMergeJoinExec.java tajo-core/src/test/java/org/apache/tajo/engine/planner/physical/TestLeftOuterNLJoinExec.java tajo-core/src/test/java/org/apache/tajo/engine/planner/physical/TestBNLJoinExec.java tajo-core/src/test/java/org/apache/tajo/engine/planner/physical/TestHashAntiJoinExec.java tajo-core/src/test/java/org/apache/tajo/engine/planner/physical/TestHashJoinExec.java tajo-core/src/test/java/org/apache/tajo/engine/planner/physical/TestLeftOuterHashJoinExec.java
          Hide
          githubbot ASF GitHub Bot added a comment -

          Github user asfgit closed the pull request at:

          https://github.com/apache/tajo/pull/362

          Show
          githubbot ASF GitHub Bot added a comment - Github user asfgit closed the pull request at: https://github.com/apache/tajo/pull/362
          Hide
          githubbot ASF GitHub Bot added a comment -

          Github user jinossy commented on the pull request:

          https://github.com/apache/tajo/pull/362#issuecomment-72446257

          +1 LGTM.
          Ship it!

          Show
          githubbot ASF GitHub Bot added a comment - Github user jinossy commented on the pull request: https://github.com/apache/tajo/pull/362#issuecomment-72446257 +1 LGTM. Ship it!
          Hide
          githubbot ASF GitHub Bot added a comment -

          Github user ykrips commented on the pull request:

          https://github.com/apache/tajo/pull/362#issuecomment-72437790

          Just committed. And also verified on my ubuntu box.

          Show
          githubbot ASF GitHub Bot added a comment - Github user ykrips commented on the pull request: https://github.com/apache/tajo/pull/362#issuecomment-72437790 Just committed. And also verified on my ubuntu box.
          Hide
          githubbot ASF GitHub Bot added a comment -

          Github user jinossy commented on the pull request:

          https://github.com/apache/tajo/pull/362#issuecomment-72429569

          @ykrips
          It seems like surefire plugin can’t handle the ServiceLoader in CompressionCodecFactory
          Can you test again? useSystemClassLoader=true

          Show
          githubbot ASF GitHub Bot added a comment - Github user jinossy commented on the pull request: https://github.com/apache/tajo/pull/362#issuecomment-72429569 @ykrips It seems like surefire plugin can’t handle the ServiceLoader in CompressionCodecFactory Can you test again? useSystemClassLoader=true
          Hide
          githubbot ASF GitHub Bot added a comment -

          Github user ykrips commented on a diff in the pull request:

          https://github.com/apache/tajo/pull/362#discussion_r23911005

          — Diff: tajo-core/pom.xml —
          @@ -690,6 +696,37 @@
          </dependency>
          </dependencies>
          </profile>
          + <profile>
          + <id>parallel-test</id>
          + <activation>
          + <activeByDefault>false</activeByDefault>
          + </activation>
          + <build>
          + <plugins>
          + <plugin>
          + <groupId>org.apache.maven.plugins</groupId>
          + <artifactId>maven-surefire-plugin</artifactId>
          — End diff –

          @jinossy ,
          Thank you for reporting the result. I will try again with reuseForks option.

          Show
          githubbot ASF GitHub Bot added a comment - Github user ykrips commented on a diff in the pull request: https://github.com/apache/tajo/pull/362#discussion_r23911005 — Diff: tajo-core/pom.xml — @@ -690,6 +696,37 @@ </dependency> </dependencies> </profile> + <profile> + <id>parallel-test</id> + <activation> + <activeByDefault>false</activeByDefault> + </activation> + <build> + <plugins> + <plugin> + <groupId>org.apache.maven.plugins</groupId> + <artifactId>maven-surefire-plugin</artifactId> — End diff – @jinossy , Thank you for reporting the result. I will try again with reuseForks option.
          Hide
          githubbot ASF GitHub Bot added a comment -

          Github user jinossy commented on a diff in the pull request:

          https://github.com/apache/tajo/pull/362#discussion_r23909581

          — Diff: tajo-core/pom.xml —
          @@ -690,6 +696,37 @@
          </dependency>
          </dependencies>
          </profile>
          + <profile>
          + <id>parallel-test</id>
          + <activation>
          + <activeByDefault>false</activeByDefault>
          + </activation>
          + <build>
          + <plugins>
          + <plugin>
          + <groupId>org.apache.maven.plugins</groupId>
          + <artifactId>maven-surefire-plugin</artifactId>
          — End diff –

          @ykrips
          If reuseForks is false, integration test is too many restarted the testing cluster
          I've successfully ran the parallel execution with enabled reuseForks
          ```
          mvn clean install -Pparallel-test,hcatalog-0.12.0 -DLOG_LEVEL=WARN -Dmaven.fork.count=3
          ```

          Show
          githubbot ASF GitHub Bot added a comment - Github user jinossy commented on a diff in the pull request: https://github.com/apache/tajo/pull/362#discussion_r23909581 — Diff: tajo-core/pom.xml — @@ -690,6 +696,37 @@ </dependency> </dependencies> </profile> + <profile> + <id>parallel-test</id> + <activation> + <activeByDefault>false</activeByDefault> + </activation> + <build> + <plugins> + <plugin> + <groupId>org.apache.maven.plugins</groupId> + <artifactId>maven-surefire-plugin</artifactId> — End diff – @ykrips If reuseForks is false, integration test is too many restarted the testing cluster I've successfully ran the parallel execution with enabled reuseForks ``` mvn clean install -Pparallel-test,hcatalog-0.12.0 -DLOG_LEVEL=WARN -Dmaven.fork.count=3 ```
          Hide
          githubbot ASF GitHub Bot added a comment -

          Github user ykrips commented on a diff in the pull request:

          https://github.com/apache/tajo/pull/362#discussion_r23886028

          — Diff: tajo-core/pom.xml —
          @@ -690,6 +696,37 @@
          </dependency>
          </dependencies>
          </profile>
          + <profile>
          + <id>parallel-test</id>
          + <activation>
          + <activeByDefault>false</activeByDefault>
          + </activation>
          + <build>
          + <plugins>
          + <plugin>
          + <groupId>org.apache.maven.plugins</groupId>
          + <artifactId>maven-surefire-plugin</artifactId>
          — End diff –

          Thank you for posting test results. Finally found out that reusing test processes cause the classnotfoundexception.

          Show
          githubbot ASF GitHub Bot added a comment - Github user ykrips commented on a diff in the pull request: https://github.com/apache/tajo/pull/362#discussion_r23886028 — Diff: tajo-core/pom.xml — @@ -690,6 +696,37 @@ </dependency> </dependencies> </profile> + <profile> + <id>parallel-test</id> + <activation> + <activeByDefault>false</activeByDefault> + </activation> + <build> + <plugins> + <plugin> + <groupId>org.apache.maven.plugins</groupId> + <artifactId>maven-surefire-plugin</artifactId> — End diff – Thank you for posting test results. Finally found out that reusing test processes cause the classnotfoundexception.
          Hide
          githubbot ASF GitHub Bot added a comment -

          Github user jinossy commented on a diff in the pull request:

          https://github.com/apache/tajo/pull/362#discussion_r23884526

          — Diff: tajo-core/pom.xml —
          @@ -690,6 +696,37 @@
          </dependency>
          </dependencies>
          </profile>
          + <profile>
          + <id>parallel-test</id>
          + <activation>
          + <activeByDefault>false</activeByDefault>
          + </activation>
          + <build>
          + <plugins>
          + <plugin>
          + <groupId>org.apache.maven.plugins</groupId>
          + <artifactId>maven-surefire-plugin</artifactId>
          — End diff –

          Sorry for the confusion. I was test successfully with TAJO-1322, TAJO-1323 on surefire-2.18.1

          Show
          githubbot ASF GitHub Bot added a comment - Github user jinossy commented on a diff in the pull request: https://github.com/apache/tajo/pull/362#discussion_r23884526 — Diff: tajo-core/pom.xml — @@ -690,6 +696,37 @@ </dependency> </dependencies> </profile> + <profile> + <id>parallel-test</id> + <activation> + <activeByDefault>false</activeByDefault> + </activation> + <build> + <plugins> + <plugin> + <groupId>org.apache.maven.plugins</groupId> + <artifactId>maven-surefire-plugin</artifactId> — End diff – Sorry for the confusion. I was test successfully with TAJO-1322 , TAJO-1323 on surefire-2.18.1
          Hide
          githubbot ASF GitHub Bot added a comment -

          Github user ykrips commented on a diff in the pull request:

          https://github.com/apache/tajo/pull/362#discussion_r23882566

          — Diff: tajo-core/pom.xml —
          @@ -690,6 +696,37 @@
          </dependency>
          </dependencies>
          </profile>
          + <profile>
          + <id>parallel-test</id>
          + <activation>
          + <activeByDefault>false</activeByDefault>
          + </activation>
          + <build>
          + <plugins>
          + <plugin>
          + <groupId>org.apache.maven.plugins</groupId>
          + <artifactId>maven-surefire-plugin</artifactId>
          — End diff –

          Thank you for reporting a issue. I did not test on MacOS, and found that maven on MacOS searches the invalid classname like 'rg.apache...'. I will keep finding a workaround on this issue.

          Show
          githubbot ASF GitHub Bot added a comment - Github user ykrips commented on a diff in the pull request: https://github.com/apache/tajo/pull/362#discussion_r23882566 — Diff: tajo-core/pom.xml — @@ -690,6 +696,37 @@ </dependency> </dependencies> </profile> + <profile> + <id>parallel-test</id> + <activation> + <activeByDefault>false</activeByDefault> + </activation> + <build> + <plugins> + <plugin> + <groupId>org.apache.maven.plugins</groupId> + <artifactId>maven-surefire-plugin</artifactId> — End diff – Thank you for reporting a issue. I did not test on MacOS, and found that maven on MacOS searches the invalid classname like 'rg.apache...'. I will keep finding a workaround on this issue.
          Hide
          githubbot ASF GitHub Bot added a comment -

          Github user jinossy commented on a diff in the pull request:

          https://github.com/apache/tajo/pull/362#discussion_r23851439

          — Diff: tajo-core/pom.xml —
          @@ -690,6 +696,37 @@
          </dependency>
          </dependencies>
          </profile>
          + <profile>
          + <id>parallel-test</id>
          + <activation>
          + <activeByDefault>false</activeByDefault>
          + </activation>
          + <build>
          + <plugins>
          + <plugin>
          + <groupId>org.apache.maven.plugins</groupId>
          + <artifactId>maven-surefire-plugin</artifactId>
          — End diff –

          Could you add latest version? In my test, I met the ClassNotFoundExeception

          Show
          githubbot ASF GitHub Bot added a comment - Github user jinossy commented on a diff in the pull request: https://github.com/apache/tajo/pull/362#discussion_r23851439 — Diff: tajo-core/pom.xml — @@ -690,6 +696,37 @@ </dependency> </dependencies> </profile> + <profile> + <id>parallel-test</id> + <activation> + <activeByDefault>false</activeByDefault> + </activation> + <build> + <plugins> + <plugin> + <groupId>org.apache.maven.plugins</groupId> + <artifactId>maven-surefire-plugin</artifactId> — End diff – Could you add latest version? In my test, I met the ClassNotFoundExeception
          Hide
          githubbot ASF GitHub Bot added a comment -

          Github user ykrips commented on the pull request:

          https://github.com/apache/tajo/pull/362#issuecomment-71979877

          This build failure already reported to MNG jira. It needs to find a workaround for this build issue. More details can be found in below link.
          https://jira.codehaus.org/browse/MNG-5750

          Show
          githubbot ASF GitHub Bot added a comment - Github user ykrips commented on the pull request: https://github.com/apache/tajo/pull/362#issuecomment-71979877 This build failure already reported to MNG jira. It needs to find a workaround for this build issue. More details can be found in below link. https://jira.codehaus.org/browse/MNG-5750
          Hide
          githubbot ASF GitHub Bot added a comment -

          Github user ykrips commented on the pull request:

          https://github.com/apache/tajo/pull/362#issuecomment-71940368

          It should be separated compilation and test phase on maven build, because parallel compilation is not supported by maven.

          Show
          githubbot ASF GitHub Bot added a comment - Github user ykrips commented on the pull request: https://github.com/apache/tajo/pull/362#issuecomment-71940368 It should be separated compilation and test phase on maven build, because parallel compilation is not supported by maven.
          Hide
          githubbot ASF GitHub Bot added a comment -

          GitHub user ykrips opened a pull request:

          https://github.com/apache/tajo/pull/362

          TAJO-1317: Parallel Test Executions on Tajo Core Project

          You can merge this pull request into a Git repository by running:

          $ git pull https://github.com/ykrips/tajo TAJO-1317

          Alternatively you can review and apply these changes as the patch at:

          https://github.com/apache/tajo/pull/362.patch

          To close this pull request, make a commit to your master/trunk branch
          with (at least) the following in the commit message:

          This closes #362


          commit 3dc0d16a2ce6dce9410500053d0877063f79f0b8
          Author: Jihun Kang <jihun@apache.org>
          Date: 2015-01-27T08:13:08Z

          Initial commit for parallel tests

          commit d0825bd4edc2c37329f5ceeb553529000d279377
          Author: Jihun Kang <jihun@apache.org>
          Date: 2015-01-27T09:09:38Z

          modified travis script

          commit e88125b308bf2e4c45aebb94f8be99fa3841dc53
          Author: Jihun Kang <jihun@apache.org>
          Date: 2015-01-27T09:09:56Z

          Merge remote-tracking branch 'upstream/master' into TAJO-1317

          commit fb1e1f7291ad083cdfdc2d5caf26869736e682b5
          Author: Jihun Kang <jihun@apache.org>
          Date: 2015-01-27T09:17:53Z

          fixed travis script

          commit 61d120e6314efd0f833a59e6685a45fe6f583175
          Author: Jihun Kang <jihun@apache.org>
          Date: 2015-01-27T23:35:24Z

          Modified travis script

          commit 0989bb55e519ba022a822034eb81b641210b517f
          Author: Jihun Kang <jihun@apache.org>
          Date: 2015-01-27T23:54:01Z

          Modified travis script

          commit 0b7f3ed7948a6f8f502963e23025b66f82b3071a
          Author: Jihun Kang <jihun@apache.org>
          Date: 2015-01-28T00:03:04Z

          Modified travis script

          commit 99c0ad2e96e26bfa96bcabe4be22b8eb6e8a5c3b
          Author: Jihun Kang <jihun@apache.org>
          Date: 2015-01-28T00:25:02Z

          Reduced log level

          commit da7390eea3d8766668c7a8df301bdad3bc3347ce
          Author: Jihun Kang <jihun@apache.org>
          Date: 2015-01-28T00:46:12Z

          Reduced log level


          Show
          githubbot ASF GitHub Bot added a comment - GitHub user ykrips opened a pull request: https://github.com/apache/tajo/pull/362 TAJO-1317 : Parallel Test Executions on Tajo Core Project You can merge this pull request into a Git repository by running: $ git pull https://github.com/ykrips/tajo TAJO-1317 Alternatively you can review and apply these changes as the patch at: https://github.com/apache/tajo/pull/362.patch To close this pull request, make a commit to your master/trunk branch with (at least) the following in the commit message: This closes #362 commit 3dc0d16a2ce6dce9410500053d0877063f79f0b8 Author: Jihun Kang <jihun@apache.org> Date: 2015-01-27T08:13:08Z Initial commit for parallel tests commit d0825bd4edc2c37329f5ceeb553529000d279377 Author: Jihun Kang <jihun@apache.org> Date: 2015-01-27T09:09:38Z modified travis script commit e88125b308bf2e4c45aebb94f8be99fa3841dc53 Author: Jihun Kang <jihun@apache.org> Date: 2015-01-27T09:09:56Z Merge remote-tracking branch 'upstream/master' into TAJO-1317 commit fb1e1f7291ad083cdfdc2d5caf26869736e682b5 Author: Jihun Kang <jihun@apache.org> Date: 2015-01-27T09:17:53Z fixed travis script commit 61d120e6314efd0f833a59e6685a45fe6f583175 Author: Jihun Kang <jihun@apache.org> Date: 2015-01-27T23:35:24Z Modified travis script commit 0989bb55e519ba022a822034eb81b641210b517f Author: Jihun Kang <jihun@apache.org> Date: 2015-01-27T23:54:01Z Modified travis script commit 0b7f3ed7948a6f8f502963e23025b66f82b3071a Author: Jihun Kang <jihun@apache.org> Date: 2015-01-28T00:03:04Z Modified travis script commit 99c0ad2e96e26bfa96bcabe4be22b8eb6e8a5c3b Author: Jihun Kang <jihun@apache.org> Date: 2015-01-28T00:25:02Z Reduced log level commit da7390eea3d8766668c7a8df301bdad3bc3347ce Author: Jihun Kang <jihun@apache.org> Date: 2015-01-28T00:46:12Z Reduced log level
          Hide
          sirpkt Keuntae Park added a comment -

          Great Idea!!

          Show
          sirpkt Keuntae Park added a comment - Great Idea!!
          Hide
          jhkim Jinho Kim added a comment -

          Big +1 !!

          Show
          jhkim Jinho Kim added a comment - Big +1 !!

            People

            • Assignee:
              ykrips Jihun Kang
              Reporter:
              ykrips Jihun Kang
            • Votes:
              0 Vote for this issue
              Watchers:
              5 Start watching this issue

              Dates

              • Created:
                Updated:
                Resolved:

                Development