Uploaded image for project: 'Sling'
  1. Sling
  2. SLING-7108

FullTextIndexingTest times out on Java 9

    XMLWordPrintableJSON

    Details

    • Type: Bug
    • Status: Resolved
    • Priority: Major
    • Resolution: Fixed
    • Affects Version/s: None
    • Fix Version/s: Starter 10
    • Component/s: Launchpad
    • Labels:
      None

      Description

      Tests run: 3, Failures: 3, Errors: 0, Skipped: 0, Time elapsed: 45.657 sec <<< FAILURE! - in org.apache.sling.launchpad.webapp.integrationtest.indexing.FullTextIndexingTest
      testUploadedPdfIsIndexed[0 - lorem-ipsum.pdf](org.apache.sling.launchpad.webapp.integrationtest.indexing.FullTextIndexingTest)  Time elapsed: 15.232 sec  <<< FAILURE!
      java.lang.AssertionError: RetryLoop failed, condition is false after 15 seconds: A document containing 'Excepteur' is found under /tmp/test-FullTextIndexingTest
      	at org.junit.Assert.fail(Assert.java:88)
      	at org.apache.sling.testing.tools.retry.RetryLoop.<init>(RetryLoop.java:65)
      	at org.apache.sling.launchpad.webapp.integrationtest.indexing.FullTextIndexingTest.testUploadedPdfIsIndexed(FullTextIndexingTest.java:97)
      
      testUploadedPdfIsIndexed[1 - another.pdf](org.apache.sling.launchpad.webapp.integrationtest.indexing.FullTextIndexingTest)  Time elapsed: 15.212 sec  <<< FAILURE!
      java.lang.AssertionError: RetryLoop failed, condition is false after 15 seconds: A document containing 'some text that we will search for' is found under /var/test-FullTextIndexingTest
      	at org.junit.Assert.fail(Assert.java:88)
      	at org.apache.sling.testing.tools.retry.RetryLoop.<init>(RetryLoop.java:65)
      	at org.apache.sling.launchpad.webapp.integrationtest.indexing.FullTextIndexingTest.testUploadedPdfIsIndexed(FullTextIndexingTest.java:97)
      
      testUploadedPdfIsIndexed[2 - french.pdf](org.apache.sling.launchpad.webapp.integrationtest.indexing.FullTextIndexingTest)  Time elapsed: 15.211 sec  <<< FAILURE!
      java.lang.AssertionError: RetryLoop failed, condition is false after 15 seconds: A document containing 'un autre PDF pour le test fulltext' is found under /libs/test-FullTextIndexingTest
      	at org.junit.Assert.fail(Assert.java:88)
      	at org.apache.sling.testing.tools.retry.RetryLoop.<init>(RetryLoop.java:65)
      	at org.apache.sling.launchpad.webapp.integrationtest.indexing.FullTextIndexingTest.testUploadedPdfIsIndexed(FullTextIndexingTest.java:97)

        Attachments

          Issue Links

            Activity

              People

              • Assignee:
                rombert Robert Munteanu
                Reporter:
                rombert Robert Munteanu
              • Votes:
                0 Vote for this issue
                Watchers:
                3 Start watching this issue

                Dates

                • Created:
                  Updated:
                  Resolved: