Uploaded image for project: 'Sling'
  1. Sling
  2. SLING-7072

Build failure with Java 9 - unable to create javax script engine for javascript

    XMLWordPrintableJSON

    Details

      Description

      [ERROR] Failed to execute goal org.apache.maven.plugins:maven-antrun-plugin:1.8:run (set-bundle-required-execution-environment) on project org.apache.sling.engine: An Ant BuildException has occured: Unable to create javax script engine for javascript
      [ERROR] around Ant part ...<script language="javascript">var System = java.lang.System;... @ 4:33 in /home/robert/Documents/sources/apache/sling/bundles/engine/target/antrun/build-main.xml
      [ERROR] -> [Help 1]

        Attachments

          Issue Links

            Activity

              People

              • Assignee:
                rombert Robert Munteanu
                Reporter:
                rombert Robert Munteanu
              • Votes:
                0 Vote for this issue
                Watchers:
                3 Start watching this issue

                Dates

                • Created:
                  Updated:
                  Resolved: