Uploaded image for project: 'Sling'
  1. Sling
  2. SLING-3557

Build Failure from sling trunk

    XMLWordPrintableJSON

    Details

    • Type: Bug
    • Status: Closed
    • Priority: Major
    • Resolution: Fixed
    • Affects Version/s: None
    • Fix Version/s: Launchpad Builder 7
    • Component/s: Launchpad
    • Labels:
      None
    • Environment:
      all

      Description

      Getting following error when trying to build from trunk

      [INFO] Apache Sling Launchpad Application Builder ........ FAILURE [23.482s]

      [ERROR] Failed to execute goal on project org.apache.sling.launchpad: Could not resolve dependencies for project org.apache.sling:org.apache.sling.launchpad:war:7-SNAPSHOT: Could not find artifact org.apache.sling:org.apache.sling.launchpad.impl:jar:0.0.1-SNAPSHOT in apache.snapshots (http://repository.apache.org/snapshots) -> [Help 1]
      [ERROR]
      [ERROR] To see the full stack trace of the errors, re-run Maven with the -e switch.
      [ERROR] Re-run Maven using the -X switch to enable full debug logging.
      [ERROR]
      [ERROR] For more information about the errors and possible solutions, please read the following articles:
      [ERROR] [Help 1] http://cwiki.apache.org/confluence/display/MAVEN/DependencyResolutionException
      [ERROR]
      [ERROR] After correcting the problems, you can resume the build with the command
      [ERROR] mvn <goals> -rf :org.apache.sling.launchpad

        Attachments

          Activity

            People

            • Assignee:
              cziegeler Carsten Ziegeler
              Reporter:
              yogi_1306 Yogesh Upadhyay
            • Votes:
              0 Vote for this issue
              Watchers:
              2 Start watching this issue

              Dates

              • Created:
                Updated:
                Resolved: