Details

    • Type: Bug
    • Status: Closed
    • Priority: Major
    • Resolution: Fixed
    • Affects Version/s: 0.12.0
    • Fix Version/s: 0.12.0
    • Component/s: None
    • Labels:
      None
    • Hadoop Flags:
      Reviewed

      Description

      The test case fails with the following error:

      ./test_harness.pl::TestDriverPig::compareScript INFO Checking test stderr for regular expression <No plan for X to describe>
      ./test_harness.pl::TestDriverPig::compareScript INFO Check failed: regex match of <No plan for X to describe> expected in stderr: ./out/pigtest/cheolsoop/cheolsoop-1381090887-cmdline.conf-Describe_cmdline/Describe_cmdline_12.out/stderr
      INFO: TestDriver::runTestGroup() at 706:Test Describe_cmdline_12 FAILED at 1381091044
      Results so far,    PASSED: 10   FAILED: 1    SKIPPED: 0    ABORTED: 0    FAILED DEPENDENCY: 0    [cmdline.conf-Describe_cmdline]
      

        Attachments

        1. PIG-3504-1.patch
          0.6 kB
          Cheolsoo Park

          Activity

            People

            • Assignee:
              cheolsoo Cheolsoo Park
              Reporter:
              cheolsoo Cheolsoo Park
            • Votes:
              0 Vote for this issue
              Watchers:
              2 Start watching this issue

              Dates

              • Created:
                Updated:
                Resolved: