Uploaded image for project: 'OpenEJB'
  1. OpenEJB
  2. OPENEJB-1595

[BUILD FAILED]Compilation error occurs while building openejb trunk

    Details

    • Type: Bug
    • Status: Closed
    • Priority: Minor
    • Resolution: Fixed
    • Affects Version/s: None
    • Fix Version/s: 4.5.0
    • Component/s: None
    • Labels:
      None
    • Environment:
      suse10

      Description

      Please refer to the logs:

      1243 6/14/11 5:14 PM EXEC start [/home/wasce/bfwork/dep_openejb/work@ce30]
      1244 6/14/11 5:14 PM EXEC [INFO] Scanning for projects...
      1245 6/14/11 5:14 PM EXEC [INFO] Reactor build order:
      1246 6/14/11 5:14 PM EXEC [INFO] OpenEJB
      1247 6/14/11 5:14 PM EXEC [INFO] OpenEJB :: Dependencies
      1248 6/14/11 5:14 PM EXEC [INFO] OpenEJB :: Dependencies :: JavaEE API
      1249 6/14/11 5:14 PM EXEC [INFO] OpenEJB :: iTests
      1250 6/14/11 5:14 PM EXEC [INFO] OpenEJB :: iTests Beans
      1251 6/14/11 5:14 PM EXEC [INFO] OpenEJB :: iTests Servlets
      1252 6/14/11 5:14 PM EXEC [INFO] OpenEJB :: iTests Client
      1253 6/14/11 5:14 PM EXEC [INFO] OpenEJB :: iTests Interceptor Beans
      1254 6/14/11 5:14 PM EXEC [INFO] OpenEJB :: iTests App
      1255 6/14/11 5:14 PM EXEC [INFO] OpenEJB :: iTests Web
      1256 6/14/11 5:14 PM EXEC [INFO] OpenEJB :: Container
      1257 6/14/11 5:14 PM EXEC [INFO] OpenEJB :: Container :: API
      1258 6/14/11 5:14 PM EXEC [INFO] OpenEJB :: Container :: Loader
      1259 6/14/11 5:14 PM EXEC [INFO] OpenEJB :: Container :: Java Agent
      1260 6/14/11 5:14 PM EXEC [INFO] OpenEJB :: Container :: Java EE
      1261 6/14/11 5:14 PM EXEC [INFO] OpenEJB :: Container :: Core
      1262 6/14/11 5:14 PM EXEC [INFO] OpenEJB :: Container :: Spring
      1263 6/14/11 5:14 PM EXEC [INFO] OpenEJB :: Container :: OSGi :: Core
      1264 6/14/11 5:14 PM EXEC [INFO] OpenEJB :: Container :: OSGi
      1265 6/14/11 5:14 PM EXEC [INFO] OpenEJB :: Container :: ActiveMQ4
      1266 6/14/11 5:14 PM EXEC [INFO] OpenEJB :: Container :: JUnit
      1267 6/14/11 5:14 PM EXEC [INFO] OpenEJB :: Server
      1268 6/14/11 5:14 PM EXEC [INFO] OpenEJB :: Server :: Client
      1269 6/14/11 5:14 PM EXEC [INFO] OpenEJB :: Server :: Core
      1270 6/14/11 5:14 PM EXEC [INFO] OpenEJB :: Server :: Multicast Discovery
      1271 6/14/11 5:14 PM EXEC [INFO] OpenEJB :: Server :: EJBd
      1272 6/14/11 5:14 PM EXEC [INFO] OpenEJB :: Server :: Admin
      1273 6/14/11 5:14 PM EXEC [INFO] OpenEJB :: Server :: Http
      1274 6/14/11 5:14 PM EXEC [INFO] OpenEJB :: Server :: WebAdmin
      1275 6/14/11 5:14 PM EXEC [INFO] OpenEJB :: Server :: Telnet
      1276 6/14/11 5:14 PM EXEC [INFO] OpenEJB :: Server :: ActiveMQ
      1277 6/14/11 5:14 PM EXEC [INFO] OpenEJB :: Server :: CORBA
      1278 6/14/11 5:14 PM EXEC [INFO] OpenEJB :: Server :: Derby Network Service
      1279 6/14/11 5:14 PM EXEC [INFO] OpenEJB :: Server :: Hsql
      1280 6/14/11 5:14 PM EXEC [INFO] OpenEJB :: Server :: Webservices
      1281 6/14/11 5:14 PM EXEC [INFO] OpenEJB :: Server :: Axis
      1282 6/14/11 5:14 PM EXEC [INFO] OpenEJB :: Server :: Axis2
      1283 6/14/11 5:14 PM EXEC [INFO] OpenEJB :: Server :: CXF
      1284 6/14/11 5:14 PM EXEC [INFO] OpenEJB :: Server :: Daemon
      1285 6/14/11 5:14 PM EXEC [INFO] OpenEJB :: Examples :: @ApplicationException inheritance
      1286 6/14/11 5:14 PM EXEC [INFO] OpenEJB :: Examples :: Simple Stateful Pojo
      1287 6/14/11 5:14 PM EXEC [INFO] OpenEJB :: Examples :: Simple Stateless Pojo
      1288 6/14/11 5:14 PM EXEC [INFO] OpenEJB :: Examples :: Simple Stateless With Deployment Descriptor
      1289 6/14/11 5:14 PM EXEC [INFO] OpenEJB :: Examples :: Simple Singleton
      1290 6/14/11 5:14 PM EXEC [INFO] OpenEJB :: Examples :: Simple MDB Example
      1291 6/14/11 5:14 PM EXEC [INFO] OpenEJB :: Examples :: Simple MDB Using Deployment Descriptor Example
      1292 6/14/11 5:14 PM EXEC [INFO] OpenEJB :: Examples :: Simple CMP2 Entity
      1293 6/14/11 5:14 PM EXEC [INFO] OpenEJB :: Examples :: Simple Webservice
      1294 6/14/11 5:14 PM EXEC [INFO] OpenEJB :: Examples :: EJB 2.1 Component Interfaces
      1295 6/14/11 5:14 PM EXEC [INFO] OpenEJB :: Examples :: @EJB Injection
      1296 6/14/11 5:14 PM EXEC [INFO] OpenEJB :: Examples :: @Resource env-entry Injection
      1297 6/14/11 5:14 PM EXEC [INFO] OpenEJB :: Examples :: @Resource DataSource Injection
      1298 6/14/11 5:14 PM EXEC [INFO] OpenEJB :: Examples :: @PersistenceContext EntityManager Injection
      1299 6/14/11 5:14 PM EXEC [INFO] OpenEJB :: Examples :: @Resource javax.jms.ConnectionFactory
      1300 6/14/11 5:14 PM EXEC [INFO] OpenEJB :: Examples :: Testing Transactions
      1301 6/14/11 5:14 PM EXEC [INFO] OpenEJB :: Examples :: Testing Security
      1302 6/14/11 5:14 PM EXEC [INFO] OpenEJB :: Examples :: Testing Security
      1303 6/14/11 5:14 PM EXEC [INFO] OpenEJB :: Examples :: TestCase Injection
      1304 6/14/11 5:14 PM EXEC [INFO] OpenEJB :: Examples :: Alternate Descriptors
      1305 6/14/11 5:14 PM EXEC [INFO] OpenEJB :: Examples :: Ear Testing
      1306 6/14/11 5:14 PM EXEC [INFO] OpenEJB :: Examples :: Ear Testing :: Business Model
      1307 6/14/11 5:14 PM EXEC [INFO] OpenEJB :: Examples :: Ear Testing :: Business Logic
      1308 6/14/11 5:14 PM EXEC [INFO] OpenEJB :: Examples :: Interceptors
      1309 6/14/11 5:14 PM EXEC [INFO] OpenEJB :: Examples :: Expanded support for Env Entries
      1310 6/14/11 5:14 PM EXEC [INFO] OpenEJB :: Examples :: Hello World - Weblogic
      1311 6/14/11 5:14 PM EXEC [INFO] OpenEJB :: Examples :: JPA with Hibernate
      1312 6/14/11 5:14 PM EXEC [INFO] OpenEJB :: Examples :: JPA with EclipseLink
      1313 6/14/11 5:14 PM EXEC [INFO] OpenEJB :: Examples :: Spring Integration
      1314 6/14/11 5:14 PM EXEC [INFO] OpenEJB :: Examples :: Telephone Stateful Pojo
      1315 6/14/11 5:14 PM EXEC [INFO] OpenEJB :: Examples :: Quartz Application
      1316 6/14/11 5:14 PM EXEC [INFO] Quartz Resource Adapter
      1317 6/14/11 5:14 PM EXEC [INFO] Quartz Beans
      1318 6/14/11 5:14 PM EXEC [INFO] OpenEJB :: Examples :: Webservice Attachments
      1319 6/14/11 5:14 PM EXEC [INFO] OpenEJB :: Web Examples :: EJB Examples War
      1320 6/14/11 5:14 PM EXEC [INFO] OpenEJB :: Web Examples :: EJB WebService
      1321 6/14/11 5:14 PM EXEC [INFO] OpenEJB :: Web Examples :: JSF with MyFaces
      1322 6/14/11 5:14 PM EXEC [INFO] OpenEJB :: Web Examples :: Struts
      1323 6/14/11 5:14 PM EXEC [INFO] OpenEJB :: Web Examples :: Moviefun
      1324 6/14/11 5:14 PM EXEC [INFO] OpenEJB :: Web Examples :: Moviefun :: Interfaces
      1325 6/14/11 5:14 PM EXEC [INFO] OpenEJB :: Web Examples :: Moviefun :: App
      1326 6/14/11 5:14 PM EXEC [INFO] OpenEJB :: Web Examples :: Moviefun :: Monitor
      1327 6/14/11 5:14 PM EXEC [INFO] OpenEJB :: Web Examples
      1328 6/14/11 5:14 PM EXEC [INFO] OpenEJB :: Web Examples :: EJB WebService with Security
      1329 6/14/11 5:14 PM EXEC [INFO] OpenEJB :: Web Examples :: EJB WebService with WS-Security
      1330 6/14/11 5:14 PM EXEC [INFO] OpenEJB :: Examples :: Webservice Inheritance
      1331 6/14/11 5:14 PM EXEC [INFO] OpenEJB :: Examples :: Transaction Rollback
      1332 6/14/11 5:14 PM EXEC [INFO] OpenEJB :: Examples :: Troubleshooting
      1333 6/14/11 5:14 PM EXEC [INFO] OpenEJB :: Examples :: @AccessTimeout
      1334 6/14/11 5:14 PM EXEC [INFO] OpenEJB :: Examples :: @Asynchronous Methods
      1335 6/14/11 5:14 PM EXEC [INFO] OpenEJB :: Examples :: EJB Lookup with descriptor
      1336 6/14/11 5:14 PM EXEC [INFO] OpenEJB :: Examples :: @EJB Lookup
      1337 6/14/11 5:14 PM EXEC [INFO] OpenEJB :: Examples :: @Schedule Methods
      1338 6/14/11 5:14 PM EXEC [INFO] OpenEJB :: Examples :: Movies Complete (Meta)
      1339 6/14/11 5:14 PM EXEC [INFO] OpenEJB :: Examples :: Movies Complete
      1340 6/14/11 5:14 PM EXEC [INFO] OpenEJB :: Examples :: @Schedule Methods (Meta)
      1341 6/14/11 5:14 PM EXEC [INFO] OpenEJB :: Examples :: Testing Security (Meta)
      1342 6/14/11 5:14 PM EXEC [INFO] OpenEJB :: Examples :: Decorators
      1343 6/14/11 5:14 PM EXEC [INFO] OpenEJB :: Examples
      1344 6/14/11 5:14 PM EXEC [INFO] OpenEJB :: Assembly
      1345 6/14/11 5:14 PM EXEC [INFO] OpenEJB :: Assembly :: WebApp :: Common
      1346 6/14/11 5:14 PM EXEC [INFO] OpenEJB :: Assembly :: iTests Standalone Client
      1347 6/14/11 5:14 PM EXEC [INFO] OpenEJB :: Assembly :: Tomcat
      1348 6/14/11 5:14 PM EXEC [INFO] OpenEJB :: Assembly :: Tomcat :: Loader
      1349 6/14/11 5:14 PM EXEC [INFO] OpenEJB :: Assembly :: Tomcat :: Common
      1350 6/14/11 5:14 PM EXEC [INFO] OpenEJB :: Assembly :: Tomcat :: Catalina
      1351 6/14/11 5:14 PM EXEC [INFO] OpenEJB :: Assembly :: Tomcat :: Webapp
      1352 6/14/11 5:14 PM EXEC [INFO] OpenEJB :: Assembly :: TomEE
      1353 6/14/11 5:14 PM EXEC [INFO] OpenEJB :: Assembly :: TomEE :: Utils
      1354 6/14/11 5:14 PM EXEC [INFO] OpenEJB :: Assembly :: TomEE :: Tomcat 7
      1355 6/14/11 5:14 PM EXEC [INFO] OpenEJB :: Assembly :: Jetty
      1356 6/14/11 5:14 PM EXEC [INFO] OpenEJB :: Assembly :: Jetty :: Loader
      1357 6/14/11 5:14 PM EXEC [INFO] OpenEJB :: Assembly :: Jetty :: Common
      1358 6/14/11 5:14 PM EXEC [INFO] OpenEJB :: Assembly :: Jetty :: Webapp
      1359 6/14/11 5:14 PM EXEC [INFO] OpenEJB :: Assembly :: Java EE API Libraries
      1360 6/14/11 5:14 PM EXEC [INFO] OpenEJB :: Assembly :: Standalone
      1361 6/14/11 5:14 PM EXEC [INFO] OpenEJB :: Assembly :: iTests Standalone Client
      1362 6/14/11 5:14 PM EXEC [INFO] OpenEJB :: TCK
      1363 6/14/11 5:14 PM EXEC [INFO] OpenEJB :: TCK :: CDI Embedded
      1364 6/14/11 5:14 PM EXEC [INFO] ------------------------------------------------------------------------
      1365 6/14/11 5:14 PM EXEC [INFO] Building OpenEJB
      1366 6/14/11 5:14 PM EXEC [INFO] task-segment: [clean, install]
      1367 6/14/11 5:14 PM EXEC [INFO] ------------------------------------------------------------------------
      1368 6/14/11 5:14 PM EXEC [INFO] [clean:clean

      {execution: default-clean}

      ]
      1369 6/14/11 5:14 PM EXEC [INFO] Deleting /home/wasce/bfwork/dep_openejb/work/target
      1370 6/14/11 5:14 PM EXEC [INFO] Setting property: classpath.resource.loader.class => 'org.codehaus.plexus.velocity.ContextClassLoaderResourceLoader'.
      1371 6/14/11 5:14 PM EXEC [INFO] Setting property: velocimacro.messages.on => 'false'.
      1372 6/14/11 5:14 PM EXEC [INFO] Setting property: resource.loader => 'classpath'.
      1373 6/14/11 5:14 PM EXEC [INFO] Setting property: resource.manager.logwhenfound => 'false'.
      1374 6/14/11 5:14 PM EXEC [INFO] [remote-resources:process

      {execution: default}

      ]
      1375 6/14/11 5:14 PM EXEC [INFO] [dependency-report:report

      {execution: default}

      ]
      1376 6/14/11 5:14 PM EXEC [INFO] No dependencies to report
      1377 6/14/11 5:14 PM EXEC [INFO] [bundle:manifest

      {execution: bundle-manifest}

      ]
      1378 6/14/11 5:14 PM EXEC [WARNING] Ignoring project type pom - supportedProjectTypes = [jar, bundle]
      1379 6/14/11 5:14 PM EXEC [INFO] [site:attach-descriptor

      {execution: default-attach-descriptor}

      ]
      1380 6/14/11 5:14 PM EXEC [INFO] [install:install

      {execution: default-install}

      ]
      1381 6/14/11 5:14 PM EXEC [INFO] Installing /home/wasce/bfwork/dep_openejb/work/pom.xml to /home/wasce/.m2/repository/org/apache/openejb/openejb/4.0.0-SNAPSHOT/openejb-4.0.0-SNAPSHOT.pom
      1382 6/14/11 5:14 PM EXEC [INFO] ------------------------------------------------------------------------
      1383 6/14/11 5:14 PM EXEC [INFO] Building OpenEJB :: Dependencies
      1384 6/14/11 5:14 PM EXEC [INFO] task-segment: [clean, install]
      1385 6/14/11 5:14 PM EXEC [INFO] ------------------------------------------------------------------------
      1386 6/14/11 5:14 PM EXEC [INFO] [clean:clean

      {execution: default-clean}

      ]
      1387 6/14/11 5:14 PM EXEC [INFO] Deleting /home/wasce/bfwork/dep_openejb/work/deps/target
      1388 6/14/11 5:14 PM EXEC [INFO] [remote-resources:process

      {execution: default}

      ]
      1389 6/14/11 5:14 PM EXEC [INFO] [dependency-report:report

      {execution: default}

      ]
      1390 6/14/11 5:14 PM EXEC [INFO] No dependencies to report
      1391 6/14/11 5:14 PM EXEC [INFO] [bundle:manifest

      {execution: bundle-manifest}

      ]
      1392 6/14/11 5:14 PM EXEC [WARNING] Ignoring project type pom - supportedProjectTypes = [jar, bundle]
      1393 6/14/11 5:14 PM EXEC [INFO] [site:attach-descriptor

      {execution: default-attach-descriptor}

      ]
      1394 6/14/11 5:14 PM EXEC [INFO] [install:install

      {execution: default-install}

      ]
      1395 6/14/11 5:14 PM EXEC [INFO] Installing /home/wasce/bfwork/dep_openejb/work/deps/pom.xml to /home/wasce/.m2/repository/org/apache/openejb/deps/4.0.0-SNAPSHOT/deps-4.0.0-SNAPSHOT.pom
      1396 6/14/11 5:14 PM EXEC [INFO] ------------------------------------------------------------------------
      1397 6/14/11 5:14 PM EXEC [INFO] Building OpenEJB :: Dependencies :: JavaEE API
      1398 6/14/11 5:14 PM EXEC [INFO] task-segment: [clean, install]
      1399 6/14/11 5:14 PM EXEC [INFO] ------------------------------------------------------------------------
      1400 6/14/11 5:14 PM EXEC [INFO] [clean:clean

      {execution: default-clean}

      ]
      1401 6/14/11 5:14 PM EXEC [INFO] Deleting /home/wasce/bfwork/dep_openejb/work/deps/javaee-api/target
      1402 6/14/11 5:14 PM EXEC [INFO] [remote-resources:process

      {execution: default}

      ]
      1403 6/14/11 5:14 PM EXEC [INFO] [resources:resources

      {execution: default-resources}

      ]
      1404 6/14/11 5:14 PM EXEC [INFO] Using 'UTF-8' encoding to copy filtered resources.
      1405 6/14/11 5:14 PM EXEC [INFO] skip non existing resourceDirectory /home/wasce/bfwork/dep_openejb/work/deps/javaee-api/src/main/resources
      1406 6/14/11 5:14 PM EXEC [INFO] Copying 3 resources
      1407 6/14/11 5:14 PM EXEC [INFO] [compiler:compile

      {execution: default-compile}

      ]
      1408 6/14/11 5:14 PM EXEC [INFO] No sources to compile
      1409 6/14/11 5:14 PM EXEC [INFO] [dependency-report:report

      {execution: default}

      ]
      1410 6/14/11 5:14 PM EXEC [INFO] [bundle:manifest

      {execution: bundle-manifest}

      ]
      1411 6/14/11 5:14 PM EXEC [WARNING] Warning in manifest for org.apache.openejb:javaee-api:jar:6.0-SNAPSHOT : Superfluous export-package instructions: [org.apache.openejb*]
      1412 6/14/11 5:14 PM EXEC [WARNING] Warning in manifest for org.apache.openejb:javaee-api:jar:6.0-SNAPSHOT : Did not find matching referal for *
      1413 6/14/11 5:14 PM EXEC [INFO] [resources:testResources

      {execution: default-testResources}

      ]
      1414 6/14/11 5:14 PM EXEC [INFO] Using 'UTF-8' encoding to copy filtered resources.
      1415 6/14/11 5:14 PM EXEC [INFO] skip non existing resourceDirectory /home/wasce/bfwork/dep_openejb/work/deps/javaee-api/src/test/resources
      1416 6/14/11 5:14 PM EXEC [INFO] Copying 3 resources
      1417 6/14/11 5:14 PM EXEC [INFO] [compiler:testCompile

      {execution: default-testCompile}

      ]
      1418 6/14/11 5:14 PM EXEC [INFO] Not compiling test sources
      1419 6/14/11 5:14 PM EXEC [INFO] [surefire:test

      {execution: default-test}

      ]
      1420 6/14/11 5:14 PM EXEC [INFO] Tests are skipped.
      1421 6/14/11 5:14 PM EXEC [INFO] [jar:jar

      {execution: default-jar}

      ]
      1422 6/14/11 5:14 PM EXEC [INFO] Building jar: /home/wasce/bfwork/dep_openejb/work/deps/javaee-api/target/javaee-api-6.0-SNAPSHOT.jar
      1423 6/14/11 5:14 PM EXEC [INFO] [shade:shade

      {execution: default}

      ]
      1424 6/14/11 5:14 PM EXEC [INFO] Including org.apache.geronimo.specs:geronimo-activation_1.1_spec:jar:1.1 in the shaded jar.
      1425 6/14/11 5:14 PM EXEC [INFO] Including org.apache.geronimo.specs:geronimo-annotation_1.1_spec:jar:1.0 in the shaded jar.
      1426 6/14/11 5:14 PM EXEC [INFO] Including org.apache.geronimo.specs:geronimo-atinject_1.0_spec:jar:1.0 in the shaded jar.
      1427 6/14/11 5:14 PM EXEC [INFO] Including org.apache.geronimo.specs:geronimo-ccpp_1.0_spec:jar:1.0-beta in the shaded jar.
      1428 6/14/11 5:14 PM EXEC [INFO] Including org.apache.geronimo.specs:geronimo-ejb_3.1_spec:jar:1.0.2 in the shaded jar.
      1429 6/14/11 5:14 PM EXEC [INFO] Including org.apache.geronimo.specs:geronimo-el_2.2_spec:jar:1.0 in the shaded jar.
      1430 6/14/11 5:14 PM EXEC [INFO] Including org.apache.geronimo.specs:geronimo-interceptor_1.1_spec:jar:1.0 in the shaded jar.
      1431 6/14/11 5:14 PM EXEC [INFO] Including org.apache.geronimo.specs:geronimo-j2ee-connector_1.6_spec:jar:1.0 in the shaded jar.
      1432 6/14/11 5:14 PM EXEC [INFO] Including org.apache.geronimo.specs:geronimo-j2ee-management_1.1_spec:jar:1.0.1 in the shaded jar.
      1433 6/14/11 5:14 PM EXEC [INFO] Including org.apache.geronimo.specs:geronimo-jacc_1.4_spec:jar:1.0 in the shaded jar.
      1434 6/14/11 5:14 PM EXEC [INFO] Including org.apache.geronimo.specs:geronimo-jaspic_1.0_spec:jar:1.1 in the shaded jar.
      1435 6/14/11 5:14 PM EXEC [INFO] Including org.apache.geronimo.specs:geronimo-j2ee-deployment_1.1_spec:jar:1.1 in the shaded jar.
      1436 6/14/11 5:14 PM EXEC [INFO] Including org.apache.geronimo.specs:geronimo-jaxb_2.2_spec:jar:1.0.1 in the shaded jar.
      1437 6/14/11 5:14 PM EXEC [INFO] Including org.apache.geronimo.specs:geronimo-jaxr_1.0_spec:jar:2.1 in the shaded jar.
      1438 6/14/11 5:14 PM EXEC [INFO] Including org.apache.geronimo.specs:geronimo-jaxrpc_1.1_spec:jar:2.1 in the shaded jar.
      1439 6/14/11 5:14 PM EXEC [INFO] Including org.apache.geronimo.specs:geronimo-jaxws_2.2_spec:jar:1.0 in the shaded jar.
      1440 6/14/11 5:14 PM EXEC [INFO] Including org.apache.geronimo.specs:geronimo-jcdi_1.0_spec:jar:1.0 in the shaded jar.
      1441 6/14/11 5:14 PM EXEC [INFO] Including org.apache.geronimo.specs:geronimo-jms_1.1_spec:jar:1.1.1 in the shaded jar.
      1442 6/14/11 5:14 PM EXEC [INFO] Including org.apache.geronimo.specs:geronimo-jpa_2.0_spec:jar:1.1 in the shaded jar.
      1443 6/14/11 5:14 PM EXEC [INFO] Including org.apache.geronimo.specs:geronimo-jsp_2.2_spec:jar:1.0 in the shaded jar.
      1444 6/14/11 5:14 PM EXEC [INFO] Including org.apache.geronimo.specs:geronimo-jta_1.1_spec:jar:1.1.1 in the shaded jar.
      1445 6/14/11 5:14 PM EXEC [INFO] Including org.apache.geronimo.specs:geronimo-saaj_1.3_spec:jar:1.1 in the shaded jar.
      1446 6/14/11 5:14 PM EXEC [INFO] Including org.apache.geronimo.specs:geronimo-servlet_3.0_spec:jar:1.0 in the shaded jar.
      1447 6/14/11 5:14 PM EXEC [INFO] Including org.apache.geronimo.specs:geronimo-stax-api_1.2_spec:jar:1.0 in the shaded jar.
      1448 6/14/11 5:14 PM EXEC [INFO] Including org.apache.geronimo.specs:geronimo-validation_1.0_spec:jar:1.1 in the shaded jar.
      1449 6/14/11 5:14 PM EXEC [INFO] Including org.apache.geronimo.specs:geronimo-ws-metadata_2.0_spec:jar:1.1.3 in the shaded jar.
      1450 6/14/11 5:14 PM EXEC [WARNING] We have a duplicate org/apache/geronimo/osgi/locator/Activator.class in /home/wasce/.m2/repository/org/apache/geronimo/specs/geronimo-el_2.2_spec/1.0/geronimo-el_2.2_spec-1.0.jar
      1451 6/14/11 5:14 PM EXEC [WARNING] We have a duplicate org/apache/geronimo/osgi/locator/ProviderLocator.class in /home/wasce/.m2/repository/org/apache/geronimo/specs/geronimo-el_2.2_spec/1.0/geronimo-el_2.2_spec-1.0.jar
      1452 6/14/11 5:14 PM EXEC [WARNING] We have a duplicate org/apache/geronimo/osgi/locator/Activator.class in /home/wasce/.m2/repository/org/apache/geronimo/specs/geronimo-jacc_1.4_spec/1.0/geronimo-jacc_1.4_spec-1.0.jar
      1453 6/14/11 5:14 PM EXEC [WARNING] We have a duplicate org/apache/geronimo/osgi/locator/ProviderLocator.class in /home/wasce/.m2/repository/org/apache/geronimo/specs/geronimo-jacc_1.4_spec/1.0/geronimo-jacc_1.4_spec-1.0.jar
      1454 6/14/11 5:14 PM EXEC [WARNING] We have a duplicate org/apache/geronimo/osgi/locator/Activator.class in /home/wasce/.m2/repository/org/apache/geronimo/specs/geronimo-jaspic_1.0_spec/1.1/geronimo-jaspic_1.0_spec-1.1.jar
      1455 6/14/11 5:14 PM EXEC [WARNING] We have a duplicate org/apache/geronimo/osgi/locator/ProviderLocator.class in /home/wasce/.m2/repository/org/apache/geronimo/specs/geronimo-jaspic_1.0_spec/1.1/geronimo-jaspic_1.0_spec-1.1.jar
      1456 6/14/11 5:14 PM EXEC [WARNING] We have a duplicate org/apache/geronimo/osgi/locator/Activator.class in /home/wasce/.m2/repository/org/apache/geronimo/specs/geronimo-jaxb_2.2_spec/1.0.1/geronimo-jaxb_2.2_spec-1.0.1.jar
      1457 6/14/11 5:14 PM EXEC [WARNING] We have a duplicate org/apache/geronimo/osgi/locator/ProviderLocator.class in /home/wasce/.m2/repository/org/apache/geronimo/specs/geronimo-jaxb_2.2_spec/1.0.1/geronimo-jaxb_2.2_spec-1.0.1.jar
      1458 6/14/11 5:14 PM EXEC [WARNING] We have a duplicate org/apache/geronimo/osgi/locator/Activator.class in /home/wasce/.m2/repository/org/apache/geronimo/specs/geronimo-jaxr_1.0_spec/2.1/geronimo-jaxr_1.0_spec-2.1.jar
      1459 6/14/11 5:14 PM EXEC [WARNING] We have a duplicate org/apache/geronimo/osgi/locator/ProviderLocator.class in /home/wasce/.m2/repository/org/apache/geronimo/specs/geronimo-jaxr_1.0_spec/2.1/geronimo-jaxr_1.0_spec-2.1.jar
      1460 6/14/11 5:14 PM EXEC [WARNING] We have a duplicate org/apache/geronimo/osgi/locator/Activator.class in /home/wasce/.m2/repository/org/apache/geronimo/specs/geronimo-jaxrpc_1.1_spec/2.1/geronimo-jaxrpc_1.1_spec-2.1.jar
      1461 6/14/11 5:14 PM EXEC [WARNING] We have a duplicate org/apache/geronimo/osgi/locator/ProviderLocator.class in /home/wasce/.m2/repository/org/apache/geronimo/specs/geronimo-jaxrpc_1.1_spec/2.1/geronimo-jaxrpc_1.1_spec-2.1.jar
      1462 6/14/11 5:14 PM EXEC [WARNING] We have a duplicate org/apache/geronimo/osgi/locator/Activator.class in /home/wasce/.m2/repository/org/apache/geronimo/specs/geronimo-jaxws_2.2_spec/1.0/geronimo-jaxws_2.2_spec-1.0.jar
      1463 6/14/11 5:14 PM EXEC [WARNING] We have a duplicate org/apache/geronimo/osgi/locator/ProviderLocator.class in /home/wasce/.m2/repository/org/apache/geronimo/specs/geronimo-jaxws_2.2_spec/1.0/geronimo-jaxws_2.2_spec-1.0.jar
      1464 6/14/11 5:14 PM EXEC [WARNING] We have a duplicate org/apache/geronimo/osgi/locator/Activator.class in /home/wasce/.m2/repository/org/apache/geronimo/specs/geronimo-jpa_2.0_spec/1.1/geronimo-jpa_2.0_spec-1.1.jar
      1465 6/14/11 5:14 PM EXEC [WARNING] We have a duplicate org/apache/geronimo/osgi/locator/ProviderLocator.class in /home/wasce/.m2/repository/org/apache/geronimo/specs/geronimo-jpa_2.0_spec/1.1/geronimo-jpa_2.0_spec-1.1.jar
      1466 6/14/11 5:14 PM EXEC [WARNING] We have a duplicate org/apache/geronimo/osgi/locator/Activator.class in /home/wasce/.m2/repository/org/apache/geronimo/specs/geronimo-saaj_1.3_spec/1.1/geronimo-saaj_1.3_spec-1.1.jar
      1467 6/14/11 5:14 PM EXEC [WARNING] We have a duplicate org/apache/geronimo/osgi/locator/ProviderLocator.class in /home/wasce/.m2/repository/org/apache/geronimo/specs/geronimo-saaj_1.3_spec/1.1/geronimo-saaj_1.3_spec-1.1.jar
      1468 6/14/11 5:14 PM EXEC [WARNING] We have a duplicate org/apache/geronimo/osgi/locator/Activator.class in /home/wasce/.m2/repository/org/apache/geronimo/specs/geronimo-stax-api_1.2_spec/1.0/geronimo-stax-api_1.2_spec-1.0.jar
      1469 6/14/11 5:14 PM EXEC [WARNING] We have a duplicate org/apache/geronimo/osgi/locator/ProviderLocator.class in /home/wasce/.m2/repository/org/apache/geronimo/specs/geronimo-stax-api_1.2_spec/1.0/geronimo-stax-api_1.2_spec-1.0.jar
      1470 6/14/11 5:14 PM EXEC [WARNING] We have a duplicate org/apache/geronimo/osgi/locator/Activator.class in /home/wasce/.m2/repository/org/apache/geronimo/specs/geronimo-validation_1.0_spec/1.1/geronimo-validation_1.0_spec-1.1.jar
      1471 6/14/11 5:14 PM EXEC [WARNING] We have a duplicate org/apache/geronimo/osgi/locator/ProviderLocator.class in /home/wasce/.m2/repository/org/apache/geronimo/specs/geronimo-validation_1.0_spec/1.1/geronimo-validation_1.0_spec-1.1.jar
      1472 6/14/11 5:14 PM EXEC [INFO] Replacing original artifact with shaded artifact.
      1473 6/14/11 5:14 PM EXEC [INFO] Replacing /home/wasce/bfwork/dep_openejb/work/deps/javaee-api/target/javaee-api-6.0-SNAPSHOT.jar with /home/wasce/bfwork/dep_openejb/work/deps/javaee-api/target/javaee-api-6.0-SNAPSHOT-shaded.jar
      1474 6/14/11 5:14 PM EXEC [INFO] [antrun:run

      {execution: default}

      ]
      1475 6/14/11 5:14 PM EXEC project.artifactId
      1476 6/14/11 5:14 PM EXEC [INFO] Executing tasks
      1477 6/14/11 5:14 PM EXEC [unzip] Expanding: /home/wasce/bfwork/dep_openejb/work/deps/javaee-api/target/javaee-api-6.0-SNAPSHOT.jar into /home/wasce/bfwork/dep_openejb/work/deps/javaee-api/target/classes
      1478 6/14/11 5:14 PM EXEC [INFO] Executed tasks
      1479 6/14/11 5:14 PM EXEC [INFO] [install:install

      {execution: default-install}

      ]
      1480 6/14/11 5:14 PM EXEC [INFO] Installing /home/wasce/bfwork/dep_openejb/work/deps/javaee-api/target/javaee-api-6.0-SNAPSHOT.jar to /home/wasce/.m2/repository/org/apache/openejb/javaee-api/6.0-SNAPSHOT/javaee-api-6.0-SNAPSHOT.jar
      1481 6/14/11 5:14 PM EXEC [INFO] ------------------------------------------------------------------------
      1482 6/14/11 5:14 PM EXEC [INFO] Building OpenEJB :: iTests
      1483 6/14/11 5:14 PM EXEC [INFO] task-segment: [clean, install]
      1484 6/14/11 5:14 PM EXEC [INFO] ------------------------------------------------------------------------
      1485 6/14/11 5:14 PM EXEC [INFO] [clean:clean

      {execution: default-clean}

      ]
      1486 6/14/11 5:14 PM EXEC [INFO] Deleting /home/wasce/bfwork/dep_openejb/work/itests/target
      1487 6/14/11 5:14 PM EXEC [INFO] [remote-resources:process

      {execution: default}

      ]
      1488 6/14/11 5:14 PM EXEC [INFO] [dependency-report:report

      {execution: default}

      ]
      1489 6/14/11 5:14 PM EXEC [INFO] No dependencies to report
      1490 6/14/11 5:14 PM EXEC [INFO] [bundle:manifest

      {execution: bundle-manifest}

      ]
      1491 6/14/11 5:14 PM EXEC [WARNING] Ignoring project type pom - supportedProjectTypes = [jar, bundle]
      1492 6/14/11 5:14 PM EXEC [INFO] [site:attach-descriptor

      {execution: default-attach-descriptor}

      ]
      1493 6/14/11 5:14 PM EXEC [INFO] [install:install

      {execution: default-install}

      ]
      1494 6/14/11 5:14 PM EXEC [INFO] Installing /home/wasce/bfwork/dep_openejb/work/itests/pom.xml to /home/wasce/.m2/repository/org/apache/openejb/itests/4.0.0-SNAPSHOT/itests-4.0.0-SNAPSHOT.pom
      1495 6/14/11 5:14 PM EXEC [INFO] ------------------------------------------------------------------------
      1496 6/14/11 5:14 PM EXEC [INFO] Building OpenEJB :: iTests Beans
      1497 6/14/11 5:14 PM EXEC [INFO] task-segment: [clean, install]
      1498 6/14/11 5:14 PM EXEC [INFO] ------------------------------------------------------------------------
      1499 6/14/11 5:14 PM EXEC [INFO] [clean:clean

      {execution: default-clean}

      ]
      1500 6/14/11 5:14 PM EXEC [INFO] Deleting /home/wasce/bfwork/dep_openejb/work/itests/openejb-itests-beans/target
      1501 6/14/11 5:14 PM EXEC [INFO] [remote-resources:process

      {execution: default}

      ]
      1502 6/14/11 5:14 PM EXEC [INFO] [resources:resources

      {execution: default-resources}

      ]
      1503 6/14/11 5:14 PM EXEC [INFO] Using 'UTF-8' encoding to copy filtered resources.
      1504 6/14/11 5:14 PM EXEC [INFO] Copying 4 resources
      1505 6/14/11 5:14 PM EXEC [INFO] Copying 3 resources
      1506 6/14/11 5:14 PM EXEC [INFO] [compiler:compile

      {execution: default-compile}

      ]
      1507 6/14/11 5:14 PM EXEC [INFO] Compiling 222 source files to /home/wasce/bfwork/dep_openejb/work/itests/openejb-itests-beans/target/classes
      1508 6/14/11 5:14 PM EXEC [INFO] [dependency-report:report

      {execution: default}

      ]
      1509 6/14/11 5:14 PM EXEC [INFO] [bundle:manifest

      {execution: bundle-manifest}

      ]
      1510 6/14/11 5:14 PM EXEC [INFO] [resources:testResources

      {execution: default-testResources}

      ]
      1511 6/14/11 5:14 PM EXEC [INFO] Using 'UTF-8' encoding to copy filtered resources.
      1512 6/14/11 5:14 PM EXEC [INFO] skip non existing resourceDirectory /home/wasce/bfwork/dep_openejb/work/itests/openejb-itests-beans/src/test/resources
      1513 6/14/11 5:14 PM EXEC [INFO] Copying 3 resources
      1514 6/14/11 5:14 PM EXEC [INFO] [compiler:testCompile

      {execution: default-testCompile}

      ]
      1515 6/14/11 5:14 PM EXEC [INFO] Not compiling test sources
      1516 6/14/11 5:14 PM EXEC [INFO] [surefire:test

      {execution: default-test}

      ]
      1517 6/14/11 5:14 PM EXEC [INFO] Tests are skipped.
      1518 6/14/11 5:14 PM EXEC [INFO] [jar:jar

      {execution: default-jar}

      ]
      1519 6/14/11 5:14 PM EXEC [INFO] Building jar: /home/wasce/bfwork/dep_openejb/work/itests/openejb-itests-beans/target/openejb-itests-beans-4.0.0-SNAPSHOT.jar
      1520 6/14/11 5:14 PM EXEC [INFO] [install:install

      {execution: default-install}

      ]
      1521 6/14/11 5:14 PM EXEC [INFO] Installing /home/wasce/bfwork/dep_openejb/work/itests/openejb-itests-beans/target/openejb-itests-beans-4.0.0-SNAPSHOT.jar to /home/wasce/.m2/repository/org/apache/openejb/openejb-itests-beans/4.0.0-SNAPSHOT/openejb-itests-beans-4.0.0-SNAPSHOT.jar
      1522 6/14/11 5:14 PM EXEC [INFO] ------------------------------------------------------------------------
      1523 6/14/11 5:14 PM EXEC [INFO] Building OpenEJB :: iTests Servlets
      1524 6/14/11 5:14 PM EXEC [INFO] task-segment: [clean, install]
      1525 6/14/11 5:14 PM EXEC [INFO] ------------------------------------------------------------------------
      1526 6/14/11 5:14 PM EXEC [INFO] [clean:clean

      {execution: default-clean}

      ]
      1527 6/14/11 5:14 PM EXEC [INFO] Deleting /home/wasce/bfwork/dep_openejb/work/itests/openejb-itests-servlets/target
      1528 6/14/11 5:14 PM EXEC [INFO] [remote-resources:process

      {execution: default}

      ]
      1529 6/14/11 5:14 PM EXEC [INFO] [resources:resources

      {execution: default-resources}

      ]
      1530 6/14/11 5:14 PM EXEC [INFO] Using 'UTF-8' encoding to copy filtered resources.
      1531 6/14/11 5:14 PM EXEC [INFO] Copying 0 resource
      1532 6/14/11 5:14 PM EXEC [INFO] Copying 3 resources
      1533 6/14/11 5:14 PM EXEC [INFO] [compiler:compile

      {execution: default-compile}

      ]
      1534 6/14/11 5:14 PM EXEC [INFO] Compiling 13 source files to /home/wasce/bfwork/dep_openejb/work/itests/openejb-itests-servlets/target/classes
      1535 6/14/11 5:14 PM EXEC [INFO] [dependency-report:report

      {execution: default}

      ]
      1536 6/14/11 5:14 PM EXEC [INFO] [bundle:manifest

      {execution: bundle-manifest}

      ]
      1537 6/14/11 5:14 PM EXEC [INFO] [resources:testResources

      {execution: default-testResources}

      ]
      1538 6/14/11 5:14 PM EXEC [INFO] Using 'UTF-8' encoding to copy filtered resources.
      1539 6/14/11 5:14 PM EXEC [INFO] skip non existing resourceDirectory /home/wasce/bfwork/dep_openejb/work/itests/openejb-itests-servlets/src/test/resources
      1540 6/14/11 5:14 PM EXEC [INFO] Copying 3 resources
      1541 6/14/11 5:14 PM EXEC [INFO] [compiler:testCompile

      {execution: default-testCompile}

      ]
      1542 6/14/11 5:14 PM EXEC [INFO] Not compiling test sources
      1543 6/14/11 5:14 PM EXEC [INFO] [surefire:test

      {execution: default-test}

      ]
      1544 6/14/11 5:14 PM EXEC [INFO] Tests are skipped.
      1545 6/14/11 5:14 PM EXEC [INFO] [jar:jar

      {execution: default-jar}

      ]
      1546 6/14/11 5:14 PM EXEC [INFO] Building jar: /home/wasce/bfwork/dep_openejb/work/itests/openejb-itests-servlets/target/openejb-itests-servlets-4.0.0-SNAPSHOT.jar
      1547 6/14/11 5:14 PM EXEC [INFO] [install:install

      {execution: default-install}

      ]
      1548 6/14/11 5:14 PM EXEC [INFO] Installing /home/wasce/bfwork/dep_openejb/work/itests/openejb-itests-servlets/target/openejb-itests-servlets-4.0.0-SNAPSHOT.jar to /home/wasce/.m2/repository/org/apache/openejb/openejb-itests-servlets/4.0.0-SNAPSHOT/openejb-itests-servlets-4.0.0-SNAPSHOT.jar
      1549 6/14/11 5:14 PM EXEC [INFO] ------------------------------------------------------------------------
      1550 6/14/11 5:14 PM EXEC [INFO] Building OpenEJB :: iTests Client
      1551 6/14/11 5:14 PM EXEC [INFO] task-segment: [clean, install]
      1552 6/14/11 5:14 PM EXEC [INFO] ------------------------------------------------------------------------
      1553 6/14/11 5:14 PM EXEC [INFO] [clean:clean

      {execution: default-clean}

      ]
      1554 6/14/11 5:14 PM EXEC [INFO] Deleting /home/wasce/bfwork/dep_openejb/work/itests/openejb-itests-client/target
      1555 6/14/11 5:14 PM EXEC [INFO] [remote-resources:process

      {execution: default}

      ]
      1556 6/14/11 5:14 PM EXEC [WARNING] org.apache.velocity.runtime.exception.ReferenceException: reference : template = META-INF/DEPENDENCIES.vm [line 40,column 14] : $license.name is not a valid reference.
      1557 6/14/11 5:14 PM EXEC [WARNING] org.apache.velocity.runtime.exception.ReferenceException: reference : template = META-INF/DEPENDENCIES.vm [line 40,column 14] : $license.name is not a valid reference.
      1558 6/14/11 5:14 PM EXEC [INFO] [resources:resources

      {execution: default-resources}

      ]
      1559 6/14/11 5:14 PM EXEC [INFO] Using 'UTF-8' encoding to copy filtered resources.
      1560 6/14/11 5:14 PM EXEC [INFO] Copying 4 resources
      1561 6/14/11 5:14 PM EXEC [INFO] Copying 3 resources
      1562 6/14/11 5:14 PM EXEC [INFO] [compiler:compile

      {execution: default-compile}

      ]
      1563 6/14/11 5:14 PM EXEC [INFO] Compiling 280 source files to /home/wasce/bfwork/dep_openejb/work/itests/openejb-itests-client/target/classes
      1564 6/14/11 5:14 PM EXEC [INFO] [dependency-report:report

      {execution: default}

      ]
      1565 6/14/11 5:14 PM EXEC [INFO] [bundle:manifest

      {execution: bundle-manifest}

      ]
      1566 6/14/11 5:14 PM EXEC [WARNING] DEPRECATED [tasks]: Use target instead
      1567 6/14/11 5:14 PM EXEC [INFO] [antrun:run

      {execution: default}

      ]
      1568 6/14/11 5:14 PM EXEC [WARNING] Parameter tasks is deprecated, use target instead
      1569 6/14/11 5:14 PM EXEC [INFO] Executing tasks
      1570 6/14/11 5:14 PM EXEC
      1571 6/14/11 5:14 PM EXEC main:
      1572 6/14/11 5:14 PM EXEC [INFO] Executed tasks
      1573 6/14/11 5:14 PM EXEC [INFO] [resources:testResources

      {execution: default-testResources}

      ]
      1574 6/14/11 5:14 PM EXEC [INFO] Using 'UTF-8' encoding to copy filtered resources.
      1575 6/14/11 5:14 PM EXEC [INFO] skip non existing resourceDirectory /home/wasce/bfwork/dep_openejb/work/itests/openejb-itests-client/src/test/resources
      1576 6/14/11 5:14 PM EXEC [INFO] Copying 3 resources
      1577 6/14/11 5:14 PM EXEC [INFO] [compiler:testCompile

      {execution: default-testCompile}

      ]
      1578 6/14/11 5:14 PM EXEC [INFO] Not compiling test sources
      1579 6/14/11 5:14 PM EXEC [INFO] [surefire:test

      {execution: default-test}

      ]
      1580 6/14/11 5:14 PM EXEC [INFO] Tests are skipped.
      1581 6/14/11 5:14 PM EXEC [INFO] [jar:jar

      {execution: default-jar}

      ]
      1582 6/14/11 5:14 PM EXEC [INFO] Building jar: /home/wasce/bfwork/dep_openejb/work/itests/openejb-itests-client/target/openejb-itests-client-4.0.0-SNAPSHOT.jar
      1583 6/14/11 5:14 PM EXEC [INFO] [install:install

      {execution: default-install}

      ]
      1584 6/14/11 5:14 PM EXEC [INFO] Installing /home/wasce/bfwork/dep_openejb/work/itests/openejb-itests-client/target/openejb-itests-client-4.0.0-SNAPSHOT.jar to /home/wasce/.m2/repository/org/apache/openejb/openejb-itests-client/4.0.0-SNAPSHOT/openejb-itests-client-4.0.0-SNAPSHOT.jar
      1585 6/14/11 5:14 PM EXEC [INFO] ------------------------------------------------------------------------
      1586 6/14/11 5:14 PM EXEC [INFO] Building OpenEJB :: iTests Interceptor Beans
      1587 6/14/11 5:14 PM EXEC [INFO] task-segment: [clean, install]
      1588 6/14/11 5:14 PM EXEC [INFO] ------------------------------------------------------------------------
      1589 6/14/11 5:14 PM EXEC [INFO] [clean:clean

      {execution: default-clean}

      ]
      1590 6/14/11 5:14 PM EXEC [INFO] Deleting /home/wasce/bfwork/dep_openejb/work/itests/openejb-itests-interceptor-beans/target
      1591 6/14/11 5:14 PM EXEC [INFO] [remote-resources:process

      {execution: default}

      ]
      1592 6/14/11 5:14 PM EXEC [INFO] [resources:resources

      {execution: default-resources}

      ]
      1593 6/14/11 5:14 PM EXEC [INFO] Using 'UTF-8' encoding to copy filtered resources.
      1594 6/14/11 5:14 PM EXEC [INFO] Copying 1 resource
      1595 6/14/11 5:14 PM EXEC [INFO] Copying 3 resources
      1596 6/14/11 5:14 PM EXEC [INFO] [compiler:compile

      {execution: default-compile}

      ]
      1597 6/14/11 5:14 PM EXEC [INFO] Compiling 6 source files to /home/wasce/bfwork/dep_openejb/work/itests/openejb-itests-interceptor-beans/target/classes
      1598 6/14/11 5:14 PM EXEC [INFO] [dependency-report:report

      {execution: default}

      ]
      1599 6/14/11 5:14 PM EXEC [INFO] [bundle:manifest

      {execution: bundle-manifest}

      ]
      1600 6/14/11 5:14 PM EXEC [INFO] [resources:testResources

      {execution: default-testResources}

      ]
      1601 6/14/11 5:14 PM EXEC [INFO] Using 'UTF-8' encoding to copy filtered resources.
      1602 6/14/11 5:14 PM EXEC [INFO] skip non existing resourceDirectory /home/wasce/bfwork/dep_openejb/work/itests/openejb-itests-interceptor-beans/src/test/resources
      1603 6/14/11 5:14 PM EXEC [INFO] Copying 3 resources
      1604 6/14/11 5:14 PM EXEC [INFO] [compiler:testCompile

      {execution: default-testCompile}

      ]
      1605 6/14/11 5:14 PM EXEC [INFO] Not compiling test sources
      1606 6/14/11 5:14 PM EXEC [INFO] [surefire:test

      {execution: default-test}

      ]
      1607 6/14/11 5:14 PM EXEC [INFO] Tests are skipped.
      1608 6/14/11 5:14 PM EXEC [INFO] [jar:jar

      {execution: default-jar}

      ]
      1609 6/14/11 5:14 PM EXEC [INFO] Building jar: /home/wasce/bfwork/dep_openejb/work/itests/openejb-itests-interceptor-beans/target/openejb-itests-interceptor-beans-4.0.0-SNAPSHOT.jar
      1610 6/14/11 5:14 PM EXEC [INFO] [install:install

      {execution: default-install}

      ]
      1611 6/14/11 5:14 PM EXEC [INFO] Installing /home/wasce/bfwork/dep_openejb/work/itests/openejb-itests-interceptor-beans/target/openejb-itests-interceptor-beans-4.0.0-SNAPSHOT.jar to /home/wasce/.m2/repository/org/apache/openejb/openejb-itests-interceptor-beans/4.0.0-SNAPSHOT/openejb-itests-interceptor-beans-4.0.0-SNAPSHOT.jar
      1612 6/14/11 5:14 PM EXEC [INFO] ------------------------------------------------------------------------
      1613 6/14/11 5:14 PM EXEC [INFO] Building OpenEJB :: iTests App
      1614 6/14/11 5:14 PM EXEC [INFO] task-segment: [clean, install]
      1615 6/14/11 5:14 PM EXEC [INFO] ------------------------------------------------------------------------
      1616 6/14/11 5:14 PM EXEC [INFO] [clean:clean

      {execution: default-clean}

      ]
      1617 6/14/11 5:14 PM EXEC [INFO] Deleting /home/wasce/bfwork/dep_openejb/work/itests/openejb-itests-app/target
      1618 6/14/11 5:14 PM EXEC [INFO] [remote-resources:process

      {execution: default}

      ]
      1619 6/14/11 5:14 PM EXEC [WARNING] org.apache.velocity.runtime.exception.ReferenceException: reference : template = META-INF/DEPENDENCIES.vm [line 40,column 14] : $license.name is not a valid reference.
      1620 6/14/11 5:14 PM EXEC [WARNING] org.apache.velocity.runtime.exception.ReferenceException: reference : template = META-INF/DEPENDENCIES.vm [line 40,column 14] : $license.name is not a valid reference.
      1621 6/14/11 5:14 PM EXEC [INFO] [resources:resources

      {execution: default-resources}

      ]
      1622 6/14/11 5:14 PM EXEC [INFO] Using 'UTF-8' encoding to copy filtered resources.
      1623 6/14/11 5:14 PM EXEC [INFO] skip non existing resourceDirectory /home/wasce/bfwork/dep_openejb/work/itests/openejb-itests-app/src/main/resources
      1624 6/14/11 5:14 PM EXEC [INFO] Copying 3 resources
      1625 6/14/11 5:14 PM EXEC [INFO] [compiler:compile

      {execution: default-compile}

      ]
      1626 6/14/11 5:14 PM EXEC [INFO] No sources to compile
      1627 6/14/11 5:14 PM EXEC [INFO] [dependency-report:report

      {execution: default}

      ]
      1628 6/14/11 5:14 PM EXEC [INFO] [bundle:manifest

      {execution: bundle-manifest}

      ]
      1629 6/14/11 5:14 PM EXEC [WARNING] Warning in manifest for org.apache.openejb:openejb-itests-app:jar:4.0.0-SNAPSHOT : Superfluous export-package instructions: [org.apache.openejb*]
      1630 6/14/11 5:14 PM EXEC [WARNING] Warning in manifest for org.apache.openejb:openejb-itests-app:jar:4.0.0-SNAPSHOT : Did not find matching referal for *
      1631 6/14/11 5:14 PM EXEC [INFO] [resources:testResources

      {execution: default-testResources}

      ]
      1632 6/14/11 5:14 PM EXEC [INFO] Using 'UTF-8' encoding to copy filtered resources.
      1633 6/14/11 5:14 PM EXEC [INFO] skip non existing resourceDirectory /home/wasce/bfwork/dep_openejb/work/itests/openejb-itests-app/src/test/resources
      1634 6/14/11 5:14 PM EXEC [INFO] Copying 3 resources
      1635 6/14/11 5:14 PM EXEC [INFO] [compiler:testCompile

      {execution: default-testCompile}

      ]
      1636 6/14/11 5:14 PM EXEC [INFO] Not compiling test sources
      1637 6/14/11 5:14 PM EXEC [INFO] [surefire:test

      {execution: default-test}

      ]
      1638 6/14/11 5:14 PM EXEC [INFO] Tests are skipped.
      1639 6/14/11 5:14 PM EXEC [INFO] [jar:jar

      {execution: default-jar}

      ]
      1640 6/14/11 5:14 PM EXEC [INFO] Building jar: /home/wasce/bfwork/dep_openejb/work/itests/openejb-itests-app/target/openejb-itests-app-4.0.0-SNAPSHOT.jar
      1641 6/14/11 5:14 PM EXEC [INFO] [ear:generate-application-xml

      {execution: default}

      ]
      1642 6/14/11 5:14 PM EXEC [INFO] Generating application.xml
      1643 6/14/11 5:14 PM EXEC [INFO] [ear:ear

      {execution: default}

      ]
      1644 6/14/11 5:14 PM EXEC [WARNING] JavaModule is deprecated (jar:junit:junit:4.8.1), please use JarModule instead.
      1645 6/14/11 5:14 PM EXEC [INFO] Copying artifact[jar:junit:junit:4.8.1] to[META-INF/lib/junit-4.8.1.jar]
      1646 6/14/11 5:14 PM EXEC [INFO] Copying artifact[ejb:org.apache.openejb:openejb-itests-beans:4.0.0-SNAPSHOT] to[openejb-itests-beans-4.0.0-SNAPSHOT.jar]
      1647 6/14/11 5:14 PM EXEC [INFO] Copying artifact[ejb:org.apache.openejb:openejb-itests-interceptor-beans:4.0.0-SNAPSHOT] to[openejb-itests-interceptor-beans-4.0.0-SNAPSHOT.jar]
      1648 6/14/11 5:14 PM EXEC [WARNING] JavaModule is deprecated (jar:org.apache.openejb:openejb-itests-client:4.0.0-SNAPSHOT), please use JarModule instead.
      1649 6/14/11 5:14 PM EXEC [INFO] Copying artifact[jar:org.apache.openejb:openejb-itests-client:4.0.0-SNAPSHOT] to[openejb-itests-client-4.0.0-SNAPSHOT.jar]
      1650 6/14/11 5:14 PM EXEC [INFO] Copying artifact[jar:org.apache.activemq:activemq-ra:5.4.2] to[activemq-ra-5.4.2.jar]
      1651 6/14/11 5:14 PM EXEC [INFO] Copying artifact[jar:org.apache.activemq:activemq-core:5.4.2] to[activemq-core-5.4.2.jar]
      1652 6/14/11 5:14 PM EXEC [INFO] Copying artifact[jar:commons-logging:commons-logging-api:1.1] to[commons-logging-api-1.1.jar]
      1653 6/14/11 5:14 PM EXEC [INFO] Copying artifact[jar:org.apache.activemq:activeio-core:3.1.2] to[activeio-core-3.1.2.jar]
      1654 6/14/11 5:14 PM EXEC [INFO] Copying artifact[jar:org.apache.geronimo.specs:geronimo-j2ee-management_1.1_spec:1.0.1] to[geronimo-j2ee-management_1.1_spec-1.0.1.jar]
      1655 6/14/11 5:14 PM EXEC [INFO] Copying artifact[jar:commons-logging:commons-logging:1.1.1] to[commons-logging-1.1.1.jar]
      1656 6/14/11 5:14 PM EXEC [INFO] Copying artifact[jar:org.apache.activemq:kahadb:5.4.2] to[kahadb-5.4.2.jar]
      1657 6/14/11 5:14 PM EXEC [INFO] Copying artifact[jar:org.apache.activemq.protobuf:activemq-protobuf:1.1] to[activemq-protobuf-1.1.jar]
      1658 6/14/11 5:14 PM EXEC [INFO] Copying artifact[jar:org.osgi:org.osgi.core:4.2.0] to[org.osgi.core-4.2.0.jar]
      1659 6/14/11 5:14 PM EXEC [INFO] Copying artifact[jar:org.springframework:spring-context:3.0.5.RELEASE] to[spring-context-3.0.5.RELEASE.jar]
      1660 6/14/11 5:14 PM EXEC [INFO] Copying artifact[jar:org.springframework:spring-aop:3.0.5.RELEASE] to[spring-aop-3.0.5.RELEASE.jar]
      1661 6/14/11 5:14 PM EXEC [INFO] Copying artifact[jar:aopalliance:aopalliance:1.0] to[aopalliance-1.0.jar]
      1662 6/14/11 5:14 PM EXEC [INFO] Copying artifact[jar:org.springframework:spring-asm:3.0.5.RELEASE] to[spring-asm-3.0.5.RELEASE.jar]
      1663 6/14/11 5:14 PM EXEC [INFO] Copying artifact[jar:org.springframework:spring-beans:3.0.5.RELEASE] to[spring-beans-3.0.5.RELEASE.jar]
      1664 6/14/11 5:14 PM EXEC [INFO] Copying artifact[jar:org.springframework:spring-core:3.0.5.RELEASE] to[spring-core-3.0.5.RELEASE.jar]
      1665 6/14/11 5:14 PM EXEC [INFO] Copying artifact[jar:org.springframework:spring-expression:3.0.5.RELEASE] to[spring-expression-3.0.5.RELEASE.jar]
      1666 6/14/11 5:14 PM EXEC [INFO] Copying artifact[jar:commons-net:commons-net:2.0] to[commons-net-2.0.jar]
      1667 6/14/11 5:14 PM EXEC [INFO] Copying artifact[jar:org.apache.xbean:xbean-finder-shaded:3.8-SNAPSHOT] to[xbean-finder-shaded-3.8-SNAPSHOT.jar]
      1668 6/14/11 5:14 PM EXEC [INFO] Copying artifact[jar:org.apache.xbean:xbean-asm-shaded:3.8-SNAPSHOT] to[xbean-asm-shaded-3.8-SNAPSHOT.jar]
      1669 6/14/11 5:14 PM EXEC [INFO] Could not find manifest file: /home/wasce/bfwork/dep_openejb/work/itests/openejb-itests-app/target/openejb-itests-app-4.0.0-SNAPSHOT/META-INF/MANIFEST.MF - Generating one
      1670 6/14/11 5:14 PM EXEC [INFO] Building jar: /home/wasce/bfwork/dep_openejb/work/itests/openejb-itests-app/target/openejb-itests-app-4.0.0-SNAPSHOT.ear
      1671 6/14/11 5:14 PM EXEC [INFO] [install:install

      {execution: default-install}

      ]
      1672 6/14/11 5:14 PM EXEC [INFO] Installing /home/wasce/bfwork/dep_openejb/work/itests/openejb-itests-app/target/openejb-itests-app-4.0.0-SNAPSHOT.ear to /home/wasce/.m2/repository/org/apache/openejb/openejb-itests-app/4.0.0-SNAPSHOT/openejb-itests-app-4.0.0-SNAPSHOT.jar
      1673 6/14/11 5:14 PM EXEC [INFO] ------------------------------------------------------------------------
      1674 6/14/11 5:14 PM EXEC [INFO] Building OpenEJB :: iTests Web
      1675 6/14/11 5:14 PM EXEC [INFO] task-segment: [clean, install]
      1676 6/14/11 5:14 PM EXEC [INFO] ------------------------------------------------------------------------
      1677 6/14/11 5:14 PM EXEC [INFO] [clean:clean

      {execution: default-clean}

      ]
      1678 6/14/11 5:14 PM EXEC [INFO] Deleting /home/wasce/bfwork/dep_openejb/work/itests/openejb-itests-web/target
      1679 6/14/11 5:14 PM EXEC [INFO] [remote-resources:process

      {execution: default}

      ]
      1680 6/14/11 5:14 PM EXEC [INFO] [resources:resources

      {execution: default-resources}

      ]
      1681 6/14/11 5:14 PM EXEC [INFO] Using 'UTF-8' encoding to copy filtered resources.
      1682 6/14/11 5:14 PM EXEC [INFO] skip non existing resourceDirectory /home/wasce/bfwork/dep_openejb/work/itests/openejb-itests-web/src/main/resources
      1683 6/14/11 5:14 PM EXEC [INFO] Copying 3 resources
      1684 6/14/11 5:14 PM EXEC [INFO] [compiler:compile

      {execution: default-compile}

      ]
      1685 6/14/11 5:14 PM EXEC [INFO] No sources to compile
      1686 6/14/11 5:14 PM EXEC [INFO] [dependency-report:report

      {execution: default}

      ]
      1687 6/14/11 5:14 PM EXEC [INFO] [bundle:manifest

      {execution: bundle-manifest}

      ]
      1688 6/14/11 5:14 PM EXEC [WARNING] Ignoring project type war - supportedProjectTypes = [jar, bundle]
      1689 6/14/11 5:14 PM EXEC [INFO] [resources:testResources

      {execution: default-testResources}

      ]
      1690 6/14/11 5:14 PM EXEC [INFO] Using 'UTF-8' encoding to copy filtered resources.
      1691 6/14/11 5:14 PM EXEC [INFO] skip non existing resourceDirectory /home/wasce/bfwork/dep_openejb/work/itests/openejb-itests-web/src/test/resources
      1692 6/14/11 5:14 PM EXEC [INFO] Copying 3 resources
      1693 6/14/11 5:14 PM EXEC [INFO] [compiler:testCompile

      {execution: default-testCompile}

      ]
      1694 6/14/11 5:14 PM EXEC [INFO] Not compiling test sources
      1695 6/14/11 5:14 PM EXEC [INFO] [surefire:test

      {execution: default-test}

      ]
      1696 6/14/11 5:14 PM EXEC [INFO] Tests are skipped.
      1697 6/14/11 5:14 PM EXEC [INFO] [war:war

      {execution: default-war}

      ]
      1698 6/14/11 5:14 PM EXEC [INFO] Packaging webapp
      1699 6/14/11 5:14 PM EXEC [INFO] Assembling webapp[openejb-itests-web] in [/home/wasce/bfwork/dep_openejb/work/itests/openejb-itests-web/target/openejb-itests-web-4.0.0-SNAPSHOT]
      1700 6/14/11 5:14 PM EXEC [INFO] Processing war project
      1701 6/14/11 5:14 PM EXEC [INFO] Copying webapp resources[/home/wasce/bfwork/dep_openejb/work/itests/openejb-itests-web/src/main/webapp]
      1702 6/14/11 5:14 PM EXEC [INFO] Webapp assembled in[46 msecs]
      1703 6/14/11 5:14 PM EXEC [INFO] Building war: /home/wasce/bfwork/dep_openejb/work/itests/openejb-itests-web/target/openejb-itests-web-4.0.0-SNAPSHOT.war
      1704 6/14/11 5:14 PM EXEC [INFO] [install:install

      {execution: default-install}

      ]
      1705 6/14/11 5:14 PM EXEC [INFO] Installing /home/wasce/bfwork/dep_openejb/work/itests/openejb-itests-web/target/openejb-itests-web-4.0.0-SNAPSHOT.war to /home/wasce/.m2/repository/org/apache/openejb/openejb-itests-web/4.0.0-SNAPSHOT/openejb-itests-web-4.0.0-SNAPSHOT.war
      1706 6/14/11 5:14 PM EXEC [INFO] ------------------------------------------------------------------------
      1707 6/14/11 5:14 PM EXEC [INFO] Building OpenEJB :: Container
      1708 6/14/11 5:14 PM EXEC [INFO] task-segment: [clean, install]
      1709 6/14/11 5:14 PM EXEC [INFO] ------------------------------------------------------------------------
      1710 6/14/11 5:14 PM EXEC [INFO] [clean:clean

      {execution: default-clean}

      ]
      1711 6/14/11 5:14 PM EXEC [INFO] Deleting /home/wasce/bfwork/dep_openejb/work/container/target
      1712 6/14/11 5:14 PM EXEC [INFO] [remote-resources:process

      {execution: default}

      ]
      1713 6/14/11 5:14 PM EXEC [INFO] [dependency-report:report

      {execution: default}

      ]
      1714 6/14/11 5:14 PM EXEC [INFO] No dependencies to report
      1715 6/14/11 5:14 PM EXEC [INFO] [bundle:manifest

      {execution: bundle-manifest}

      ]
      1716 6/14/11 5:14 PM EXEC [WARNING] Ignoring project type pom - supportedProjectTypes = [jar, bundle]
      1717 6/14/11 5:14 PM EXEC [INFO] [site:attach-descriptor

      {execution: default-attach-descriptor}

      ]
      1718 6/14/11 5:14 PM EXEC [INFO] [install:install

      {execution: default-install}

      ]
      1719 6/14/11 5:14 PM EXEC [INFO] Installing /home/wasce/bfwork/dep_openejb/work/container/pom.xml to /home/wasce/.m2/repository/org/apache/openejb/container/4.0.0-SNAPSHOT/container-4.0.0-SNAPSHOT.pom
      1720 6/14/11 5:14 PM EXEC [INFO] ------------------------------------------------------------------------
      1721 6/14/11 5:14 PM EXEC [INFO] Building OpenEJB :: Container :: API
      1722 6/14/11 5:14 PM EXEC [INFO] task-segment: [clean, install]
      1723 6/14/11 5:14 PM EXEC [INFO] ------------------------------------------------------------------------
      1724 6/14/11 5:14 PM EXEC [INFO] [clean:clean

      {execution: default-clean}

      ]
      1725 6/14/11 5:14 PM EXEC [INFO] Deleting /home/wasce/bfwork/dep_openejb/work/container/openejb-api/target
      1726 6/14/11 5:14 PM EXEC [INFO] [remote-resources:process

      {execution: default}

      ]
      1727 6/14/11 5:14 PM EXEC [INFO] [resources:resources

      {execution: default-resources}

      ]
      1728 6/14/11 5:14 PM EXEC [INFO] Using 'UTF-8' encoding to copy filtered resources.
      1729 6/14/11 5:14 PM EXEC [INFO] Copying 0 resource
      1730 6/14/11 5:14 PM EXEC [INFO] Copying 3 resources
      1731 6/14/11 5:14 PM EXEC [INFO] [compiler:compile

      {execution: default-compile}

      ]
      1732 6/14/11 5:14 PM EXEC [INFO] Compiling 4 source files to /home/wasce/bfwork/dep_openejb/work/container/openejb-api/target/classes
      1733 6/14/11 5:14 PM EXEC [INFO] [dependency-report:report

      {execution: default}

      ]
      1734 6/14/11 5:14 PM EXEC [INFO] No dependencies to report
      1735 6/14/11 5:14 PM EXEC [INFO] [bundle:manifest

      {execution: bundle-manifest}

      ]
      1736 6/14/11 5:14 PM EXEC [INFO] [resources:testResources

      {execution: default-testResources}

      ]
      1737 6/14/11 5:14 PM EXEC [INFO] Using 'UTF-8' encoding to copy filtered resources.
      1738 6/14/11 5:14 PM EXEC [INFO] Copying 0 resource
      1739 6/14/11 5:14 PM EXEC [INFO] Copying 3 resources
      1740 6/14/11 5:14 PM EXEC [INFO] [compiler:testCompile

      {execution: default-testCompile}

      ]
      1741 6/14/11 5:14 PM EXEC [INFO] Not compiling test sources
      1742 6/14/11 5:14 PM EXEC [INFO] [surefire:test

      {execution: default-test}

      ]
      1743 6/14/11 5:14 PM EXEC [INFO] Tests are skipped.
      1744 6/14/11 5:14 PM EXEC [INFO] [jar:jar

      {execution: default-jar}

      ]
      1745 6/14/11 5:14 PM EXEC [INFO] Building jar: /home/wasce/bfwork/dep_openejb/work/container/openejb-api/target/openejb-api-4.0.0-SNAPSHOT.jar
      1746 6/14/11 5:14 PM EXEC [INFO] [install:install

      {execution: default-install}

      ]
      1747 6/14/11 5:14 PM EXEC [INFO] Installing /home/wasce/bfwork/dep_openejb/work/container/openejb-api/target/openejb-api-4.0.0-SNAPSHOT.jar to /home/wasce/.m2/repository/org/apache/openejb/openejb-api/4.0.0-SNAPSHOT/openejb-api-4.0.0-SNAPSHOT.jar
      1748 6/14/11 5:14 PM EXEC [INFO] ------------------------------------------------------------------------
      1749 6/14/11 5:14 PM EXEC [INFO] Building OpenEJB :: Container :: Loader
      1750 6/14/11 5:14 PM EXEC [INFO] task-segment: [clean, install]
      1751 6/14/11 5:14 PM EXEC [INFO] ------------------------------------------------------------------------
      1752 6/14/11 5:14 PM EXEC [INFO] [clean:clean

      {execution: default-clean}

      ]
      1753 6/14/11 5:14 PM EXEC [INFO] Deleting /home/wasce/bfwork/dep_openejb/work/container/openejb-loader/target
      1754 6/14/11 5:14 PM EXEC [INFO] [remote-resources:process

      {execution: default}

      ]
      1755 6/14/11 5:14 PM EXEC [INFO] [resources:resources

      {execution: default-resources}

      ]
      1756 6/14/11 5:14 PM EXEC [INFO] Using 'UTF-8' encoding to copy filtered resources.
      1757 6/14/11 5:14 PM EXEC [INFO] skip non existing resourceDirectory /home/wasce/bfwork/dep_openejb/work/container/openejb-loader/src/main/resources
      1758 6/14/11 5:14 PM EXEC [INFO] Copying 3 resources
      1759 6/14/11 5:14 PM EXEC [INFO] [compiler:compile

      {execution: default-compile}

      ]
      1760 6/14/11 5:14 PM EXEC [INFO] Compiling 14 source files to /home/wasce/bfwork/dep_openejb/work/container/openejb-loader/target/classes
      1761 6/14/11 5:14 PM EXEC [INFO] [dependency-report:report

      {execution: default}

      ]
      1762 6/14/11 5:14 PM EXEC [INFO] [bundle:manifest

      {execution: bundle-manifest}

      ]
      1763 6/14/11 5:14 PM EXEC [INFO] [resources:testResources

      {execution: default-testResources}

      ]
      1764 6/14/11 5:14 PM EXEC [INFO] Using 'UTF-8' encoding to copy filtered resources.
      1765 6/14/11 5:14 PM EXEC [INFO] skip non existing resourceDirectory /home/wasce/bfwork/dep_openejb/work/container/openejb-loader/src/test/resources
      1766 6/14/11 5:14 PM EXEC [INFO] Copying 3 resources
      1767 6/14/11 5:14 PM EXEC [INFO] [compiler:testCompile

      {execution: default-testCompile}

      ]
      1768 6/14/11 5:14 PM EXEC [INFO] Not compiling test sources
      1769 6/14/11 5:14 PM EXEC [INFO] [surefire:test

      {execution: default-test}

      ]
      1770 6/14/11 5:14 PM EXEC [INFO] Tests are skipped.
      1771 6/14/11 5:14 PM EXEC [INFO] [jar:jar

      {execution: default-jar}

      ]
      1772 6/14/11 5:14 PM EXEC [INFO] Building jar: /home/wasce/bfwork/dep_openejb/work/container/openejb-loader/target/openejb-loader-4.0.0-SNAPSHOT.jar
      1773 6/14/11 5:14 PM EXEC [INFO] [install:install

      {execution: default-install}

      ]
      1774 6/14/11 5:14 PM EXEC [INFO] Installing /home/wasce/bfwork/dep_openejb/work/container/openejb-loader/target/openejb-loader-4.0.0-SNAPSHOT.jar to /home/wasce/.m2/repository/org/apache/openejb/openejb-loader/4.0.0-SNAPSHOT/openejb-loader-4.0.0-SNAPSHOT.jar
      1775 6/14/11 5:14 PM EXEC [INFO] ------------------------------------------------------------------------
      1776 6/14/11 5:14 PM EXEC [INFO] Building OpenEJB :: Container :: Java Agent
      1777 6/14/11 5:14 PM EXEC [INFO] task-segment: [clean, install]
      1778 6/14/11 5:14 PM EXEC [INFO] ------------------------------------------------------------------------
      1779 6/14/11 5:14 PM EXEC [INFO] [clean:clean

      {execution: default-clean}

      ]
      1780 6/14/11 5:14 PM EXEC [INFO] Deleting /home/wasce/bfwork/dep_openejb/work/container/openejb-javaagent/target
      1781 6/14/11 5:14 PM EXEC [INFO] [remote-resources:process

      {execution: default}

      ]
      1782 6/14/11 5:14 PM EXEC [INFO] [resources:resources

      {execution: default-resources}

      ]
      1783 6/14/11 5:14 PM EXEC [INFO] Using 'UTF-8' encoding to copy filtered resources.
      1784 6/14/11 5:14 PM EXEC [INFO] skip non existing resourceDirectory /home/wasce/bfwork/dep_openejb/work/container/openejb-javaagent/src/main/resources
      1785 6/14/11 5:14 PM EXEC [INFO] Copying 3 resources
      1786 6/14/11 5:14 PM EXEC [INFO] [compiler:compile

      {execution: default-compile}

      ]
      1787 6/14/11 5:14 PM EXEC [INFO] Compiling 1 source file to /home/wasce/bfwork/dep_openejb/work/container/openejb-javaagent/target/classes
      1788 6/14/11 5:14 PM EXEC [INFO] [dependency-report:report

      {execution: default}

      ]
      1789 6/14/11 5:14 PM EXEC [INFO] No dependencies to report
      1790 6/14/11 5:14 PM EXEC [INFO] [bundle:manifest

      {execution: bundle-manifest}

      ]
      1791 6/14/11 5:14 PM EXEC [INFO] [resources:testResources

      {execution: default-testResources}

      ]
      1792 6/14/11 5:14 PM EXEC [INFO] Using 'UTF-8' encoding to copy filtered resources.
      1793 6/14/11 5:14 PM EXEC [INFO] skip non existing resourceDirectory /home/wasce/bfwork/dep_openejb/work/container/openejb-javaagent/src/test/resources
      1794 6/14/11 5:14 PM EXEC [INFO] Copying 3 resources
      1795 6/14/11 5:14 PM EXEC [INFO] [compiler:testCompile

      {execution: default-testCompile}

      ]
      1796 6/14/11 5:14 PM EXEC [INFO] Not compiling test sources
      1797 6/14/11 5:14 PM EXEC [INFO] [surefire:test

      {execution: default-test}

      ]
      1798 6/14/11 5:14 PM EXEC [INFO] Tests are skipped.
      1799 6/14/11 5:14 PM EXEC [INFO] [jar:jar

      {execution: default-jar}

      ]
      1800 6/14/11 5:14 PM EXEC [INFO] Building jar: /home/wasce/bfwork/dep_openejb/work/container/openejb-javaagent/target/openejb-javaagent-4.0.0-SNAPSHOT.jar
      1801 6/14/11 5:14 PM EXEC [INFO] [install:install

      {execution: default-install}

      ]
      1802 6/14/11 5:14 PM EXEC [INFO] Installing /home/wasce/bfwork/dep_openejb/work/container/openejb-javaagent/target/openejb-javaagent-4.0.0-SNAPSHOT.jar to /home/wasce/.m2/repository/org/apache/openejb/openejb-javaagent/4.0.0-SNAPSHOT/openejb-javaagent-4.0.0-SNAPSHOT.jar
      1803 6/14/11 5:14 PM EXEC [INFO] ------------------------------------------------------------------------
      1804 6/14/11 5:14 PM EXEC [INFO] Building OpenEJB :: Container :: Java EE
      1805 6/14/11 5:14 PM EXEC [INFO] task-segment: [clean, install]
      1806 6/14/11 5:14 PM EXEC [INFO] ------------------------------------------------------------------------
      1807 6/14/11 5:14 PM EXEC [INFO] [clean:clean

      {execution: default-clean}

      ]
      1808 6/14/11 5:14 PM EXEC [INFO] Deleting /home/wasce/bfwork/dep_openejb/work/container/openejb-jee/target
      1809 6/14/11 5:14 PM EXEC [INFO] [remote-resources:process

      {execution: default}

      ]
      1810 6/14/11 5:14 PM EXEC [INFO] [resources:resources

      {execution: default-resources}

      ]
      1811 6/14/11 5:14 PM EXEC [INFO] Using 'UTF-8' encoding to copy filtered resources.
      1812 6/14/11 5:14 PM EXEC [INFO] Copying 1 resource
      1813 6/14/11 5:14 PM EXEC [INFO] Copying 3 resources
      1814 6/14/11 5:14 PM EXEC [INFO] [compiler:compile

      {execution: default-compile}

      ]
      1815 6/14/11 5:14 PM EXEC [INFO] Compiling 962 source files to /home/wasce/bfwork/dep_openejb/work/container/openejb-jee/target/classes
      1816 6/14/11 5:14 PM EXEC [INFO] [dependency-report:report

      {execution: default}

      ]
      1817 6/14/11 5:14 PM EXEC [INFO] No dependencies to report
      1818 6/14/11 5:14 PM EXEC [INFO] [bundle:manifest

      {execution: bundle-manifest}

      ]
      1819 6/14/11 5:14 PM EXEC [INFO] [resources:testResources

      {execution: default-testResources}

      ]
      1820 6/14/11 5:14 PM EXEC [INFO] Using 'UTF-8' encoding to copy filtered resources.
      1821 6/14/11 5:14 PM EXEC [INFO] Copying 58 resources
      1822 6/14/11 5:14 PM EXEC [INFO] Copying 3 resources
      1823 6/14/11 5:14 PM EXEC [INFO] [compiler:testCompile

      {execution: default-testCompile}

      ]
      1824 6/14/11 5:14 PM EXEC [INFO] Not compiling test sources
      1825 6/14/11 5:14 PM EXEC [INFO] [surefire:test

      {execution: default-test}

      ]
      1826 6/14/11 5:14 PM EXEC [INFO] Tests are skipped.
      1827 6/14/11 5:14 PM EXEC [INFO] [jar:jar

      {execution: default-jar}

      ]
      1828 6/14/11 5:14 PM EXEC [INFO] Building jar: /home/wasce/bfwork/dep_openejb/work/container/openejb-jee/target/openejb-jee-4.0.0-SNAPSHOT.jar
      1829 6/14/11 5:14 PM EXEC [INFO] [install:install

      {execution: default-install}

      ]
      1830 6/14/11 5:14 PM EXEC [INFO] Installing /home/wasce/bfwork/dep_openejb/work/container/openejb-jee/target/openejb-jee-4.0.0-SNAPSHOT.jar to /home/wasce/.m2/repository/org/apache/openejb/openejb-jee/4.0.0-SNAPSHOT/openejb-jee-4.0.0-SNAPSHOT.jar
      1831 6/14/11 5:14 PM EXEC [INFO] ------------------------------------------------------------------------
      1832 6/14/11 5:14 PM EXEC [INFO] Building OpenEJB :: Container :: Core
      1833 6/14/11 5:14 PM EXEC [INFO] task-segment: [clean, install]
      1834 6/14/11 5:14 PM EXEC [INFO] ------------------------------------------------------------------------
      1835 6/14/11 5:14 PM EXEC [INFO] [clean:clean

      {execution: default-clean}

      ]
      1836 6/14/11 5:14 PM EXEC [INFO] Deleting /home/wasce/bfwork/dep_openejb/work/container/openejb-core/target
      1837 6/14/11 5:14 PM EXEC [INFO] [remote-resources:process

      {execution: default}

      ]
      1838 6/14/11 5:14 PM EXEC Downloading: http://cemaven.cn.ibm.com/maven-proxy/repository/org/apache/geronimo/components/geronimo-connector/3.1.1-SNAPSHOT/geronimo-connector-3.1.1-SNAPSHOT.pom
      1839 6/14/11 5:14 PM EXEC [INFO] Unable to find resource 'org.apache.geronimo.components:geronimo-connector:pom:3.1.1-SNAPSHOT' in repository apache-m2-snapshot (http://repository.apache.org/snapshots/)
      1840 6/14/11 5:14 PM EXEC Downloading: http://cemaven.cn.ibm.com/maven-proxy/repository/org/apache/geronimo/components/geronimo-connector/3.1.1-SNAPSHOT/geronimo-connector-3.1.1-SNAPSHOT.pom
      1841 6/14/11 5:14 PM EXEC [INFO] Unable to find resource 'org.apache.geronimo.components:geronimo-connector:pom:3.1.1-SNAPSHOT' in repository apache.snapshots (http://repository.apache.org/snapshots)
      1842 6/14/11 5:14 PM EXEC Downloading: http://cemaven.cn.ibm.com/maven-proxy/repository/org/apache/geronimo/components/geronimo-transaction/3.1.1-SNAPSHOT/geronimo-transaction-3.1.1-SNAPSHOT.pom
      1843 6/14/11 5:14 PM EXEC [INFO] Unable to find resource 'org.apache.geronimo.components:geronimo-transaction:pom:3.1.1-SNAPSHOT' in repository apache-m2-snapshot (http://repository.apache.org/snapshots/)
      1844 6/14/11 5:14 PM EXEC Downloading: http://cemaven.cn.ibm.com/maven-proxy/repository/org/apache/geronimo/components/geronimo-transaction/3.1.1-SNAPSHOT/geronimo-transaction-3.1.1-SNAPSHOT.pom
      1845 6/14/11 5:14 PM EXEC [INFO] Unable to find resource 'org.apache.geronimo.components:geronimo-transaction:pom:3.1.1-SNAPSHOT' in repository apache.snapshots (http://repository.apache.org/snapshots)
      1846 6/14/11 5:14 PM EXEC Downloading: http://cemaven.cn.ibm.com/maven-proxy/repository/org/apache/openwebbeans/openwebbeans-impl/1.1.1-SNAPSHOT/openwebbeans-impl-1.1.1-SNAPSHOT.pom
      1847 6/14/11 5:14 PM EXEC [INFO] Unable to find resource 'org.apache.openwebbeans:openwebbeans-impl:pom:1.1.1-SNAPSHOT' in repository apache-m2-snapshot (http://repository.apache.org/snapshots/)
      1848 6/14/11 5:14 PM EXEC Downloading: http://cemaven.cn.ibm.com/maven-proxy/repository/org/apache/openwebbeans/openwebbeans-impl/1.1.1-SNAPSHOT/openwebbeans-impl-1.1.1-SNAPSHOT.pom
      1849 6/14/11 5:14 PM EXEC [INFO] Unable to find resource 'org.apache.openwebbeans:openwebbeans-impl:pom:1.1.1-SNAPSHOT' in repository apache.snapshots (http://repository.apache.org/snapshots)
      1850 6/14/11 5:14 PM EXEC Downloading: http://cemaven.cn.ibm.com/maven-proxy/repository/org/apache/openwebbeans/openwebbeans/1.1.1-SNAPSHOT/openwebbeans-1.1.1-SNAPSHOT.pom
      1851 6/14/11 5:14 PM EXEC [INFO] Unable to find resource 'org.apache.openwebbeans:openwebbeans:pom:1.1.1-SNAPSHOT' in repository apache-m2-snapshot (http://repository.apache.org/snapshots/)
      1852 6/14/11 5:14 PM EXEC Downloading: http://cemaven.cn.ibm.com/maven-proxy/repository/org/apache/openwebbeans/openwebbeans/1.1.1-SNAPSHOT/openwebbeans-1.1.1-SNAPSHOT.pom
      1853 6/14/11 5:14 PM EXEC [INFO] Unable to find resource 'org.apache.openwebbeans:openwebbeans:pom:1.1.1-SNAPSHOT' in repository apache.snapshots (http://repository.apache.org/snapshots)
      1854 6/14/11 5:14 PM EXEC Downloading: http://cemaven.cn.ibm.com/maven-proxy/repository/org/apache/openwebbeans/openwebbeans-spi/1.1.1-SNAPSHOT/openwebbeans-spi-1.1.1-SNAPSHOT.pom
      1855 6/14/11 5:14 PM EXEC [INFO] Unable to find resource 'org.apache.openwebbeans:openwebbeans-spi:pom:1.1.1-SNAPSHOT' in repository apache-m2-snapshot (http://repository.apache.org/snapshots/)
      1856 6/14/11 5:14 PM EXEC Downloading: http://cemaven.cn.ibm.com/maven-proxy/repository/org/apache/openwebbeans/openwebbeans-spi/1.1.1-SNAPSHOT/openwebbeans-spi-1.1.1-SNAPSHOT.pom
      1857 6/14/11 5:14 PM EXEC [INFO] Unable to find resource 'org.apache.openwebbeans:openwebbeans-spi:pom:1.1.1-SNAPSHOT' in repository apache.snapshots (http://repository.apache.org/snapshots)
      1858 6/14/11 5:14 PM EXEC Downloading: http://cemaven.cn.ibm.com/maven-proxy/repository/org/apache/openwebbeans/openwebbeans-ejb/1.1.1-SNAPSHOT/openwebbeans-ejb-1.1.1-SNAPSHOT.pom
      1859 6/14/11 5:14 PM EXEC [INFO] Unable to find resource 'org.apache.openwebbeans:openwebbeans-ejb:pom:1.1.1-SNAPSHOT' in repository apache-m2-snapshot (http://repository.apache.org/snapshots/)
      1860 6/14/11 5:14 PM EXEC Downloading: http://cemaven.cn.ibm.com/maven-proxy/repository/org/apache/openwebbeans/openwebbeans-ejb/1.1.1-SNAPSHOT/openwebbeans-ejb-1.1.1-SNAPSHOT.pom
      1861 6/14/11 5:14 PM EXEC [INFO] Unable to find resource 'org.apache.openwebbeans:openwebbeans-ejb:pom:1.1.1-SNAPSHOT' in repository apache.snapshots (http://repository.apache.org/snapshots)
      1862 6/14/11 5:14 PM EXEC Downloading: http://cemaven.cn.ibm.com/maven-proxy/repository/org/apache/openwebbeans/openwebbeans-ee/1.1.1-SNAPSHOT/openwebbeans-ee-1.1.1-SNAPSHOT.pom
      1863 6/14/11 5:14 PM EXEC [INFO] Unable to find resource 'org.apache.openwebbeans:openwebbeans-ee:pom:1.1.1-SNAPSHOT' in repository apache-m2-snapshot (http://repository.apache.org/snapshots/)
      1864 6/14/11 5:14 PM EXEC Downloading: http://cemaven.cn.ibm.com/maven-proxy/repository/org/apache/openwebbeans/openwebbeans-ee/1.1.1-SNAPSHOT/openwebbeans-ee-1.1.1-SNAPSHOT.pom
      1865 6/14/11 5:14 PM EXEC [INFO] Unable to find resource 'org.apache.openwebbeans:openwebbeans-ee:pom:1.1.1-SNAPSHOT' in repository apache.snapshots (http://repository.apache.org/snapshots)
      1866 6/14/11 5:14 PM EXEC Downloading: http://cemaven.cn.ibm.com/maven-proxy/repository/org/apache/openwebbeans/openwebbeans-ee-common/1.1.1-SNAPSHOT/openwebbeans-ee-common-1.1.1-SNAPSHOT.pom
      1867 6/14/11 5:14 PM EXEC [INFO] Unable to find resource 'org.apache.openwebbeans:openwebbeans-ee-common:pom:1.1.1-SNAPSHOT' in repository apache-m2-snapshot (http://repository.apache.org/snapshots/)
      1868 6/14/11 5:14 PM EXEC Downloading: http://cemaven.cn.ibm.com/maven-proxy/repository/org/apache/openwebbeans/openwebbeans-ee-common/1.1.1-SNAPSHOT/openwebbeans-ee-common-1.1.1-SNAPSHOT.pom
      1869 6/14/11 5:14 PM EXEC [INFO] Unable to find resource 'org.apache.openwebbeans:openwebbeans-ee-common:pom:1.1.1-SNAPSHOT' in repository apache.snapshots (http://repository.apache.org/snapshots)
      1870 6/14/11 5:14 PM EXEC Downloading: http://cemaven.cn.ibm.com/maven-proxy/repository/org/apache/openwebbeans/openwebbeans-impl/1.1.1-SNAPSHOT/openwebbeans-impl-1.1.1-SNAPSHOT.jar
      1871 6/14/11 5:14 PM EXEC [INFO] Unable to find resource 'org.apache.openwebbeans:openwebbeans-impl:jar:1.1.1-SNAPSHOT' in repository apache-m2-snapshot (http://repository.apache.org/snapshots/)
      1872 6/14/11 5:14 PM EXEC Downloading: http://cemaven.cn.ibm.com/maven-proxy/repository/org/apache/openwebbeans/openwebbeans-impl/1.1.1-SNAPSHOT/openwebbeans-impl-1.1.1-SNAPSHOT.jar
      1873 6/14/11 5:14 PM EXEC [INFO] Unable to find resource 'org.apache.openwebbeans:openwebbeans-impl:jar:1.1.1-SNAPSHOT' in repository apache.snapshots (http://repository.apache.org/snapshots)
      1874 6/14/11 5:14 PM EXEC Downloading: http://cemaven.cn.ibm.com/maven-proxy/repository/org/apache/openwebbeans/openwebbeans-spi/1.1.1-SNAPSHOT/openwebbeans-spi-1.1.1-SNAPSHOT.jar
      1875 6/14/11 5:14 PM EXEC [INFO] Unable to find resource 'org.apache.openwebbeans:openwebbeans-spi:jar:1.1.1-SNAPSHOT' in repository apache-m2-snapshot (http://repository.apache.org/snapshots/)
      1876 6/14/11 5:14 PM EXEC Downloading: http://cemaven.cn.ibm.com/maven-proxy/repository/org/apache/openwebbeans/openwebbeans-spi/1.1.1-SNAPSHOT/openwebbeans-spi-1.1.1-SNAPSHOT.jar
      1877 6/14/11 5:14 PM EXEC [INFO] Unable to find resource 'org.apache.openwebbeans:openwebbeans-spi:jar:1.1.1-SNAPSHOT' in repository apache.snapshots (http://repository.apache.org/snapshots)
      1878 6/14/11 5:14 PM EXEC Downloading: http://cemaven.cn.ibm.com/maven-proxy/repository/org/apache/openwebbeans/openwebbeans-ejb/1.1.1-SNAPSHOT/openwebbeans-ejb-1.1.1-SNAPSHOT.jar
      1879 6/14/11 5:14 PM EXEC [INFO] Unable to find resource 'org.apache.openwebbeans:openwebbeans-ejb:jar:1.1.1-SNAPSHOT' in repository apache-m2-snapshot (http://repository.apache.org/snapshots/)
      1880 6/14/11 5:14 PM EXEC Downloading: http://cemaven.cn.ibm.com/maven-proxy/repository/org/apache/openwebbeans/openwebbeans-ejb/1.1.1-SNAPSHOT/openwebbeans-ejb-1.1.1-SNAPSHOT.jar
      1881 6/14/11 5:14 PM EXEC [INFO] Unable to find resource 'org.apache.openwebbeans:openwebbeans-ejb:jar:1.1.1-SNAPSHOT' in repository apache.snapshots (http://repository.apache.org/snapshots)
      1882 6/14/11 5:14 PM EXEC Downloading: http://cemaven.cn.ibm.com/maven-proxy/repository/org/apache/openwebbeans/openwebbeans-ee/1.1.1-SNAPSHOT/openwebbeans-ee-1.1.1-SNAPSHOT.jar
      1883 6/14/11 5:14 PM EXEC [INFO] Unable to find resource 'org.apache.openwebbeans:openwebbeans-ee:jar:1.1.1-SNAPSHOT' in repository apache-m2-snapshot (http://repository.apache.org/snapshots/)
      1884 6/14/11 5:14 PM EXEC Downloading: http://cemaven.cn.ibm.com/maven-proxy/repository/org/apache/openwebbeans/openwebbeans-ee/1.1.1-SNAPSHOT/openwebbeans-ee-1.1.1-SNAPSHOT.jar
      1885 6/14/11 5:14 PM EXEC [INFO] Unable to find resource 'org.apache.openwebbeans:openwebbeans-ee:jar:1.1.1-SNAPSHOT' in repository apache.snapshots (http://repository.apache.org/snapshots)
      1886 6/14/11 5:14 PM EXEC Downloading: http://cemaven.cn.ibm.com/maven-proxy/repository/org/apache/openwebbeans/openwebbeans-ee-common/1.1.1-SNAPSHOT/openwebbeans-ee-common-1.1.1-SNAPSHOT.jar
      1887 6/14/11 5:14 PM EXEC [INFO] Unable to find resource 'org.apache.openwebbeans:openwebbeans-ee-common:jar:1.1.1-SNAPSHOT' in repository apache-m2-snapshot (http://repository.apache.org/snapshots/)
      1888 6/14/11 5:14 PM EXEC Downloading: http://cemaven.cn.ibm.com/maven-proxy/repository/org/apache/openwebbeans/openwebbeans-ee-common/1.1.1-SNAPSHOT/openwebbeans-ee-common-1.1.1-SNAPSHOT.jar
      1889 6/14/11 5:14 PM EXEC [INFO] Unable to find resource 'org.apache.openwebbeans:openwebbeans-ee-common:jar:1.1.1-SNAPSHOT' in repository apache.snapshots (http://repository.apache.org/snapshots)
      1890 6/14/11 5:14 PM EXEC [WARNING] org.apache.velocity.runtime.exception.ReferenceException: reference : template = META-INF/DEPENDENCIES.vm [line 40,column 14] : $license.name is not a valid reference.
      1891 6/14/11 5:14 PM EXEC [WARNING] org.apache.velocity.runtime.exception.ReferenceException: reference : template = META-INF/DEPENDENCIES.vm [line 40,column 14] : $license.name is not a valid reference.
      1892 6/14/11 5:14 PM EXEC [INFO] [resources:resources

      {execution: default-resources}

      ]
      1893 6/14/11 5:14 PM EXEC [INFO] Using 'UTF-8' encoding to copy filtered resources.
      1894 6/14/11 5:14 PM EXEC [INFO] Copying 40 resources
      1895 6/14/11 5:14 PM EXEC [INFO] Copying 3 resources
      1896 6/14/11 5:14 PM EXEC [INFO] [dependency:copy

      {execution: copy}

      ]
      1897 6/14/11 5:14 PM EXEC [INFO] Configured Artifact: org.apache.openejb:openejb-javaagent:4.0.0-SNAPSHOT:jar
      1898 6/14/11 5:14 PM EXEC [INFO] Copying openejb-javaagent-4.0.0-SNAPSHOT.jar to /home/wasce/bfwork/dep_openejb/work/container/openejb-core/target/openejb-javaagent-4.0.0-SNAPSHOT.jar
      1899 6/14/11 5:14 PM EXEC Downloading: http://cemaven.cn.ibm.com/maven-proxy/repository/org/apache/openwebbeans/openwebbeans-impl/1.1.1-SNAPSHOT/openwebbeans-impl-1.1.1-SNAPSHOT.jar
      1900 6/14/11 5:14 PM EXEC [INFO] Unable to find resource 'org.apache.openwebbeans:openwebbeans-impl:jar:1.1.1-SNAPSHOT' in repository apache-m2-snapshot (http://repository.apache.org/snapshots/)
      1901 6/14/11 5:14 PM EXEC Downloading: http://cemaven.cn.ibm.com/maven-proxy/repository/org/apache/openwebbeans/openwebbeans-impl/1.1.1-SNAPSHOT/openwebbeans-impl-1.1.1-SNAPSHOT.jar
      1902 6/14/11 5:14 PM EXEC [INFO] Unable to find resource 'org.apache.openwebbeans:openwebbeans-impl:jar:1.1.1-SNAPSHOT' in repository apache.snapshots (http://repository.apache.org/snapshots)
      1903 6/14/11 5:14 PM EXEC Downloading: http://cemaven.cn.ibm.com/maven-proxy/repository/org/apache/openwebbeans/openwebbeans-spi/1.1.1-SNAPSHOT/openwebbeans-spi-1.1.1-SNAPSHOT.jar
      1904 6/14/11 5:14 PM EXEC [INFO] Unable to find resource 'org.apache.openwebbeans:openwebbeans-spi:jar:1.1.1-SNAPSHOT' in repository apache-m2-snapshot (http://repository.apache.org/snapshots/)
      1905 6/14/11 5:14 PM EXEC Downloading: http://cemaven.cn.ibm.com/maven-proxy/repository/org/apache/openwebbeans/openwebbeans-spi/1.1.1-SNAPSHOT/openwebbeans-spi-1.1.1-SNAPSHOT.jar
      1906 6/14/11 5:14 PM EXEC [INFO] Unable to find resource 'org.apache.openwebbeans:openwebbeans-spi:jar:1.1.1-SNAPSHOT' in repository apache.snapshots (http://repository.apache.org/snapshots)
      1907 6/14/11 5:14 PM EXEC Downloading: http://cemaven.cn.ibm.com/maven-proxy/repository/org/apache/openwebbeans/openwebbeans-ejb/1.1.1-SNAPSHOT/openwebbeans-ejb-1.1.1-SNAPSHOT.jar
      1908 6/14/11 5:14 PM EXEC [INFO] Unable to find resource 'org.apache.openwebbeans:openwebbeans-ejb:jar:1.1.1-SNAPSHOT' in repository apache-m2-snapshot (http://repository.apache.org/snapshots/)
      1909 6/14/11 5:14 PM EXEC Downloading: http://cemaven.cn.ibm.com/maven-proxy/repository/org/apache/openwebbeans/openwebbeans-ejb/1.1.1-SNAPSHOT/openwebbeans-ejb-1.1.1-SNAPSHOT.jar
      1910 6/14/11 5:14 PM EXEC [INFO] Unable to find resource 'org.apache.openwebbeans:openwebbeans-ejb:jar:1.1.1-SNAPSHOT' in repository apache.snapshots (http://repository.apache.org/snapshots)
      1911 6/14/11 5:14 PM EXEC Downloading: http://cemaven.cn.ibm.com/maven-proxy/repository/org/apache/openwebbeans/openwebbeans-ee/1.1.1-SNAPSHOT/openwebbeans-ee-1.1.1-SNAPSHOT.jar
      1912 6/14/11 5:14 PM EXEC [INFO] Unable to find resource 'org.apache.openwebbeans:openwebbeans-ee:jar:1.1.1-SNAPSHOT' in repository apache-m2-snapshot (http://repository.apache.org/snapshots/)
      1913 6/14/11 5:14 PM EXEC Downloading: http://cemaven.cn.ibm.com/maven-proxy/repository/org/apache/openwebbeans/openwebbeans-ee/1.1.1-SNAPSHOT/openwebbeans-ee-1.1.1-SNAPSHOT.jar
      1914 6/14/11 5:14 PM EXEC [INFO] Unable to find resource 'org.apache.openwebbeans:openwebbeans-ee:jar:1.1.1-SNAPSHOT' in repository apache.snapshots (http://repository.apache.org/snapshots)
      1915 6/14/11 5:14 PM EXEC Downloading: http://cemaven.cn.ibm.com/maven-proxy/repository/org/apache/openwebbeans/openwebbeans-ee-common/1.1.1-SNAPSHOT/openwebbeans-ee-common-1.1.1-SNAPSHOT.jar
      1916 6/14/11 5:14 PM EXEC [INFO] Unable to find resource 'org.apache.openwebbeans:openwebbeans-ee-common:jar:1.1.1-SNAPSHOT' in repository apache-m2-snapshot (http://repository.apache.org/snapshots/)
      1917 6/14/11 5:14 PM EXEC Downloading: http://cemaven.cn.ibm.com/maven-proxy/repository/org/apache/openwebbeans/openwebbeans-ee-common/1.1.1-SNAPSHOT/openwebbeans-ee-common-1.1.1-SNAPSHOT.jar
      1918 6/14/11 5:14 PM EXEC [INFO] Unable to find resource 'org.apache.openwebbeans:openwebbeans-ee-common:jar:1.1.1-SNAPSHOT' in repository apache.snapshots (http://repository.apache.org/snapshots)
      1919 6/14/11 5:14 PM EXEC Downloading: http://cemaven.cn.ibm.com/maven-proxy/repository/org/apache/openwebbeans/openwebbeans-impl/1.1.1-SNAPSHOT/openwebbeans-impl-1.1.1-SNAPSHOT.jar
      1920 6/14/11 5:14 PM EXEC [INFO] Unable to find resource 'org.apache.openwebbeans:openwebbeans-impl:jar:1.1.1-SNAPSHOT' in repository apache-m2-snapshot (http://repository.apache.org/snapshots/)
      1921 6/14/11 5:14 PM EXEC Downloading: http://cemaven.cn.ibm.com/maven-proxy/repository/org/apache/openwebbeans/openwebbeans-impl/1.1.1-SNAPSHOT/openwebbeans-impl-1.1.1-SNAPSHOT.jar
      1922 6/14/11 5:14 PM EXEC [INFO] Unable to find resource 'org.apache.openwebbeans:openwebbeans-impl:jar:1.1.1-SNAPSHOT' in repository apache.snapshots (http://repository.apache.org/snapshots)
      1923 6/14/11 5:14 PM EXEC Downloading: http://cemaven.cn.ibm.com/maven-proxy/repository/org/apache/openwebbeans/openwebbeans-spi/1.1.1-SNAPSHOT/openwebbeans-spi-1.1.1-SNAPSHOT.jar
      1924 6/14/11 5:14 PM EXEC [INFO] Unable to find resource 'org.apache.openwebbeans:openwebbeans-spi:jar:1.1.1-SNAPSHOT' in repository apache-m2-snapshot (http://repository.apache.org/snapshots/)
      1925 6/14/11 5:14 PM EXEC Downloading: http://cemaven.cn.ibm.com/maven-proxy/repository/org/apache/openwebbeans/openwebbeans-spi/1.1.1-SNAPSHOT/openwebbeans-spi-1.1.1-SNAPSHOT.jar
      1926 6/14/11 5:14 PM EXEC [INFO] Unable to find resource 'org.apache.openwebbeans:openwebbeans-spi:jar:1.1.1-SNAPSHOT' in repository apache.snapshots (http://repository.apache.org/snapshots)
      1927 6/14/11 5:14 PM EXEC Downloading: http://cemaven.cn.ibm.com/maven-proxy/repository/org/apache/openwebbeans/openwebbeans-ejb/1.1.1-SNAPSHOT/openwebbeans-ejb-1.1.1-SNAPSHOT.jar
      1928 6/14/11 5:14 PM EXEC [INFO] Unable to find resource 'org.apache.openwebbeans:openwebbeans-ejb:jar:1.1.1-SNAPSHOT' in repository apache-m2-snapshot (http://repository.apache.org/snapshots/)
      1929 6/14/11 5:14 PM EXEC Downloading: http://cemaven.cn.ibm.com/maven-proxy/repository/org/apache/openwebbeans/openwebbeans-ejb/1.1.1-SNAPSHOT/openwebbeans-ejb-1.1.1-SNAPSHOT.jar
      1930 6/14/11 5:14 PM EXEC [INFO] Unable to find resource 'org.apache.openwebbeans:openwebbeans-ejb:jar:1.1.1-SNAPSHOT' in repository apache.snapshots (http://repository.apache.org/snapshots)
      1931 6/14/11 5:14 PM EXEC Downloading: http://cemaven.cn.ibm.com/maven-proxy/repository/org/apache/openwebbeans/openwebbeans-ee/1.1.1-SNAPSHOT/openwebbeans-ee-1.1.1-SNAPSHOT.jar
      1932 6/14/11 5:14 PM EXEC [INFO] Unable to find resource 'org.apache.openwebbeans:openwebbeans-ee:jar:1.1.1-SNAPSHOT' in repository apache-m2-snapshot (http://repository.apache.org/snapshots/)
      1933 6/14/11 5:14 PM EXEC Downloading: http://cemaven.cn.ibm.com/maven-proxy/repository/org/apache/openwebbeans/openwebbeans-ee/1.1.1-SNAPSHOT/openwebbeans-ee-1.1.1-SNAPSHOT.jar
      1934 6/14/11 5:14 PM EXEC [INFO] Unable to find resource 'org.apache.openwebbeans:openwebbeans-ee:jar:1.1.1-SNAPSHOT' in repository apache.snapshots (http://repository.apache.org/snapshots)
      1935 6/14/11 5:14 PM EXEC Downloading: http://cemaven.cn.ibm.com/maven-proxy/repository/org/apache/openwebbeans/openwebbeans-ee-common/1.1.1-SNAPSHOT/openwebbeans-ee-common-1.1.1-SNAPSHOT.jar
      1936 6/14/11 5:14 PM EXEC [INFO] Unable to find resource 'org.apache.openwebbeans:openwebbeans-ee-common:jar:1.1.1-SNAPSHOT' in repository apache-m2-snapshot (http://repository.apache.org/snapshots/)
      1937 6/14/11 5:14 PM EXEC Downloading: http://cemaven.cn.ibm.com/maven-proxy/repository/org/apache/openwebbeans/openwebbeans-ee-common/1.1.1-SNAPSHOT/openwebbeans-ee-common-1.1.1-SNAPSHOT.jar
      1938 6/14/11 5:14 PM EXEC [INFO] Unable to find resource 'org.apache.openwebbeans:openwebbeans-ee-common:jar:1.1.1-SNAPSHOT' in repository apache.snapshots (http://repository.apache.org/snapshots)
      1939 6/14/11 5:14 PM EXEC [INFO] [compiler:compile

      {execution: default-compile}

      ]
      1940 6/14/11 5:14 PM EXEC [INFO] Compiling 652 source files to /home/wasce/bfwork/dep_openejb/work/container/openejb-core/target/classes
      1941 6/14/11 5:14 PM EXEC [INFO] -------------------------------------------------------------
      1942 6/14/11 5:14 PM EXEC [ERROR] COMPILATION ERROR :
      1943 6/14/11 5:14 PM EXEC [INFO] -------------------------------------------------------------
      1944 6/14/11 5:14 PM EXEC [ERROR] /home/wasce/bfwork/dep_openejb/work/container/openejb-core/src/main/java/org/apache/openejb/cdi/OpenEJBLifecycle.java:[288,23] loadExtensionServices() in org.apache.webbeans.portable.events.ExtensionLoader cannot be applied to (java.lang.ClassLoader)
      1945 6/14/11 5:14 PM EXEC [INFO] 1 error
      1946 6/14/11 5:14 PM EXEC [INFO] -------------------------------------------------------------
      1947 6/14/11 5:14 PM EXEC [INFO] ------------------------------------------------------------------------
      1948 6/14/11 5:14 PM EXEC [ERROR] BUILD FAILURE
      1949 6/14/11 5:14 PM EXEC [INFO] ------------------------------------------------------------------------
      1950 6/14/11 5:14 PM EXEC [INFO] Compilation failure
      1951 6/14/11 5:14 PM EXEC /home/wasce/bfwork/dep_openejb/work/container/openejb-core/src/main/java/org/apache/openejb/cdi/OpenEJBLifecycle.java:[288,23] loadExtensionServices() in org.apache.webbeans.portable.events.ExtensionLoader cannot be applied to (java.lang.ClassLoader)
      1952 6/14/11 5:14 PM EXEC
      1953 6/14/11 5:14 PM EXEC [INFO] ------------------------------------------------------------------------
      1954 6/14/11 5:14 PM EXEC [INFO] For more information, run Maven with the -e switch
      1955 6/14/11 5:14 PM EXEC [INFO] ------------------------------------------------------------------------
      1956 6/14/11 5:14 PM EXEC [INFO] Total time: 45 seconds
      1957 6/14/11 5:14 PM EXEC [INFO] Finished at: Tue Jun 14 17:14:46 GMT+08:00 2011
      1958 6/14/11 5:14 PM EXEC [INFO] Final Memory: 129M/512M
      1959 6/14/11 5:14 PM EXEC [INFO] ------------------------------------------------------------------------
      1960 6/14/11 5:14 PM EXEC end [/home/wasce/bfwork/dep_openejb/work@ce30]

        Attachments

          Activity

            People

            • Assignee:
              Unassigned
              Reporter:
              saphen Saphen Qiu
            • Votes:
              0 Vote for this issue
              Watchers:
              0 Start watching this issue

              Dates

              • Created:
                Updated:
                Resolved: