Details

    • Type: Sub-task
    • Status: Closed
    • Priority: Major
    • Resolution: Fixed
    • Affects Version/s: trunk
    • Fix Version/s: 4.1.0
    • Component/s: tests
    • Labels:
      None

      Description

      After OOZIE-1644, TestLiteWorkflowAppParser fails against Hadoop 2:

      -------------------------------------------------------------------------------
      Test set: org.apache.oozie.workflow.lite.TestLiteWorkflowAppParser
      -------------------------------------------------------------------------------
      Tests run: 30, Failures: 5, Errors: 0, Skipped: 0, Time elapsed: 39.802 sec <<< FAILURE!
      testParserGlobal(org.apache.oozie.workflow.lite.TestLiteWorkflowAppParser)  Time elapsed: 0.036 sec  <<< FAILURE!
      junit.framework.ComparisonFailure: expected:<...
      <value>B</value>
      <[/property>
      <property>
      <name>a</name>
      <value>A</valu]e>
      </property>
      </c...> but was:<...
      <value>B</value>
      <[source>programatically</source>
      </property>
      <property>
      <name>a</name>
      <value>A</value>
      <source>programatically</sourc]e>
      </property>
      </c...>
      	at junit.framework.Assert.assertEquals(Assert.java:85)
      	at junit.framework.Assert.assertEquals(Assert.java:91)
      	at org.apache.oozie.workflow.lite.TestLiteWorkflowAppParser.testParserGlobal(TestLiteWorkflowAppParser.java:96)
      	at sun.reflect.NativeMethodAccessorImpl.invoke0(Native Method)
      	at sun.reflect.NativeMethodAccessorImpl.invoke(NativeMethodAccessorImpl.java:39)
      	at sun.reflect.DelegatingMethodAccessorImpl.invoke(DelegatingMethodAccessorImpl.java:25)
      	at java.lang.reflect.Method.invoke(Method.java:597)
      	at junit.framework.TestCase.runTest(TestCase.java:168)
      	at junit.framework.TestCase.runBare(TestCase.java:134)
      	at junit.framework.TestResult$1.protect(TestResult.java:110)
      	at junit.framework.TestResult.runProtected(TestResult.java:128)
      	at junit.framework.TestResult.run(TestResult.java:113)
      	at junit.framework.TestCase.run(TestCase.java:124)
      	at junit.framework.TestSuite.runTest(TestSuite.java:243)
      	at junit.framework.TestSuite.run(TestSuite.java:238)
      	at org.junit.internal.runners.JUnit38ClassRunner.run(JUnit38ClassRunner.java:83)
      	at org.apache.maven.surefire.junitcore.ClassDemarcatingRunner.run(ClassDemarcatingRunner.java:58)
      	at org.junit.runners.Suite.runChild(Suite.java:128)
      	at org.junit.runners.Suite.runChild(Suite.java:24)
      	at org.junit.runners.ParentRunner$3.run(ParentRunner.java:231)
      	at java.util.concurrent.Executors$RunnableAdapter.call(Executors.java:439)
      	at java.util.concurrent.FutureTask$Sync.innerRun(FutureTask.java:303)
      	at java.util.concurrent.FutureTask.run(FutureTask.java:138)
      	at java.util.concurrent.ThreadPoolExecutor$Worker.runTask(ThreadPoolExecutor.java:895)
      	at java.util.concurrent.ThreadPoolExecutor$Worker.run(ThreadPoolExecutor.java:918)
      	at java.lang.Thread.run(Thread.java:695)
      testParserGlobalJobXML(org.apache.oozie.workflow.lite.TestLiteWorkflowAppParser)  Time elapsed: 0.002 sec  <<< FAILURE!
      junit.framework.ComparisonFailure: expected:<...
      <value>B</value>
      <[/property>
      <property>
      <name>a</name>
      <value>A</valu]e>
      </property>
      </c...> but was:<...
      <value>B</value>
      <[source>programatically</source>
      </property>
      <property>
      <name>a</name>
      <value>A</value>
      <source>programatically</sourc]e>
      </property>
      </c...>
      	at junit.framework.Assert.assertEquals(Assert.java:85)
      	at junit.framework.Assert.assertEquals(Assert.java:91)
      	at org.apache.oozie.workflow.lite.TestLiteWorkflowAppParser.testParserGlobalJobXML(TestLiteWorkflowAppParser.java:139)
      	at sun.reflect.NativeMethodAccessorImpl.invoke0(Native Method)
      	at sun.reflect.NativeMethodAccessorImpl.invoke(NativeMethodAccessorImpl.java:39)
      	at sun.reflect.DelegatingMethodAccessorImpl.invoke(DelegatingMethodAccessorImpl.java:25)
      	at java.lang.reflect.Method.invoke(Method.java:597)
      	at junit.framework.TestCase.runTest(TestCase.java:168)
      	at junit.framework.TestCase.runBare(TestCase.java:134)
      	at junit.framework.TestResult$1.protect(TestResult.java:110)
      	at junit.framework.TestResult.runProtected(TestResult.java:128)
      	at junit.framework.TestResult.run(TestResult.java:113)
      	at junit.framework.TestCase.run(TestCase.java:124)
      	at junit.framework.TestSuite.runTest(TestSuite.java:243)
      	at junit.framework.TestSuite.run(TestSuite.java:238)
      	at org.junit.internal.runners.JUnit38ClassRunner.run(JUnit38ClassRunner.java:83)
      	at org.apache.maven.surefire.junitcore.ClassDemarcatingRunner.run(ClassDemarcatingRunner.java:58)
      	at org.junit.runners.Suite.runChild(Suite.java:128)
      	at org.junit.runners.Suite.runChild(Suite.java:24)
      	at org.junit.runners.ParentRunner$3.run(ParentRunner.java:231)
      	at java.util.concurrent.Executors$RunnableAdapter.call(Executors.java:439)
      	at java.util.concurrent.FutureTask$Sync.innerRun(FutureTask.java:303)
      	at java.util.concurrent.FutureTask.run(FutureTask.java:138)
      	at java.util.concurrent.ThreadPoolExecutor$Worker.runTask(ThreadPoolExecutor.java:895)
      	at java.util.concurrent.ThreadPoolExecutor$Worker.run(ThreadPoolExecutor.java:918)
      	at java.lang.Thread.run(Thread.java:695)
      testParserGlobalLocalAlreadyExists(org.apache.oozie.workflow.lite.TestLiteWorkflowAppParser)  Time elapsed: 0.002 sec  <<< FAILURE!
      junit.framework.ComparisonFailure: expected:<...
      <value>B</value>
      <[/property>
      <property>
      <name>a</name>
      <value>A2</valu]e>
      </property>
      </c...> but was:<...
      <value>B</value>
      <[source>programatically</source>
      </property>
      <property>
      <name>a</name>
      <value>A2</value>
      <source>programatically</sourc]e>
      </property>
      </c...>
      	at junit.framework.Assert.assertEquals(Assert.java:85)
      	at junit.framework.Assert.assertEquals(Assert.java:91)
      	at org.apache.oozie.workflow.lite.TestLiteWorkflowAppParser.testParserGlobalLocalAlreadyExists(TestLiteWorkflowAppParser.java:177)
      	at sun.reflect.NativeMethodAccessorImpl.invoke0(Native Method)
      	at sun.reflect.NativeMethodAccessorImpl.invoke(NativeMethodAccessorImpl.java:39)
      	at sun.reflect.DelegatingMethodAccessorImpl.invoke(DelegatingMethodAccessorImpl.java:25)
      	at java.lang.reflect.Method.invoke(Method.java:597)
      	at junit.framework.TestCase.runTest(TestCase.java:168)
      	at junit.framework.TestCase.runBare(TestCase.java:134)
      	at junit.framework.TestResult$1.protect(TestResult.java:110)
      	at junit.framework.TestResult.runProtected(TestResult.java:128)
      	at junit.framework.TestResult.run(TestResult.java:113)
      	at junit.framework.TestCase.run(TestCase.java:124)
      	at junit.framework.TestSuite.runTest(TestSuite.java:243)
      	at junit.framework.TestSuite.run(TestSuite.java:238)
      	at org.junit.internal.runners.JUnit38ClassRunner.run(JUnit38ClassRunner.java:83)
      	at org.apache.maven.surefire.junitcore.ClassDemarcatingRunner.run(ClassDemarcatingRunner.java:58)
      	at org.junit.runners.Suite.runChild(Suite.java:128)
      	at org.junit.runners.Suite.runChild(Suite.java:24)
      	at org.junit.runners.ParentRunner$3.run(ParentRunner.java:231)
      	at java.util.concurrent.Executors$RunnableAdapter.call(Executors.java:439)
      	at java.util.concurrent.FutureTask$Sync.innerRun(FutureTask.java:303)
      	at java.util.concurrent.FutureTask.run(FutureTask.java:138)
      	at java.util.concurrent.ThreadPoolExecutor$Worker.runTask(ThreadPoolExecutor.java:895)
      	at java.util.concurrent.ThreadPoolExecutor$Worker.run(ThreadPoolExecutor.java:918)
      	at java.lang.Thread.run(Thread.java:695)
      testParserGlobalExtensionActions(org.apache.oozie.workflow.lite.TestLiteWorkflowAppParser)  Time elapsed: 0.002 sec  <<< FAILURE!
      junit.framework.ComparisonFailure: expected:<...
      <value>B</value>
      <[/property>
      <property>
      <name>a</name>
      <value>A</value>
      </property>
      <property>
      <name>c</name>
      <value>C</valu]e>
      </property>
      </c...> but was:<...
      <value>B</value>
      <[source>programatically</source>
      </property>
      <property>
      <name>a</name>
      <value>A</value>
      <source>programatically</source>
      </property>
      <property>
      <name>c</name>
      <value>C</value>
      <source>programatically</sourc]e>
      </property>
      </c...>
      	at junit.framework.Assert.assertEquals(Assert.java:85)
      	at junit.framework.Assert.assertEquals(Assert.java:91)
      	at org.apache.oozie.workflow.lite.TestLiteWorkflowAppParser.testParserGlobalExtensionActions(TestLiteWorkflowAppParser.java:218)
      	at sun.reflect.NativeMethodAccessorImpl.invoke0(Native Method)
      	at sun.reflect.NativeMethodAccessorImpl.invoke(NativeMethodAccessorImpl.java:39)
      	at sun.reflect.DelegatingMethodAccessorImpl.invoke(DelegatingMethodAccessorImpl.java:25)
      	at java.lang.reflect.Method.invoke(Method.java:597)
      	at junit.framework.TestCase.runTest(TestCase.java:168)
      	at junit.framework.TestCase.runBare(TestCase.java:134)
      	at junit.framework.TestResult$1.protect(TestResult.java:110)
      	at junit.framework.TestResult.runProtected(TestResult.java:128)
      	at junit.framework.TestResult.run(TestResult.java:113)
      	at junit.framework.TestCase.run(TestCase.java:124)
      	at junit.framework.TestSuite.runTest(TestSuite.java:243)
      	at junit.framework.TestSuite.run(TestSuite.java:238)
      	at org.junit.internal.runners.JUnit38ClassRunner.run(JUnit38ClassRunner.java:83)
      	at org.apache.maven.surefire.junitcore.ClassDemarcatingRunner.run(ClassDemarcatingRunner.java:58)
      	at org.junit.runners.Suite.runChild(Suite.java:128)
      	at org.junit.runners.Suite.runChild(Suite.java:24)
      	at org.junit.runners.ParentRunner$3.run(ParentRunner.java:231)
      	at java.util.concurrent.Executors$RunnableAdapter.call(Executors.java:439)
      	at java.util.concurrent.FutureTask$Sync.innerRun(FutureTask.java:303)
      	at java.util.concurrent.FutureTask.run(FutureTask.java:138)
      	at java.util.concurrent.ThreadPoolExecutor$Worker.runTask(ThreadPoolExecutor.java:895)
      	at java.util.concurrent.ThreadPoolExecutor$Worker.run(ThreadPoolExecutor.java:918)
      	at java.lang.Thread.run(Thread.java:695)
      testParserGlobalExtensionActionsLocalAlreadyExists(org.apache.oozie.workflow.lite.TestLiteWorkflowAppParser)  Time elapsed: 0.001 sec  <<< FAILURE!
      junit.framework.ComparisonFailure: expected:<...
      <value>B</value>
      <[/property>
      <property>
      <name>a</name>
      <value>A2</valu]e>
      </property>
      </c...> but was:<...
      <value>B</value>
      <[source>programatically</source>
      </property>
      <property>
      <name>a</name>
      <value>A2</value>
      <source>programatically</sourc]e>
      </property>
      </c...>
      	at junit.framework.Assert.assertEquals(Assert.java:85)
      	at junit.framework.Assert.assertEquals(Assert.java:91)
      	at org.apache.oozie.workflow.lite.TestLiteWorkflowAppParser.testParserGlobalExtensionActionsLocalAlreadyExists(TestLiteWorkflowAppParser.java:253)
      	at sun.reflect.NativeMethodAccessorImpl.invoke0(Native Method)
      	at sun.reflect.NativeMethodAccessorImpl.invoke(NativeMethodAccessorImpl.java:39)
      	at sun.reflect.DelegatingMethodAccessorImpl.invoke(DelegatingMethodAccessorImpl.java:25)
      	at java.lang.reflect.Method.invoke(Method.java:597)
      	at junit.framework.TestCase.runTest(TestCase.java:168)
      	at junit.framework.TestCase.runBare(TestCase.java:134)
      	at junit.framework.TestResult$1.protect(TestResult.java:110)
      	at junit.framework.TestResult.runProtected(TestResult.java:128)
      	at junit.framework.TestResult.run(TestResult.java:113)
      	at junit.framework.TestCase.run(TestCase.java:124)
      	at junit.framework.TestSuite.runTest(TestSuite.java:243)
      	at junit.framework.TestSuite.run(TestSuite.java:238)
      	at org.junit.internal.runners.JUnit38ClassRunner.run(JUnit38ClassRunner.java:83)
      	at org.apache.maven.surefire.junitcore.ClassDemarcatingRunner.run(ClassDemarcatingRunner.java:58)
      	at org.junit.runners.Suite.runChild(Suite.java:128)
      	at org.junit.runners.Suite.runChild(Suite.java:24)
      	at org.junit.runners.ParentRunner$3.run(ParentRunner.java:231)
      	at java.util.concurrent.Executors$RunnableAdapter.call(Executors.java:439)
      	at java.util.concurrent.FutureTask$Sync.innerRun(FutureTask.java:303)
      	at java.util.concurrent.FutureTask.run(FutureTask.java:138)
      	at java.util.concurrent.ThreadPoolExecutor$Worker.runTask(ThreadPoolExecutor.java:895)
      	at java.util.concurrent.ThreadPoolExecutor$Worker.run(ThreadPoolExecutor.java:918)
      	at java.lang.Thread.run(Thread.java:695)
      

      Looks like the problem is that Hadoop's Configuration is printing out the <source> tags

        Attachments

        1. OOZIE-1711.patch
          2 kB
          Robert Kanter

          Issue Links

            Activity

              People

              • Assignee:
                rkanter Robert Kanter
                Reporter:
                rkanter Robert Kanter
              • Votes:
                0 Vote for this issue
                Watchers:
                2 Start watching this issue

                Dates

                • Created:
                  Updated:
                  Resolved: