Uploaded image for project: 'Jackrabbit Oak'
  1. Jackrabbit Oak
  2. OAK-9732

oak-it-osgi ITs broken on Windows

Attach filesAttach ScreenshotVotersWatch issueWatchersCreate sub-taskLinkCloneUpdate Comment AuthorReplace String in CommentUpdate Comment VisibilityDelete Comments
    XMLWordPrintableJSON

Details

    • Bug
    • Status: Closed
    • Blocker
    • Resolution: Fixed
    • None
    • 1.44.0
    • it, osgi
    • None

    Description

      ITs for oak-it-osgi fail with:

      ERROR] Tests run: 1, Failures: 0, Errors: 1, Skipped: 0, Time elapsed: 198.133 s <<< FAILURE! - in org.apache.jackrabbit.oak.osgi.OSGiIT
      [ERROR] org.apache.jackrabbit.oak.osgi.OSGiIT  Time elapsed: 187.896 s  <<< ERROR!
      org.ops4j.pax.exam.TestContainerException: start level 5 has not been reached within 180000 ms
              at
      

      git bisect identified the commit below as breaking it:

      commit 268fe493bbe7796ed366535147e7874de02d807e (refs/bisect/bad)
      Author: Carlo Jelmini <jelmini@adobe.com>
      Date:   Mon Jan 24 18:32:49 2022 +0100
      
          Move PaxExam dependencies to dependencyManagement; fix oak-it-osgi
      
      

      Attachments

        Issue Links

        Activity

          This comment will be Viewable by All Users Viewable by All Users
          Cancel

          People

            Unassigned Unassigned
            reschke Julian Reschke
            Votes:
            0 Vote for this issue
            Watchers:
            2 Start watching this issue

            Dates

              Created:
              Updated:
              Resolved:

              Slack

                Issue deployment