Uploaded image for project: 'Jackrabbit Oak'
  1. Jackrabbit Oak
  2. OAK-9467

PersistentDiskCacheTest failures on JDK11

    XMLWordPrintableJSON

    Details

    • Type: Bug
    • Status: Open
    • Priority: Major
    • Resolution: Unresolved
    • Affects Version/s: None
    • Fix Version/s: None
    • Component/s: segment-azure, segment-tar
    • Labels:
      None

      Description

      When building Oak with JDK 11 the following error is reported for PersistentDiskCacheTest:

      [INFO] Running org.apache.jackrabbit.oak.segment.remote.persistentcache.PersistentDiskCacheTest
      [ERROR] Tests run: 6, Failures: 0, Errors: 1, Skipped: 0, Time elapsed: 4.782 s <<< FAILURE! - in org.apache.jackrabbit.oak.segment.remote.persistentcache.PersistentDiskCacheTest
      [ERROR] cleanupTest(org.apache.jackrabbit.oak.segment.remote.persistentcache.PersistentDiskCacheTest) Time elapsed: 1.464 s <<< ERROR!
      java.lang.IllegalArgumentException: Comparison method violates its general contract!
      	at org.apache.jackrabbit.oak.segment.remote.persistentcache.PersistentDiskCacheTest.cleanupTest(PersistentDiskCacheTest.java:92) 

      /cc Angela Schreiber

        Attachments

        1. OAK-9467.patch
          4 kB
          Miroslav Smiljanic

          Issue Links

            Activity

              People

              • Assignee:
                adulceanu Andrei Dulceanu
                Reporter:
                adulceanu Andrei Dulceanu
              • Votes:
                0 Vote for this issue
                Watchers:
                2 Start watching this issue

                Dates

                • Created:
                  Updated: