Uploaded image for project: 'Jackrabbit Oak'
  1. Jackrabbit Oak
  2. OAK-9086

Flaky test SegmentWriteQueueTest#testThreadInterruptedWhileAddigToQueue

    XMLWordPrintableJSON

    Details

    • Type: Bug
    • Status: Closed
    • Priority: Major
    • Resolution: Fixed
    • Affects Version/s: None
    • Fix Version/s: 1.32.0
    • Component/s: segment-azure, segment-tar
    • Labels:
      None

      Description

      From time to time this test fails with:

      [ERROR] Tests run: 5, Failures: 0, Errors: 1, Skipped: 0, Time elapsed: 7.965 s <<< FAILURE! - in org.apache.jackrabbit.oak.segment.remote.queue.SegmentWriteQueueTest
      [ERROR] testThreadInterruptedWhileAddigToQueue(org.apache.jackrabbit.oak.segment.remote.queue.SegmentWriteQueueTest)  Time elapsed: 1.162 s  <<< ERROR!
      java.lang.NullPointerException
              at org.apache.jackrabbit.oak.segment.remote.queue.SegmentWriteQueueTest.testThreadInterruptedWhileAddigToQueue(SegmentWriteQueueTest.java:89)[INFO] Running org.apache.jackrabbit.oak.segment.remote.RemoteBlobMetadataTest
      [INFO] Tests run: 3, Failures: 0, Errors: 0, Skipped: 0, Time elapsed: 0.002 s - in org.apache.jackrabbit.oak.segment.remote.RemoteBlobMetadataTest
      [INFO]
      [INFO] Results:
      [INFO]
      [ERROR] Errors:
      [ERROR]   SegmentWriteQueueTest.testThreadInterruptedWhileAddigToQueue:89 NullPointer 

        Attachments

        1. OAK-9086.patch
          1 kB
          Miroslav Smiljanic

          Activity

            People

            • Assignee:
              adulceanu Andrei Dulceanu
              Reporter:
              adulceanu Andrei Dulceanu
            • Votes:
              0 Vote for this issue
              Watchers:
              2 Start watching this issue

              Dates

              • Created:
                Updated:
                Resolved: