Uploaded image for project: 'Jackrabbit Oak'
  1. Jackrabbit Oak
  2. OAK-8885

Test failure: NPE in MongoFixture.createDocumentStore()

    XMLWordPrintableJSON

    Details

      Description

      No description is provided

      The build Jackrabbit Oak #2595 has failed.
      First failed run: Jackrabbit Oak #2595 console log

      [ERROR] Errors: 
      [ERROR] org.apache.jackrabbit.oak.plugins.document.VersionGCSweepTest.oldSweepRevision[MongoFixture: MongoDB](org.apache.jackrabbit.oak.plugins.document.VersionGCSweepTest)
      [ERROR]   Run 1: VersionGCSweepTest.oldSweepRevision:50->manyChanges:89 » CommitFailed OakMerge...
      [ERROR]   Run 2: VersionGCSweepTest>AbstractTwoNodeTest.tearDown:122 » IllegalState root node d...
      [INFO] 
      [ERROR]   RDBDocumentStoreTest.<init>:56->AbstractDocumentStoreTest.<init>:47 » Runtime ...
      [ERROR]   RDBDocumentStoreTest.<init>:56->AbstractDocumentStoreTest.<init>:47 » Runtime ...
      [INFO] 
      [ERROR] Tests run: 1441, Failures: 0, Errors: 3, Skipped: 102
      

        Attachments

        1. Jackrabbit-Oak-2595-unit-tests.log.zip
          625 kB
          Marcel Reutegger
        2. Jackrabbit-Oak-matrix-2606-unit-tests.log.zip
          150 kB
          Marcel Reutegger

          Activity

            People

            • Assignee:
              mreutegg Marcel Reutegger
              Reporter:
              hudson Hudson
            • Votes:
              0 Vote for this issue
              Watchers:
              2 Start watching this issue

              Dates

              • Created:
                Updated:
                Resolved: