Uploaded image for project: 'Jackrabbit Oak'
  1. Jackrabbit Oak
  2. OAK-7407

oak-solr-core test failures with java 10

    XMLWordPrintableJSON

    Details

    • Type: Task
    • Status: Closed
    • Priority: Major
    • Resolution: Fixed
    • Affects Version/s: None
    • Fix Version/s: 1.9.0, 1.10.0, 1.8.6
    • Component/s: solr
    • Labels:
      None

      Description

      [ERROR] Tests run: 29, Failures: 2, Errors: 0, Skipped: 2, Time elapsed: 156.134 s <<< FAILURE! - in org.apache.jackrabbit.oak.plugins.index.solr.query.SolrIndexIT
      [ERROR] testNativeMLTQueryWithStream(org.apache.jackrabbit.oak.plugins.index.solr.query.SolrIndexIT)  Time elapsed: 5.501 s  <<< FAILURE!
      org.junit.ComparisonFailure: expected:</test/[a]> but was:</test/[b]>
              at org.apache.jackrabbit.oak.plugins.index.solr.query.SolrIndexIT.testNativeMLTQueryWithStream(SolrIndexIT.java:281)
      
      [ERROR] testNativeMLTQuery(org.apache.jackrabbit.oak.plugins.index.solr.query.SolrIndexIT)  Time elapsed: 5.523 s  <<< FAILURE!
      org.junit.ComparisonFailure: expected:</test/[a]> but was:</test/[b]>
              at org.apache.jackrabbit.oak.plugins.index.solr.query.SolrIndexIT.testNativeMLTQuery(SolrIndexIT.java:259)
      
      

        Attachments

          Issue Links

            Activity

              People

              • Assignee:
                teofili Tommaso Teofili
                Reporter:
                reschke Julian Reschke
              • Votes:
                0 Vote for this issue
                Watchers:
                1 Start watching this issue

                Dates

                • Created:
                  Updated:
                  Resolved: