Uploaded image for project: 'Jackrabbit Oak'
  1. Jackrabbit Oak
  2. OAK-6288

Test failure: upgrade tests failing: Failed to copy content

    XMLWordPrintableJSON

    Details

      Description

      Jenkins CI failure: https://builds.apache.org/view/J/job/Jackrabbit%20Oak/

      The build Jackrabbit Oak #364 has failed.
      First failed run: Jackrabbit Oak #364 console log

      Failing tests:

          org.apache.jackrabbit.oak.upgrade.CopyCheckpointsTest.validateMigration[Suppress the warning]
          org.apache.jackrabbit.oak.upgrade.CopyCheckpointsTest.validateMigration[Source data store defined, checkpoints migrated]
          org.apache.jackrabbit.oak.upgrade.IgnoreMissingBinariesTest.validateMigration
          org.apache.jackrabbit.oak.upgrade.UpgradeOldSegmentTest.upgradeFrom10
          org.apache.jackrabbit.oak.upgrade.cli.SegmentTarToSegmentTest.validateMigration
          org.apache.jackrabbit.oak.upgrade.cli.SegmentToJdbcTest.validateMigration
          org.apache.jackrabbit.oak.upgrade.cli.SegmentToSegmentTarTest.validateMigration
          org.apache.jackrabbit.oak.upgrade.cli.SegmentToSegmentTarWithMissingDestinationDirectoryTest.validateMigration
          org.apache.jackrabbit.oak.upgrade.cli.SegmentToSegmentTest.validateMigration
          org.apache.jackrabbit.oak.upgrade.cli.SegmentToSegmentWithMissingDestinationDirectoryTest.validateMigration
          org.apache.jackrabbit.oak.upgrade.cli.blob.CopyBinariesTest.validateMigration[Copy references, no blobstores defined, segment -> segment]
          org.apache.jackrabbit.oak.upgrade.cli.blob.CopyBinariesTest.validateMigration[Copy references, no blobstores defined, segment-tar -> segment-tar]
          org.apache.jackrabbit.oak.upgrade.cli.blob.CopyBinariesTest.validateMigration[Copy references, no blobstores defined, segment -> segment-tar]
          org.apache.jackrabbit.oak.upgrade.cli.blob.CopyBinariesTest.validateMigration[Copy embedded to embedded, no blobstores defined]
          org.apache.jackrabbit.oak.upgrade.cli.blob.CopyBinariesTest.validateMigration[Copy embedded to external, no blobstores defined]
          org.apache.jackrabbit.oak.upgrade.cli.blob.CopyBinariesTest.validateMigration[Copy references, src blobstore defined]
          org.apache.jackrabbit.oak.upgrade.cli.blob.CopyBinariesTest.validateMigration[Copy external to embedded, src blobstore defined]
          org.apache.jackrabbit.oak.upgrade.cli.blob.CopyBinariesTest.validateMigration[Copy external to external, src blobstore defined]
          org.apache.jackrabbit.oak.upgrade.cli.blob.FbsToFbsTest.validateMigration
          org.apache.jackrabbit.oak.upgrade.cli.blob.FbsToFdsTest.validateMigration
          org.apache.jackrabbit.oak.upgrade.cli.blob.FdsToFbsTest.validateMigration
      

      All seem to fail with

      [ERROR] Tests run: 1, Failures: 0, Errors: 1, Skipped: 0, Time elapsed: 3.737 s <<< FAILURE! - in org.apache.jackrabbit.oak.upgrade.cli.SegmentTarToSegmentTest
      [ERROR] validateMigration(org.apache.jackrabbit.oak.upgrade.cli.SegmentTarToSegmentTest)  Time elapsed: 3.73 s  <<< ERROR!
      java.lang.RuntimeException: javax.jcr.RepositoryException: Failed to copy content
      Caused by: javax.jcr.RepositoryException: Failed to copy content
      Caused by: java.lang.IllegalArgumentException
      

        Attachments

          Issue Links

            Activity

              People

              • Assignee:
                Unassigned
                Reporter:
                hudson Hudson
              • Votes:
                0 Vote for this issue
                Watchers:
                1 Start watching this issue

                Dates

                • Created:
                  Updated: